servicemix-commits mailing list archives

Site index · List index
Message view « Date » · « Thread »
Top « Date » · « Thread »
From Apache Hudson Server <hud...@hudson.apache.org>
Subject Build failed in Hudson: ServiceMix-NMR-Deploy #93
Date Tue, 19 Oct 2010 03:39:57 GMT
See <https://hudson.apache.org/hudson/job/ServiceMix-NMR-Deploy/93/changes>

Changes:

[gertv] SMX4NMR-227: ChannelImpl#testChangeThreadNameForSyncExchange fails on some CI build
boxes

------------------------------------------
Started by upstream project "ServiceMix-NMR" build number 224
Building remotely on ubuntu2
Updating http://svn.apache.org/repos/asf/servicemix/smx4/nmr/trunk
U         nmr/osgi/src/main/resources/OSGI-INF/blueprint/servicemix-nmr.xml
U         nmr/core/src/test/java/org/apache/servicemix/nmr/core/ChannelImplTest.java
U         nmr/management/src/main/java/org/apache/servicemix/nmr/management/ManagementAgent.java
At revision 1024102
Parsing POMs
[smx4-nmr] $ /home/hudson/tools/java/latest1.5/bin/java -da -dsa -XX:MaxPermSize=192m -Xmx512M
-cp /home/hudson/hudson-slave/maven-agent.jar:/home/hudson/tools/maven/apache-maven-2.2.1/boot/classworlds-1.1.jar
hudson.maven.agent.Main /home/hudson/tools/maven/apache-maven-2.2.1 /home/hudson/hudson-slave/slave.jar
/home/hudson/hudson-slave/maven-interceptor.jar 53177 /home/hudson/hudson-slave/maven2.1-interceptor.jar
<===[HUDSON REMOTING CAPACITY]===>channel started
   + Error stacktraces are turned on.
Executing Maven:  -B -f <https://hudson.apache.org/hudson/job/ServiceMix-NMR-Deploy/ws/smx4-nmr/pom.xml>
-Dmaven.repo.local=<https://hudson.apache.org/hudson/job/ServiceMix-NMR-Deploy/ws/.repository>
-fae -U -B -e -Dmaven.test.skip.exec=true -Dtest=false clean package source:jar deploy
[INFO] Scanning for projects...
[INFO] ------------------------------------------------------------------------
[ERROR] FATAL ERROR
[INFO] ------------------------------------------------------------------------
[INFO] Failed to resolve artifact.

GroupId: org.apache.servicemix
ArtifactId: servicemix-pom
Version: 5-SNAPSHOT

Reason: Unable to download the artifact from any repository

  org.apache.servicemix:servicemix-pom:pom:5-SNAPSHOT

from the specified remote repositories:
  central (http://repo1.maven.org/maven2),
  java.net.m2 (http://download.java.net/maven/2)



[INFO] ------------------------------------------------------------------------
[INFO] Trace
org.apache.maven.reactor.MavenExecutionException: Cannot find parent: org.apache.servicemix:servicemix-pom
for project: org.apache.servicemix.nmr:nmr-parent:pom:1.3.0-SNAPSHOT for project org.apache.servicemix.nmr:nmr-parent:pom:1.3.0-SNAPSHOT
	at org.apache.maven.DefaultMaven.getProjects(DefaultMaven.java:404)
	at org.apache.maven.DefaultMaven.doExecute(DefaultMaven.java:272)
	at org.apache.maven.DefaultMaven.execute(DefaultMaven.java:138)
	at org.apache.maven.cli.MavenCli.main(MavenCli.java:362)
	at sun.reflect.NativeMethodAccessorImpl.invoke0(Native Method)
	at sun.reflect.NativeMethodAccessorImpl.invoke(NativeMethodAccessorImpl.java:39)
	at sun.reflect.DelegatingMethodAccessorImpl.invoke(DelegatingMethodAccessorImpl.java:25)
	at java.lang.reflect.Method.invoke(Method.java:592)
	at org.codehaus.classworlds.Launcher.launchEnhanced(Launcher.java:315)
	at org.codehaus.classworlds.Launcher.launch(Launcher.java:255)
	at hudson.maven.agent.Main.launch(Main.java:165)
	at hudson.maven.MavenBuilder.call(MavenBuilder.java:165)
	at hudson.maven.MavenModuleSetBuild$Builder.call(MavenModuleSetBuild.java:694)
	at hudson.maven.MavenModuleSetBuild$Builder.call(MavenModuleSetBuild.java:638)
	at hudson.remoting.UserRequest.perform(UserRequest.java:114)
	at hudson.remoting.UserRequest.perform(UserRequest.java:48)
	at hudson.remoting.Request$2.run(Request.java:270)
	at java.util.concurrent.Executors$RunnableAdapter.call(Executors.java:417)
	at java.util.concurrent.FutureTask$Sync.innerRun(FutureTask.java:269)
	at java.util.concurrent.FutureTask.run(FutureTask.java:123)
	at java.util.concurrent.ThreadPoolExecutor$Worker.runTask(ThreadPoolExecutor.java:651)
	at java.util.concurrent.ThreadPoolExecutor$Worker.run(ThreadPoolExecutor.java:676)
	at java.lang.Thread.run(Thread.java:595)
Caused by: org.apache.maven.project.ProjectBuildingException: Cannot find parent: org.apache.servicemix:servicemix-pom
for project: org.apache.servicemix.nmr:nmr-parent:pom:1.3.0-SNAPSHOT for project org.apache.servicemix.nmr:nmr-parent:pom:1.3.0-SNAPSHOT
	at org.apache.maven.project.DefaultMavenProjectBuilder.assembleLineage(DefaultMavenProjectBuilder.java:1396)
	at org.apache.maven.project.DefaultMavenProjectBuilder.buildInternal(DefaultMavenProjectBuilder.java:823)
	at org.apache.maven.project.DefaultMavenProjectBuilder.buildFromSourceFileInternal(DefaultMavenProjectBuilder.java:508)
	at org.apache.maven.project.DefaultMavenProjectBuilder.build(DefaultMavenProjectBuilder.java:200)
	at org.apache.maven.DefaultMaven.getProject(DefaultMaven.java:604)
	at org.apache.maven.DefaultMaven.collectProjects(DefaultMaven.java:487)
	at org.apache.maven.DefaultMaven.getProjects(DefaultMaven.java:391)
	... 22 more
Caused by: org.apache.maven.project.ProjectBuildingException: POM 'org.apache.servicemix:servicemix-pom'
not found in repository: Unable to download the artifact from any repository

  org.apache.servicemix:servicemix-pom:pom:5-SNAPSHOT

from the specified remote repositories:
  central (http://repo1.maven.org/maven2),
  java.net.m2 (http://download.java.net/maven/2)

 for project org.apache.servicemix:servicemix-pom
	at org.apache.maven.project.DefaultMavenProjectBuilder.findModelFromRepository(DefaultMavenProjectBuilder.java:605)
	at org.apache.maven.project.DefaultMavenProjectBuilder.assembleLineage(DefaultMavenProjectBuilder.java:1392)
	... 28 more
Caused by: org.apache.maven.artifact.resolver.ArtifactNotFoundException: Unable to download
the artifact from any repository

  org.apache.servicemix:servicemix-pom:pom:5-SNAPSHOT

from the specified remote repositories:
  central (http://repo1.maven.org/maven2),
  java.net.m2 (http://download.java.net/maven/2)


	at org.apache.maven.artifact.resolver.DefaultArtifactResolver.resolve(DefaultArtifactResolver.java:228)
	at org.apache.maven.artifact.resolver.DefaultArtifactResolver.resolve(DefaultArtifactResolver.java:90)
	at org.apache.maven.project.DefaultMavenProjectBuilder.findModelFromRepository(DefaultMavenProjectBuilder.java:558)
	... 29 more
Caused by: org.apache.maven.wagon.ResourceDoesNotExistException: Unable to download the artifact
from any repository
	at org.apache.maven.artifact.manager.DefaultWagonManager.getArtifact(DefaultWagonManager.java:404)
	at org.apache.maven.artifact.resolver.DefaultArtifactResolver.resolve(DefaultArtifactResolver.java:216)
	... 31 more
[INFO] ------------------------------------------------------------------------
[INFO] Total time: < 1 second
[INFO] Finished at: Tue Oct 19 03:39:56 UTC 2010
[INFO] Final Memory: 2M/13M
[INFO] ------------------------------------------------------------------------
channel stopped


Mime
View raw message