servicemix-commits mailing list archives

Site index · List index
Message view « Date » · « Thread »
Top « Date » · « Thread »
From Apache Hudson Server <hud...@hudson.apache.org>
Subject Build failed in Hudson: ServiceMix3 » ServiceMix :: Core #100
Date Tue, 12 Oct 2010 23:11:23 GMT
See <https://hudson.apache.org/hudson/job/ServiceMix3/org.apache.servicemix$servicemix-core/100/changes>

Changes:

[lhein] fixed some checkstyle errors

[lhein] - assembly lib folder will now ship fusesource management lib
- mbean server is injected into the executorfactoryimpl via servicemix.xml

------------------------------------------
[INFO] ------------------------------------------------------------------------
[INFO] Building ServiceMix :: Core
[INFO]    task-segment: [clean, install]
[INFO] ------------------------------------------------------------------------
[INFO] [clean:clean {execution: default-clean}]
[INFO] Deleting file set: <https://hudson.apache.org/hudson/job/ServiceMix3/org.apache.servicemix$servicemix-core/ws/target>
(included: [**], excluded: [])
[INFO] snapshot org.apache.servicemix:servicemix-utils:1.3.0-SNAPSHOT: checking for updates
from java.net
[INFO] snapshot org.apache.servicemix:servicemix-utils:1.3.0-SNAPSHOT: checking for updates
from servicemix.m2
[INFO] snapshot org.apache.servicemix:servicemix-utils:1.3.0-SNAPSHOT: checking for updates
from apache.incubating
[INFO] snapshot org.apache.servicemix:servicemix-utils:1.3.0-SNAPSHOT: checking for updates
from codehaus
[INFO] snapshot org.apache.servicemix:servicemix-utils:1.3.0-SNAPSHOT: checking for updates
from apache.snapshots
Downloading: http://repository.apache.org/snapshots/org/apache/servicemix/servicemix-utils/1.3.0-SNAPSHOT/servicemix-utils-1.3.0-SNAPSHOT.pom
13K downloaded  (servicemix-utils-1.3.0-SNAPSHOT.pom)
Downloading: http://download.java.net/maven/2//org/apache/servicemix/specs/org.apache.servicemix.specs.locator/1.5.0/org.apache.servicemix.specs.locator-1.5.0.pom
[INFO] Unable to find resource 'org.apache.servicemix.specs:org.apache.servicemix.specs.locator:pom:1.5.0'
in repository java.net (http://download.java.net/maven/2/)
Downloading: http://svn.apache.org/repos/asf/servicemix/m2-repo//org/apache/servicemix/specs/org.apache.servicemix.specs.locator/1.5.0/org.apache.servicemix.specs.locator-1.5.0.pom
[INFO] Unable to find resource 'org.apache.servicemix.specs:org.apache.servicemix.specs.locator:pom:1.5.0'
in repository servicemix.m2 (http://svn.apache.org/repos/asf/servicemix/m2-repo/)
Downloading: http://people.apache.org/repo/m2-incubating-repository/org/apache/servicemix/specs/org.apache.servicemix.specs.locator/1.5.0/org.apache.servicemix.specs.locator-1.5.0.pom
[INFO] Unable to find resource 'org.apache.servicemix.specs:org.apache.servicemix.specs.locator:pom:1.5.0'
in repository apache.incubating (http://people.apache.org/repo/m2-incubating-repository)
Downloading: http://repository.codehaus.org/org/apache/servicemix/specs/org.apache.servicemix.specs.locator/1.5.0/org.apache.servicemix.specs.locator-1.5.0.pom
[INFO] Unable to find resource 'org.apache.servicemix.specs:org.apache.servicemix.specs.locator:pom:1.5.0'
in repository codehaus (http://repository.codehaus.org)
Downloading: http://repo1.maven.org/maven2/org/apache/servicemix/specs/org.apache.servicemix.specs.locator/1.5.0/org.apache.servicemix.specs.locator-1.5.0.pom

Downloading: http://download.java.net/maven/2//org/apache/servicemix/specs/specs/1.5.0/specs-1.5.0.pom
[INFO] Unable to find resource 'org.apache.servicemix.specs:specs:pom:1.5.0' in repository
java.net (http://download.java.net/maven/2/)
Downloading: http://svn.apache.org/repos/asf/servicemix/m2-repo//org/apache/servicemix/specs/specs/1.5.0/specs-1.5.0.pom
[INFO] Unable to find resource 'org.apache.servicemix.specs:specs:pom:1.5.0' in repository
servicemix.m2 (http://svn.apache.org/repos/asf/servicemix/m2-repo/)
Downloading: http://people.apache.org/repo/m2-incubating-repository/org/apache/servicemix/specs/specs/1.5.0/specs-1.5.0.pom
[INFO] Unable to find resource 'org.apache.servicemix.specs:specs:pom:1.5.0' in repository
apache.incubating (http://people.apache.org/repo/m2-incubating-repository)
Downloading: http://repository.codehaus.org/org/apache/servicemix/specs/specs/1.5.0/specs-1.5.0.pom
[INFO] Unable to find resource 'org.apache.servicemix.specs:specs:pom:1.5.0' in repository
codehaus (http://repository.codehaus.org)
Downloading: http://repo1.maven.org/maven2/org/apache/servicemix/specs/specs/1.5.0/specs-1.5.0.pom

Downloading: http://repository.apache.org/snapshots/org/apache/servicemix/servicemix-utils/1.3.0-SNAPSHOT/servicemix-utils-1.3.0-SNAPSHOT.jar
Downloading: http://download.java.net/maven/2//org/apache/servicemix/specs/org.apache.servicemix.specs.locator/1.5.0/org.apache.servicemix.specs.locator-1.5.0.jar
[INFO] Unable to find resource 'org.apache.servicemix.specs:org.apache.servicemix.specs.locator:jar:1.5.0'
in repository java.net (http://download.java.net/maven/2/)
Downloading: http://svn.apache.org/repos/asf/servicemix/m2-repo//org/apache/servicemix/specs/org.apache.servicemix.specs.locator/1.5.0/org.apache.servicemix.specs.locator-1.5.0.jar
196K downloaded  (servicemix-utils-1.3.0-SNAPSHOT.jar)
[INFO] Unable to find resource 'org.apache.servicemix.specs:org.apache.servicemix.specs.locator:jar:1.5.0'
in repository servicemix.m2 (http://svn.apache.org/repos/asf/servicemix/m2-repo/)
Downloading: http://people.apache.org/repo/m2-incubating-repository/org/apache/servicemix/specs/org.apache.servicemix.specs.locator/1.5.0/org.apache.servicemix.specs.locator-1.5.0.jar
[INFO] Unable to find resource 'org.apache.servicemix.specs:org.apache.servicemix.specs.locator:jar:1.5.0'
in repository apache.incubating (http://people.apache.org/repo/m2-incubating-repository)
Downloading: http://repository.codehaus.org/org/apache/servicemix/specs/org.apache.servicemix.specs.locator/1.5.0/org.apache.servicemix.specs.locator-1.5.0.jar
[INFO] Unable to find resource 'org.apache.servicemix.specs:org.apache.servicemix.specs.locator:jar:1.5.0'
in repository codehaus (http://repository.codehaus.org)
Downloading: http://repo1.maven.org/maven2/org/apache/servicemix/specs/org.apache.servicemix.specs.locator/1.5.0/org.apache.servicemix.specs.locator-1.5.0.jar

[INFO] [checkstyle:checkstyle {execution: validate}]
[INFO] Starting audit...
<https://hudson.apache.org/hudson/job/ServiceMix3/org.apache.servicemix$servicemix-core/ws/src/main/java/org/apache/servicemix/jbi/container/JBIContainer.java>:84:
Wrong order for 'org.w3c.dom.DocumentFragment' import.
Audit done.

[HUDSON] Archiving <https://hudson.apache.org/hudson/job/ServiceMix3/org.apache.servicemix$servicemix-core/ws/pom.xml>
to /home/hudson/hudson/jobs/ServiceMix3/modules/org.apache.servicemix$servicemix-core/builds/2010-10-12_23-09-55/archive/org.apache.servicemix/servicemix-core/3.3.3-SNAPSHOT/pom.xml
[INFO] ------------------------------------------------------------------------
[ERROR] BUILD ERROR
[INFO] ------------------------------------------------------------------------
[INFO] An error has occurred in Checkstyle report generation.

Embedded error: There are 1 checkstyle errors.
[INFO] ------------------------------------------------------------------------
[INFO] Trace
org.apache.maven.lifecycle.LifecycleExecutionException: An error has occurred in Checkstyle
report generation.
	at org.apache.maven.lifecycle.DefaultLifecycleExecutor.executeGoals(DefaultLifecycleExecutor.java:719)
	at org.apache.maven.lifecycle.DefaultLifecycleExecutor.executeGoalWithLifecycle(DefaultLifecycleExecutor.java:556)
	at org.apache.maven.lifecycle.DefaultLifecycleExecutor.executeGoal(DefaultLifecycleExecutor.java:535)
	at org.apache.maven.lifecycle.DefaultLifecycleExecutor.executeGoalAndHandleFailures(DefaultLifecycleExecutor.java:387)
	at org.apache.maven.lifecycle.DefaultLifecycleExecutor.executeTaskSegments(DefaultLifecycleExecutor.java:348)
	at org.apache.maven.lifecycle.DefaultLifecycleExecutor.execute(DefaultLifecycleExecutor.java:180)
	at org.apache.maven.lifecycle.LifecycleExecutorInterceptor.execute(LifecycleExecutorInterceptor.java:65)
	at org.apache.maven.DefaultMaven.doExecute(DefaultMaven.java:328)
	at org.apache.maven.DefaultMaven.execute(DefaultMaven.java:138)
	at org.apache.maven.cli.MavenCli.main(MavenCli.java:362)
	at sun.reflect.NativeMethodAccessorImpl.invoke0(Native Method)
	at sun.reflect.NativeMethodAccessorImpl.invoke(NativeMethodAccessorImpl.java:39)
	at sun.reflect.DelegatingMethodAccessorImpl.invoke(DelegatingMethodAccessorImpl.java:25)
	at java.lang.reflect.Method.invoke(Method.java:592)
	at org.codehaus.classworlds.Launcher.launchEnhanced(Launcher.java:315)
	at org.codehaus.classworlds.Launcher.launch(Launcher.java:255)
	at hudson.maven.agent.Main.launch(Main.java:165)
	at hudson.maven.MavenBuilder.call(MavenBuilder.java:165)
	at hudson.maven.MavenModuleSetBuild$Builder.call(MavenModuleSetBuild.java:694)
	at hudson.maven.MavenModuleSetBuild$Builder.call(MavenModuleSetBuild.java:638)
	at hudson.remoting.UserRequest.perform(UserRequest.java:114)
	at hudson.remoting.UserRequest.perform(UserRequest.java:48)
	at hudson.remoting.Request$2.run(Request.java:270)
	at java.util.concurrent.Executors$RunnableAdapter.call(Executors.java:417)
	at java.util.concurrent.FutureTask$Sync.innerRun(FutureTask.java:269)
	at java.util.concurrent.FutureTask.run(FutureTask.java:123)
	at java.util.concurrent.ThreadPoolExecutor$Worker.runTask(ThreadPoolExecutor.java:651)
	at java.util.concurrent.ThreadPoolExecutor$Worker.run(ThreadPoolExecutor.java:676)
	at java.lang.Thread.run(Thread.java:595)
Caused by: org.apache.maven.plugin.MojoExecutionException: An error has occurred in Checkstyle
report generation.
	at org.apache.maven.reporting.AbstractMavenReport.execute(AbstractMavenReport.java:79)
	at org.apache.maven.plugin.DefaultPluginManager.executeMojo(DefaultPluginManager.java:490)
	at hudson.maven.agent.PluginManagerInterceptor.executeMojo(PluginManagerInterceptor.java:182)
	at org.apache.maven.lifecycle.DefaultLifecycleExecutor.executeGoals(DefaultLifecycleExecutor.java:694)
	... 28 more
Caused by: org.apache.maven.reporting.MavenReportException: There are 1 checkstyle errors.
	at org.apache.maven.plugin.checkstyle.CheckstyleReport.executeCheckstyle(CheckstyleReport.java:955)
	at org.apache.maven.plugin.checkstyle.CheckstyleReport.executeReport(CheckstyleReport.java:635)
	at org.apache.maven.reporting.AbstractMavenReport.generate(AbstractMavenReport.java:98)
	at org.apache.maven.reporting.AbstractMavenReport.execute(AbstractMavenReport.java:73)
	... 31 more
[INFO] ------------------------------------------------------------------------
[INFO] Total time: 1 minute 17 seconds
[INFO] Finished at: Tue Oct 12 23:11:22 UTC 2010
[INFO] Final Memory: 73M/107M
[INFO] ------------------------------------------------------------------------


Mime
View raw message