servicemix-commits mailing list archives

Site index · List index
Message view « Date » · « Thread »
Top « Date » · « Thread »
From Apache Hudson Server <hud...@hudson.apache.org>
Subject Build failed in Hudson: ServiceMix-Docs #15
Date Tue, 19 Oct 2010 13:24:40 GMT
See <https://hudson.apache.org/hudson/job/ServiceMix-Docs/15/changes>

Changes:

[gertv] Fix build - attaching manual.pdf instead

------------------------------------------
Started by an SCM change
Building remotely on ubuntu1
Updating http://svn.apache.org/repos/asf/servicemix/documentation/trunk
U         pom.xml
At revision 1024228
Parsing POMs
[smx-docs] $ /home/hudson/tools/java/latest1.5/bin/java -da -dsa -XX:MaxPermSize=192m -Xmx512M
-cp /home/hudson/hudson-slave/maven-agent.jar:/home/hudson/tools/maven/apache-maven-2.2.1/boot/classworlds-1.1.jar
hudson.maven.agent.Main /home/hudson/tools/maven/apache-maven-2.2.1 /home/hudson/hudson-slave/slave.jar
/home/hudson/hudson-slave/maven-interceptor.jar 57077 /home/hudson/hudson-slave/maven2.1-interceptor.jar
<===[HUDSON REMOTING CAPACITY]===>channel started
   + Error stacktraces are turned on.
Executing Maven:  -B -f <https://hudson.apache.org/hudson/job/ServiceMix-Docs/ws/smx-docs/pom.xml>
-Dmaven.repo.local=<https://hudson.apache.org/hudson/job/ServiceMix-Docs/ws/.repository>
-B -e clean install
[INFO] Scanning for projects...
[INFO] ------------------------------------------------------------------------
[INFO] Building Apache ServiceMix Documentation
[INFO]    task-segment: [clean, install]
[INFO] ------------------------------------------------------------------------
[INFO] [clean:clean {execution: default-clean}]
[INFO] Deleting file set: <https://hudson.apache.org/hudson/job/ServiceMix-Docs/ws/smx-docs/target>
(included: [**], excluded: [])
[INFO] Setting property: classpath.resource.loader.class => 'org.codehaus.plexus.velocity.ContextClassLoaderResourceLoader'.
[INFO] Setting property: velocimacro.messages.on => 'false'.
[INFO] Setting property: resource.loader => 'classpath'.
[INFO] Setting property: resource.manager.logwhenfound => 'false'.
[INFO] [remote-resources:process {execution: default}]
[INFO] [dependency:unpack {execution: unpack-karaf-manual}]
[INFO] Configured Artifact: org.apache.karaf:org.apache.karaf.doc:2.1.99-SNAPSHOT:war
[INFO] snapshot org.apache.karaf:org.apache.karaf.doc:2.1.99-SNAPSHOT: checking for updates
from servicemix.m2
[INFO] snapshot org.apache.karaf:org.apache.karaf.doc:2.1.99-SNAPSHOT: checking for updates
from apache.incubating
[INFO] snapshot org.apache.karaf:org.apache.karaf.doc:2.1.99-SNAPSHOT: checking for updates
from codehaus
[INFO] snapshot org.apache.karaf:org.apache.karaf.doc:2.1.99-SNAPSHOT: checking for updates
from apache.snapshots
[INFO] Unpacking <https://hudson.apache.org/hudson/job/ServiceMix-Docs/ws/.repository/org/apache/karaf/org.apache.karaf.doc/2.1.99-SNAPSHOT/org.apache.karaf.doc-2.1.99-SNAPSHOT.warto>
 <https://hudson.apache.org/hudson/job/ServiceMix-Docs/ws/smx-docs/target/webapp/karaf>
with Includes developers-guide/*.conf,users-guide/*.conf and excludes:null
[INFO] [dependency:unpack {execution: unpack-karaf-commands}]
[INFO] Configured Artifact: org.apache.karaf:org.apache.karaf.doc:2.1.99-SNAPSHOT:war
[INFO] Unpacking <https://hudson.apache.org/hudson/job/ServiceMix-Docs/ws/.repository/org/apache/karaf/org.apache.karaf.doc/2.1.99-SNAPSHOT/org.apache.karaf.doc-2.1.99-SNAPSHOT.warto>
 <https://hudson.apache.org/hudson/job/ServiceMix-Docs/ws/smx-docs/target/webapp>
with Includes commands/*.conf and excludes:null
[INFO] [resources:copy-resources {execution: filter}]
[INFO] Using 'UTF-8' encoding to copy filtered resources.
[INFO] Copying 68 resources
[INFO] [resources:resources {execution: default-resources}]
[INFO] Using 'UTF-8' encoding to copy filtered resources.
[INFO] skip non existing resourceDirectory <https://hudson.apache.org/hudson/job/ServiceMix-Docs/ws/smx-docs/src/main/resources>
[INFO] Copying 3 resources
[INFO] [compiler:compile {execution: default-compile}]
[INFO] No sources to compile
[INFO] [scala:compile {execution: default}]
[INFO] Checking for multiple versions of scala
[INFO] includes = [**/*.scala,**/*.java,]
[INFO] excludes = []
[INFO] <https://hudson.apache.org/hudson/job/ServiceMix-Docs/ws/smx-docs/src/main/scala>:-1:
info: compiling
[INFO] Compiling 2 source files to <https://hudson.apache.org/hudson/job/ServiceMix-Docs/ws/smx-docs/target/classes>
at 1287494501840
[INFO] prepare-compile in 0 s
[INFO] compile in 4 s
[INFO] [bundle:manifest {execution: bundle-manifest}]
[WARNING] Warning in manifest for org.apache.servicemix:documentation:war:4.3.0-SNAPSHOT :
No sub JAR or directory WEB-INF/classes
[WARNING] Warning in manifest for org.apache.servicemix:documentation:war:4.3.0-SNAPSHOT :
No sub JAR or directory WEB-INF/lib/scalate-wikitext-1.3.jar
[WARNING] Warning in manifest for org.apache.servicemix:documentation:war:4.3.0-SNAPSHOT :
No sub JAR or directory WEB-INF/lib/confluence-core-1.0.jar
[WARNING] Warning in manifest for org.apache.servicemix:documentation:war:4.3.0-SNAPSHOT :
No sub JAR or directory WEB-INF/lib/scala-library-2.8.0.jar
[WARNING] Warning in manifest for org.apache.servicemix:documentation:war:4.3.0-SNAPSHOT :
No sub JAR or directory WEB-INF/lib/wikitext-core-1.0.jar
[WARNING] Warning in manifest for org.apache.servicemix:documentation:war:4.3.0-SNAPSHOT :
No sub JAR or directory WEB-INF/lib/ant-launcher-1.8.1.jar
[WARNING] Warning in manifest for org.apache.servicemix:documentation:war:4.3.0-SNAPSHOT :
No sub JAR or directory WEB-INF/lib/slf4j-api-1.6.0.jar
[WARNING] Warning in manifest for org.apache.servicemix:documentation:war:4.3.0-SNAPSHOT :
No sub JAR or directory WEB-INF/lib/logback-classic-0.9.24.jar
[WARNING] Warning in manifest for org.apache.servicemix:documentation:war:4.3.0-SNAPSHOT :
No sub JAR or directory WEB-INF/lib/scala-compiler-2.8.0.jar
[WARNING] Warning in manifest for org.apache.servicemix:documentation:war:4.3.0-SNAPSHOT :
No sub JAR or directory WEB-INF/lib/logback-core-0.9.24.jar
[WARNING] Warning in manifest for org.apache.servicemix:documentation:war:4.3.0-SNAPSHOT :
No sub JAR or directory WEB-INF/lib/scalate-core-1.3.jar
[WARNING] Warning in manifest for org.apache.servicemix:documentation:war:4.3.0-SNAPSHOT :
No sub JAR or directory WEB-INF/lib/ant-1.8.1.jar
[WARNING] Warning in manifest for org.apache.servicemix:documentation:war:4.3.0-SNAPSHOT :
Superfluous export-package instructions: [org.apache, org, org.apache.servicemix]
[INFO] [resources:testResources {execution: default-testResources}]
[INFO] Using 'UTF-8' encoding to copy filtered resources.
[INFO] skip non existing resourceDirectory <https://hudson.apache.org/hudson/job/ServiceMix-Docs/ws/smx-docs/src/test/resources>
[INFO] Copying 3 resources
[INFO] [compiler:testCompile {execution: default-testCompile}]
[INFO] No sources to compile
[INFO] [surefire:test {execution: default-test}]
[INFO] Surefire report directory: <https://hudson.apache.org/hudson/job/ServiceMix-Docs/ws/smx-docs/target/surefire-reports>

-------------------------------------------------------
 T E S T S
-------------------------------------------------------
There are no tests to run.

Results :

Tests run: 0, Failures: 0, Errors: 0, Skipped: 0

[HUDSON] Recording test results
[INFO] [war:war {execution: default-war}]
[INFO] Packaging webapp
[INFO] Assembling webapp [documentation] in [<https://hudson.apache.org/hudson/job/ServiceMix-Docs/ws/smx-docs/target/documentation-4.3.0-SNAPSHOT]>
[INFO] Processing war project
[INFO] Copying webapp resources [<https://hudson.apache.org/hudson/job/ServiceMix-Docs/ws/smx-docs/target/webapp]>
[INFO] Webapp assembled in [187 msecs]
[INFO] Building war: <https://hudson.apache.org/hudson/job/ServiceMix-Docs/ws/smx-docs/target/documentation-4.3.0-SNAPSHOT.war>
[INFO] WEB-INF/web.xml already added, skipping
[INFO] Preparing scalate:sitegen
[WARNING] Removing: sitegen from forked lifecycle, to prevent recursive invocation.
[HUDSON] Archiving <https://hudson.apache.org/hudson/job/ServiceMix-Docs/ws/smx-docs/pom.xml>
to /home/hudson/hudson/jobs/ServiceMix-Docs/modules/org.apache.servicemix$documentation/builds/2010-10-19_13-21-15/archive/org.apache.servicemix/documentation/4.3.0-SNAPSHOT/pom.xml
[HUDSON] Archiving <https://hudson.apache.org/hudson/job/ServiceMix-Docs/ws/smx-docs/target/documentation-4.3.0-SNAPSHOT.war>
to /home/hudson/hudson/jobs/ServiceMix-Docs/modules/org.apache.servicemix$documentation/builds/2010-10-19_13-21-15/archive/org.apache.servicemix/documentation/4.3.0-SNAPSHOT/documentation-4.3.0-SNAPSHOT.war
[INFO] [remote-resources:process {execution: default}]
[INFO] [dependency:unpack {execution: unpack-karaf-manual}]
[INFO] Configured Artifact: org.apache.karaf:org.apache.karaf.doc:2.1.99-SNAPSHOT:war
[INFO] org.apache.karaf.doc-2.1.99-SNAPSHOT.war already unpacked.
[INFO] [dependency:unpack {execution: unpack-karaf-commands}]
[INFO] Configured Artifact: org.apache.karaf:org.apache.karaf.doc:2.1.99-SNAPSHOT:war
[INFO] org.apache.karaf.doc-2.1.99-SNAPSHOT.war already unpacked.
[INFO] [resources:copy-resources {execution: filter}]
[INFO] Using 'UTF-8' encoding to copy filtered resources.
[INFO] Copying 68 resources
[INFO] [resources:resources {execution: default-resources}]
[INFO] Using 'UTF-8' encoding to copy filtered resources.
[INFO] skip non existing resourceDirectory <https://hudson.apache.org/hudson/job/ServiceMix-Docs/ws/smx-docs/src/main/resources>
[INFO] Copying 3 resources
[INFO] Copying 3 resources
[INFO] [compiler:compile {execution: default-compile}]
[INFO] Nothing to compile - all classes are up to date
[INFO] [scala:compile {execution: default}]
[INFO] Checking for multiple versions of scala
[INFO] Nothing to compile - all classes are up to date
[INFO] [bundle:manifest {execution: bundle-manifest}]
[WARNING] Warning in manifest for org.apache.servicemix:documentation:war:4.3.0-SNAPSHOT :
No sub JAR or directory WEB-INF/classes
[WARNING] Warning in manifest for org.apache.servicemix:documentation:war:4.3.0-SNAPSHOT :
No sub JAR or directory WEB-INF/lib/scalate-wikitext-1.3.jar
[WARNING] Warning in manifest for org.apache.servicemix:documentation:war:4.3.0-SNAPSHOT :
No sub JAR or directory WEB-INF/lib/confluence-core-1.0.jar
[WARNING] Warning in manifest for org.apache.servicemix:documentation:war:4.3.0-SNAPSHOT :
No sub JAR or directory WEB-INF/lib/scala-library-2.8.0.jar
[WARNING] Warning in manifest for org.apache.servicemix:documentation:war:4.3.0-SNAPSHOT :
No sub JAR or directory WEB-INF/lib/wikitext-core-1.0.jar
[WARNING] Warning in manifest for org.apache.servicemix:documentation:war:4.3.0-SNAPSHOT :
No sub JAR or directory WEB-INF/lib/ant-launcher-1.8.1.jar
[WARNING] Warning in manifest for org.apache.servicemix:documentation:war:4.3.0-SNAPSHOT :
No sub JAR or directory WEB-INF/lib/slf4j-api-1.6.0.jar
[WARNING] Warning in manifest for org.apache.servicemix:documentation:war:4.3.0-SNAPSHOT :
No sub JAR or directory WEB-INF/lib/logback-classic-0.9.24.jar
[WARNING] Warning in manifest for org.apache.servicemix:documentation:war:4.3.0-SNAPSHOT :
No sub JAR or directory WEB-INF/lib/scala-compiler-2.8.0.jar
[WARNING] Warning in manifest for org.apache.servicemix:documentation:war:4.3.0-SNAPSHOT :
No sub JAR or directory WEB-INF/lib/logback-core-0.9.24.jar
[WARNING] Warning in manifest for org.apache.servicemix:documentation:war:4.3.0-SNAPSHOT :
No sub JAR or directory WEB-INF/lib/scalate-core-1.3.jar
[WARNING] Warning in manifest for org.apache.servicemix:documentation:war:4.3.0-SNAPSHOT :
No sub JAR or directory WEB-INF/lib/ant-1.8.1.jar
[WARNING] Warning in manifest for org.apache.servicemix:documentation:war:4.3.0-SNAPSHOT :
Superfluous export-package instructions: [org.apache, org, org.apache.servicemix]
[INFO] [resources:testResources {execution: default-testResources}]
[INFO] Using 'UTF-8' encoding to copy filtered resources.
[INFO] skip non existing resourceDirectory <https://hudson.apache.org/hudson/job/ServiceMix-Docs/ws/smx-docs/src/test/resources>
[INFO] Copying 3 resources
[INFO] Copying 3 resources
[INFO] [compiler:testCompile {execution: default-testCompile}]
[INFO] No sources to compile
[INFO] [surefire:test {execution: default-test}]
[INFO] Surefire report directory: <https://hudson.apache.org/hudson/job/ServiceMix-Docs/ws/smx-docs/target/surefire-reports>

-------------------------------------------------------
 T E S T S
-------------------------------------------------------
There are no tests to run.

Results :

Tests run: 0, Failures: 0, Errors: 0, Skipped: 0

[HUDSON] Recording test results
[INFO] [war:war {execution: default-war}]
[INFO] Packaging webapp
[INFO] Assembling webapp [documentation] in [<https://hudson.apache.org/hudson/job/ServiceMix-Docs/ws/smx-docs/target/documentation-4.3.0-SNAPSHOT]>
[INFO] Processing war project
[INFO] Copying webapp resources [<https://hudson.apache.org/hudson/job/ServiceMix-Docs/ws/smx-docs/target/webapp]>
[INFO] Webapp assembled in [141 msecs]
[INFO] Building war: <https://hudson.apache.org/hudson/job/ServiceMix-Docs/ws/smx-docs/target/documentation-4.3.0-SNAPSHOT.war>
[INFO] WEB-INF/web.xml already added, skipping
[INFO] [antrun:run {execution: generate-pdf}]
[INFO] Executing tasks
     [echo] Generating PDF using Prince XML (http://www.princexml.com/)
[HUDSON] Re-archiving <https://hudson.apache.org/hudson/job/ServiceMix-Docs/ws/smx-docs/target/documentation-4.3.0-SNAPSHOT.war>
[INFO] ------------------------------------------------------------------------
[ERROR] BUILD ERROR
[INFO] ------------------------------------------------------------------------
[INFO] An Ant BuildException has occured: Execute failed: java.io.IOException: java.io.IOException:
prince: not found

[INFO] ------------------------------------------------------------------------
[INFO] Trace
org.apache.maven.lifecycle.LifecycleExecutionException: An Ant BuildException has occured:
Execute failed: java.io.IOException: java.io.IOException: prince: not found
	at org.apache.maven.lifecycle.DefaultLifecycleExecutor.executeGoals(DefaultLifecycleExecutor.java:719)
	at org.apache.maven.lifecycle.DefaultLifecycleExecutor.executeGoalWithLifecycle(DefaultLifecycleExecutor.java:556)
	at org.apache.maven.lifecycle.DefaultLifecycleExecutor.forkProjectLifecycle(DefaultLifecycleExecutor.java:1205)
	at org.apache.maven.lifecycle.DefaultLifecycleExecutor.forkLifecycle(DefaultLifecycleExecutor.java:1038)
	at org.apache.maven.lifecycle.DefaultLifecycleExecutor.executeGoals(DefaultLifecycleExecutor.java:643)
	at org.apache.maven.lifecycle.DefaultLifecycleExecutor.executeGoalWithLifecycle(DefaultLifecycleExecutor.java:556)
	at org.apache.maven.lifecycle.DefaultLifecycleExecutor.executeGoal(DefaultLifecycleExecutor.java:535)
	at org.apache.maven.lifecycle.DefaultLifecycleExecutor.executeGoalAndHandleFailures(DefaultLifecycleExecutor.java:387)
	at org.apache.maven.lifecycle.DefaultLifecycleExecutor.executeTaskSegments(DefaultLifecycleExecutor.java:348)
	at org.apache.maven.lifecycle.DefaultLifecycleExecutor.execute(DefaultLifecycleExecutor.java:180)
	at org.apache.maven.lifecycle.LifecycleExecutorInterceptor.execute(LifecycleExecutorInterceptor.java:65)
	at org.apache.maven.DefaultMaven.doExecute(DefaultMaven.java:328)
	at org.apache.maven.DefaultMaven.execute(DefaultMaven.java:138)
	at org.apache.maven.cli.MavenCli.main(MavenCli.java:362)
	at sun.reflect.NativeMethodAccessorImpl.invoke0(Native Method)
	at sun.reflect.NativeMethodAccessorImpl.invoke(NativeMethodAccessorImpl.java:39)
	at sun.reflect.DelegatingMethodAccessorImpl.invoke(DelegatingMethodAccessorImpl.java:25)
	at java.lang.reflect.Method.invoke(Method.java:592)
	at org.codehaus.classworlds.Launcher.launchEnhanced(Launcher.java:315)
	at org.codehaus.classworlds.Launcher.launch(Launcher.java:255)
	at hudson.maven.agent.Main.launch(Main.java:165)
	at hudson.maven.MavenBuilder.call(MavenBuilder.java:165)
	at hudson.maven.MavenModuleSetBuild$Builder.call(MavenModuleSetBuild.java:694)
	at hudson.maven.MavenModuleSetBuild$Builder.call(MavenModuleSetBuild.java:638)
	at hudson.remoting.UserRequest.perform(UserRequest.java:114)
	at hudson.remoting.UserRequest.perform(UserRequest.java:48)
	at hudson.remoting.Request$2.run(Request.java:270)
	at java.util.concurrent.Executors$RunnableAdapter.call(Executors.java:417)
	at java.util.concurrent.FutureTask$Sync.innerRun(FutureTask.java:269)
	at java.util.concurrent.FutureTask.run(FutureTask.java:123)
	at java.util.concurrent.ThreadPoolExecutor$Worker.runTask(ThreadPoolExecutor.java:651)
	at java.util.concurrent.ThreadPoolExecutor$Worker.run(ThreadPoolExecutor.java:676)
	at java.lang.Thread.run(Thread.java:595)
Caused by: org.apache.maven.plugin.MojoExecutionException: An Ant BuildException has occured:
Execute failed: java.io.IOException: java.io.IOException: prince: not found
	at org.apache.maven.plugin.antrun.AbstractAntMojo.executeTasks(AbstractAntMojo.java:131)
	at org.apache.maven.plugin.antrun.AntRunMojo.execute(AntRunMojo.java:98)
	at org.apache.maven.plugin.DefaultPluginManager.executeMojo(DefaultPluginManager.java:490)
	at hudson.maven.agent.PluginManagerInterceptor.executeMojo(PluginManagerInterceptor.java:182)
	at org.apache.maven.lifecycle.DefaultLifecycleExecutor.executeGoals(DefaultLifecycleExecutor.java:694)
	... 32 more
Caused by: Execute failed: java.io.IOException: java.io.IOException: prince: not found
	at org.apache.tools.ant.taskdefs.ExecTask.runExec(ExecTask.java:620)
	at org.apache.tools.ant.taskdefs.ExecTask.execute(ExecTask.java:452)
	at org.apache.tools.ant.UnknownElement.execute(UnknownElement.java:275)
	at org.apache.tools.ant.Task.perform(Task.java:364)
	at org.apache.tools.ant.Target.execute(Target.java:341)
	at org.apache.maven.plugin.antrun.AbstractAntMojo.executeTasks(AbstractAntMojo.java:118)
	... 36 more
Caused by: java.io.IOException: java.io.IOException: prince: not found
	at java.lang.UNIXProcess.<init>(UNIXProcess.java:148)
	at java.lang.ProcessImpl.start(ProcessImpl.java:65)
	at java.lang.ProcessBuilder.start(ProcessBuilder.java:451)
	at java.lang.Runtime.exec(Runtime.java:591)
	at sun.reflect.NativeMethodAccessorImpl.invoke0(Native Method)
	at sun.reflect.NativeMethodAccessorImpl.invoke(NativeMethodAccessorImpl.java:39)
	at sun.reflect.DelegatingMethodAccessorImpl.invoke(DelegatingMethodAccessorImpl.java:25)
	at java.lang.reflect.Method.invoke(Method.java:592)
	at org.apache.tools.ant.taskdefs.Execute$Java13CommandLauncher.exec(Execute.java:834)
	at org.apache.tools.ant.taskdefs.Execute.launch(Execute.java:435)
	at org.apache.tools.ant.taskdefs.Execute.execute(Execute.java:449)
	at org.apache.tools.ant.taskdefs.ExecTask.runExecute(ExecTask.java:576)
	at org.apache.tools.ant.taskdefs.ExecTask.runExec(ExecTask.java:617)
	... 41 more
[INFO] ------------------------------------------------------------------------
[INFO] Total time: 3 minutes 14 seconds
[INFO] Finished at: Tue Oct 19 13:24:40 UTC 2010
[INFO] Final Memory: 37M/72M
[INFO] ------------------------------------------------------------------------
Sending e-mails to: commits@servicemix.apache.org
channel stopped


Mime
View raw message