servicemix-commits mailing list archives

Site index · List index
Message view « Date » · « Thread »
Top « Date » · « Thread »
From Apache Hudson Server <hud...@hudson.apache.org>
Subject Build failed in Hudson: ServiceMix-Utils #34
Date Tue, 12 Oct 2010 20:03:58 GMT
See <https://hudson.apache.org/hudson/job/ServiceMix-Utils/34/changes>

Changes:

[lhein] setup mbeans for executors (see SM-2001 and SMX4-606)

------------------------------------------
Started by an SCM change
Building remotely on ubuntu2
Updating http://svn.apache.org/repos/asf/servicemix/utils/trunk
U         src/main/java/org/apache/servicemix/executors/impl/ExecutorImpl.java
U         src/main/java/org/apache/servicemix/executors/impl/ExecutorFactoryImpl.java
A         src/main/java/org/apache/servicemix/executors/impl/WrappedRejectedExecutionHandler.java
A         src/main/java/org/apache/servicemix/executors/impl/ManagedExecutor.java
A         src/main/java/org/apache/servicemix/executors/impl/ManagedExecutorMBean.java
U         pom.xml
At revision 1021902
Parsing POMs
[smx-utils] $ /home/hudson/tools/java/latest1.5/bin/java -da -dsa -XX:MaxPermSize=192m -Xmx512M
-cp /home/hudson/hudson-slave/maven-agent.jar:/home/hudson/tools/maven/apache-maven-2.2.1/boot/classworlds-1.1.jar
hudson.maven.agent.Main /home/hudson/tools/maven/apache-maven-2.2.1 /home/hudson/hudson-slave/slave.jar
/home/hudson/hudson-slave/maven-interceptor.jar 59513 /home/hudson/hudson-slave/maven2.1-interceptor.jar
channel started
<===[HUDSON REMOTING CAPACITY]===>   + Error stacktraces are turned on.
Executing Maven:  -B -f <https://hudson.apache.org/hudson/job/ServiceMix-Utils/ws/smx-utils/pom.xml>
-Dmaven.repo.local=<https://hudson.apache.org/hudson/job/ServiceMix-Utils/ws/.repository>
-B -e clean package source:jar install deploy
[INFO] Scanning for projects...
[INFO] Searching repository for plugin with prefix: 'source'.
[INFO] org.apache.maven.plugins: checking for updates from apache.snapshots
[INFO] org.codehaus.mojo: checking for updates from apache.snapshots
[INFO] ------------------------------------------------------------------------
[INFO] Building Apache ServiceMix :: Utils
[INFO]    task-segment: [clean, package, source:jar, install, deploy]
[INFO] ------------------------------------------------------------------------
[INFO] [clean:clean {execution: default-clean}]
[INFO] Deleting file set: <https://hudson.apache.org/hudson/job/ServiceMix-Utils/ws/smx-utils/target>
(included: [**], excluded: [])
[INFO] [dependency:copy {execution: copy-legal}]
[INFO] Configured Artifact: org.apache.servicemix.legal:legal:1.0:xml
[INFO] Copying legal-1.0.xml to <https://hudson.apache.org/hudson/job/ServiceMix-Utils/ws/smx-utils/target/legal/legal.xml>
Downloading: http://svn.apache.org/repos/asf/servicemix/m2-repo//org/fusesource/commonman/commons-management/1.0/commons-management-1.0.pom
[INFO] Unable to find resource 'org.fusesource.commonman:commons-management:pom:1.0' in repository
servicemix.m2 (http://svn.apache.org/repos/asf/servicemix/m2-repo/)
Downloading: http://people.apache.org/repo/m2-incubating-repository/org/fusesource/commonman/commons-management/1.0/commons-management-1.0.pom
[INFO] Unable to find resource 'org.fusesource.commonman:commons-management:pom:1.0' in repository
apache.incubating (http://people.apache.org/repo/m2-incubating-repository)
Downloading: http://repository.codehaus.org/org/fusesource/commonman/commons-management/1.0/commons-management-1.0.pom
[INFO] Unable to find resource 'org.fusesource.commonman:commons-management:pom:1.0' in repository
codehaus (http://repository.codehaus.org)
Downloading: http://repo1.maven.org/maven2/org/fusesource/commonman/commons-management/1.0/commons-management-1.0.pom

Downloading: http://svn.apache.org/repos/asf/servicemix/m2-repo//tranql/tranql-connector/1.2/tranql-connector-1.2.pom
[INFO] Unable to find resource 'tranql:tranql-connector:pom:1.2' in repository servicemix.m2
(http://svn.apache.org/repos/asf/servicemix/m2-repo/)
Downloading: http://people.apache.org/repo/m2-incubating-repository/tranql/tranql-connector/1.2/tranql-connector-1.2.pom
[INFO] Unable to find resource 'tranql:tranql-connector:pom:1.2' in repository apache.incubating
(http://people.apache.org/repo/m2-incubating-repository)
Downloading: http://repository.codehaus.org/tranql/tranql-connector/1.2/tranql-connector-1.2.pom
[INFO] Unable to find resource 'tranql:tranql-connector:pom:1.2' in repository codehaus (http://repository.codehaus.org)
Downloading: http://repo1.maven.org/maven2/tranql/tranql-connector/1.2/tranql-connector-1.2.pom
[INFO] Unable to find resource 'tranql:tranql-connector:pom:1.2' in repository central (http://repo1.maven.org/maven2)
Downloading: http://svn.apache.org/repos/asf/servicemix/m2-repo//org/fusesource/commonman/commons-management/1.0/commons-management-1.0.jar
[INFO] Unable to find resource 'org.fusesource.commonman:commons-management:jar:1.0' in repository
servicemix.m2 (http://svn.apache.org/repos/asf/servicemix/m2-repo/)
Downloading: http://people.apache.org/repo/m2-incubating-repository/org/fusesource/commonman/commons-management/1.0/commons-management-1.0.jar
[INFO] Unable to find resource 'org.fusesource.commonman:commons-management:jar:1.0' in repository
apache.incubating (http://people.apache.org/repo/m2-incubating-repository)
Downloading: http://repository.codehaus.org/org/fusesource/commonman/commons-management/1.0/commons-management-1.0.jar
[INFO] Unable to find resource 'org.fusesource.commonman:commons-management:jar:1.0' in repository
codehaus (http://repository.codehaus.org)
Downloading: http://repo1.maven.org/maven2/org/fusesource/commonman/commons-management/1.0/commons-management-1.0.jar

[INFO] Setting property: classpath.resource.loader.class => 'org.codehaus.plexus.velocity.ContextClassLoaderResourceLoader'.
[INFO] Setting property: velocimacro.messages.on => 'false'.
[INFO] Setting property: resource.loader => 'classpath'.
[INFO] Setting property: resource.manager.logwhenfound => 'false'.
[INFO] [remote-resources:process {execution: default}]
[INFO] [resources:resources {execution: default-resources}]
[INFO] Using 'UTF-8' encoding to copy filtered resources.
[INFO] Copying 13 resources
[INFO] Copying 3 resources
[INFO] [compiler:compile {execution: default-compile}]
[INFO] Compiling 122 source files to <https://hudson.apache.org/hudson/job/ServiceMix-Utils/ws/smx-utils/target/classes>
[HUDSON] Archiving <https://hudson.apache.org/hudson/job/ServiceMix-Utils/ws/smx-utils/pom.xml>
to /home/hudson/hudson/jobs/ServiceMix-Utils/modules/org.apache.servicemix$servicemix-utils/builds/2010-10-12_20-03-25/archive/org.apache.servicemix/servicemix-utils/1.3.0-SNAPSHOT/pom.xml
[INFO] ------------------------------------------------------------------------
[ERROR] BUILD FAILURE
[INFO] ------------------------------------------------------------------------
[INFO] Compilation failure
<https://hudson.apache.org/hudson/job/ServiceMix-Utils/ws/smx-utils/src/main/java/org/apache/servicemix/executors/impl/ManagedExecutor.java>:[104,48]
cannot find symbol
symbol  : method allowsCoreThreadTimeOut()
location: class java.util.concurrent.ThreadPoolExecutor


[INFO] ------------------------------------------------------------------------
[INFO] Trace
org.apache.maven.BuildFailureException: Compilation failure
<https://hudson.apache.org/hudson/job/ServiceMix-Utils/ws/smx-utils/src/main/java/org/apache/servicemix/executors/impl/ManagedExecutor.java>:[104,48]
cannot find symbol
symbol  : method allowsCoreThreadTimeOut()
location: class java.util.concurrent.ThreadPoolExecutor


	at org.apache.maven.lifecycle.DefaultLifecycleExecutor.executeGoals(DefaultLifecycleExecutor.java:715)
	at org.apache.maven.lifecycle.DefaultLifecycleExecutor.executeGoalWithLifecycle(DefaultLifecycleExecutor.java:556)
	at org.apache.maven.lifecycle.DefaultLifecycleExecutor.executeGoal(DefaultLifecycleExecutor.java:535)
	at org.apache.maven.lifecycle.DefaultLifecycleExecutor.executeGoalAndHandleFailures(DefaultLifecycleExecutor.java:387)
	at org.apache.maven.lifecycle.DefaultLifecycleExecutor.executeTaskSegments(DefaultLifecycleExecutor.java:348)
	at org.apache.maven.lifecycle.DefaultLifecycleExecutor.execute(DefaultLifecycleExecutor.java:180)
	at org.apache.maven.lifecycle.LifecycleExecutorInterceptor.execute(LifecycleExecutorInterceptor.java:65)
	at org.apache.maven.DefaultMaven.doExecute(DefaultMaven.java:328)
	at org.apache.maven.DefaultMaven.execute(DefaultMaven.java:138)
	at org.apache.maven.cli.MavenCli.main(MavenCli.java:362)
	at sun.reflect.NativeMethodAccessorImpl.invoke0(Native Method)
	at sun.reflect.NativeMethodAccessorImpl.invoke(NativeMethodAccessorImpl.java:39)
	at sun.reflect.DelegatingMethodAccessorImpl.invoke(DelegatingMethodAccessorImpl.java:25)
	at java.lang.reflect.Method.invoke(Method.java:592)
	at org.codehaus.classworlds.Launcher.launchEnhanced(Launcher.java:315)
	at org.codehaus.classworlds.Launcher.launch(Launcher.java:255)
	at hudson.maven.agent.Main.launch(Main.java:165)
	at hudson.maven.MavenBuilder.call(MavenBuilder.java:165)
	at hudson.maven.MavenModuleSetBuild$Builder.call(MavenModuleSetBuild.java:694)
	at hudson.maven.MavenModuleSetBuild$Builder.call(MavenModuleSetBuild.java:638)
	at hudson.remoting.UserRequest.perform(UserRequest.java:114)
	at hudson.remoting.UserRequest.perform(UserRequest.java:48)
	at hudson.remoting.Request$2.run(Request.java:270)
	at java.util.concurrent.Executors$RunnableAdapter.call(Executors.java:417)
	at java.util.concurrent.FutureTask$Sync.innerRun(FutureTask.java:269)
	at java.util.concurrent.FutureTask.run(FutureTask.java:123)
	at java.util.concurrent.ThreadPoolExecutor$Worker.runTask(ThreadPoolExecutor.java:651)
	at java.util.concurrent.ThreadPoolExecutor$Worker.run(ThreadPoolExecutor.java:676)
	at java.lang.Thread.run(Thread.java:595)
Caused by: org.apache.maven.plugin.CompilationFailureException: Compilation failure
<https://hudson.apache.org/hudson/job/ServiceMix-Utils/ws/smx-utils/src/main/java/org/apache/servicemix/executors/impl/ManagedExecutor.java>:[104,48]
cannot find symbol
symbol  : method allowsCoreThreadTimeOut()
location: class java.util.concurrent.ThreadPoolExecutor


	at org.apache.maven.plugin.AbstractCompilerMojo.execute(AbstractCompilerMojo.java:516)
	at org.apache.maven.plugin.CompilerMojo.execute(CompilerMojo.java:114)
	at org.apache.maven.plugin.DefaultPluginManager.executeMojo(DefaultPluginManager.java:490)
	at hudson.maven.agent.PluginManagerInterceptor.executeMojo(PluginManagerInterceptor.java:182)
	at org.apache.maven.lifecycle.DefaultLifecycleExecutor.executeGoals(DefaultLifecycleExecutor.java:694)
	... 28 more
[INFO] ------------------------------------------------------------------------
[INFO] Total time: 21 seconds
[INFO] Finished at: Tue Oct 12 20:03:57 UTC 2010
[INFO] Final Memory: 29M/72M
[INFO] ------------------------------------------------------------------------
Sending e-mails to: commits@servicemix.apache.org
channel stopped


Mime
View raw message