servicemix-commits mailing list archives

Site index · List index
Message view « Date » · « Thread »
Top « Date » · « Thread »
From Apache Hudson Server <hud...@hudson.apache.org>
Subject Build failed in Hudson: ServiceMix-Features #275
Date Fri, 15 Oct 2010 22:02:54 GMT
See <https://hudson.apache.org/hudson/job/ServiceMix-Features/275/changes>

Changes:

[jbonofre] [SMXCOMP-815] Upgrade to Drools 5.1.1.

------------------------------------------
Started by an SCM change
Building remotely on ubuntu1
Updating http://svn.apache.org/repos/asf/servicemix/smx4/features/trunk
A         assembly/src/main/distribution/text/etc/org.ops4j.pax.logging.cfg
U         assembly/src/main/descriptors/windows-bin.xml
U         assembly/src/main/descriptors/unix-bin.xml
U         assembly/src/main/filtered-resources/ode-features.xml
A         assembly/src/main/filtered-resources/activemq-features.xml
D         assembly/src/main/filtered-resources/etc/org.ops4j.pax.logging.cfg
U         assembly/src/main/filtered-resources/etc/custom.properties
U         assembly/src/main/filtered-resources/etc/jre.properties
U         assembly/src/main/filtered-resources/camel-features.xml
U         assembly/src/main/filtered-resources/features.xml
U         assembly/pom.xml
U         cxf/cxf-binding-nmr/pom.xml
U         cxf/cxf-transport-nmr/pom.xml
U         pom.xml
U         examples/itests/tests/src/test/java/org/apache/servicemix/examples/CXFNMRIntegrationTest.java
U         examples/itests/tests/src/test/java/org/apache/servicemix/examples/IntegrationTest.java
U         examples/itests/tests/pom.xml
At revision 1023128
[locks-and-latches] Checking to see if we really have the locks
[locks-and-latches] Have all the locks, build can start
Parsing POMs
[smx4-features] $ /home/hudson/tools/java/latest1.5/bin/java -da -dsa -XX:MaxPermSize=192m
-Xmx512M -cp /home/hudson/hudson-slave/maven-agent.jar:/home/hudson/tools/maven/apache-maven-2.2.1/boot/classworlds-1.1.jar
hudson.maven.agent.Main /home/hudson/tools/maven/apache-maven-2.2.1 /home/hudson/hudson-slave/slave.jar
/home/hudson/hudson-slave/maven-interceptor.jar 52906 /home/hudson/hudson-slave/maven2.1-interceptor.jar
<===[HUDSON REMOTING CAPACITY]===>channel started
   Executing Maven:  -B -f <https://hudson.apache.org/hudson/job/ServiceMix-Features/ws/smx4-features/pom.xml>
-Dmaven.repo.local=<https://hudson.apache.org/hudson/job/ServiceMix-Features/ws/.repository>
-fae -U -B -e clean install+ Error stacktraces are turned on.

[INFO] Scanning for projects...
[INFO] ------------------------------------------------------------------------
[ERROR] FATAL ERROR
[INFO] ------------------------------------------------------------------------
[INFO] Failed to resolve artifact.

GroupId: org.apache.servicemix
ArtifactId: servicemix-pom
Version: 5-SNAPSHOT

Reason: Unable to download the artifact from any repository

  org.apache.servicemix:servicemix-pom:pom:5-SNAPSHOT

from the specified remote repositories:
  central (http://repo1.maven.org/maven2),
  java.net (http://download.java.net/maven/2),
  jboss (http://repository.jboss.com/maven2),
  scriptengines (http://scriptengines.googlecode.com/svn/m2-repo)



[INFO] ------------------------------------------------------------------------
[INFO] Trace
org.apache.maven.reactor.MavenExecutionException: Cannot find parent: org.apache.servicemix:servicemix-pom
for project: org.apache.servicemix.features:features:pom:4.3.0-SNAPSHOT for project org.apache.servicemix.features:features:pom:4.3.0-SNAPSHOT
	at org.apache.maven.DefaultMaven.getProjects(DefaultMaven.java:404)
	at org.apache.maven.DefaultMaven.doExecute(DefaultMaven.java:272)
	at org.apache.maven.DefaultMaven.execute(DefaultMaven.java:138)
	at org.apache.maven.cli.MavenCli.main(MavenCli.java:362)
	at sun.reflect.NativeMethodAccessorImpl.invoke0(Native Method)
	at sun.reflect.NativeMethodAccessorImpl.invoke(NativeMethodAccessorImpl.java:39)
	at sun.reflect.DelegatingMethodAccessorImpl.invoke(DelegatingMethodAccessorImpl.java:25)
	at java.lang.reflect.Method.invoke(Method.java:592)
	at org.codehaus.classworlds.Launcher.launchEnhanced(Launcher.java:315)
	at org.codehaus.classworlds.Launcher.launch(Launcher.java:255)
	at hudson.maven.agent.Main.launch(Main.java:165)
	at hudson.maven.MavenBuilder.call(MavenBuilder.java:165)
	at hudson.maven.MavenModuleSetBuild$Builder.call(MavenModuleSetBuild.java:694)
	at hudson.maven.MavenModuleSetBuild$Builder.call(MavenModuleSetBuild.java:638)
	at hudson.remoting.UserRequest.perform(UserRequest.java:114)
	at hudson.remoting.UserRequest.perform(UserRequest.java:48)
	at hudson.remoting.Request$2.run(Request.java:270)
	at java.util.concurrent.Executors$RunnableAdapter.call(Executors.java:417)
	at java.util.concurrent.FutureTask$Sync.innerRun(FutureTask.java:269)
	at java.util.concurrent.FutureTask.run(FutureTask.java:123)
	at java.util.concurrent.ThreadPoolExecutor$Worker.runTask(ThreadPoolExecutor.java:651)
	at java.util.concurrent.ThreadPoolExecutor$Worker.run(ThreadPoolExecutor.java:676)
	at java.lang.Thread.run(Thread.java:595)
Caused by: org.apache.maven.project.ProjectBuildingException: Cannot find parent: org.apache.servicemix:servicemix-pom
for project: org.apache.servicemix.features:features:pom:4.3.0-SNAPSHOT for project org.apache.servicemix.features:features:pom:4.3.0-SNAPSHOT
	at org.apache.maven.project.DefaultMavenProjectBuilder.assembleLineage(DefaultMavenProjectBuilder.java:1396)
	at org.apache.maven.project.DefaultMavenProjectBuilder.buildInternal(DefaultMavenProjectBuilder.java:823)
	at org.apache.maven.project.DefaultMavenProjectBuilder.buildFromSourceFileInternal(DefaultMavenProjectBuilder.java:508)
	at org.apache.maven.project.DefaultMavenProjectBuilder.build(DefaultMavenProjectBuilder.java:200)
	at org.apache.maven.DefaultMaven.getProject(DefaultMaven.java:604)
	at org.apache.maven.DefaultMaven.collectProjects(DefaultMaven.java:487)
	at org.apache.maven.DefaultMaven.getProjects(DefaultMaven.java:391)
	... 22 more
Caused by: org.apache.maven.project.ProjectBuildingException: POM 'org.apache.servicemix:servicemix-pom'
not found in repository: Unable to download the artifact from any repository

  org.apache.servicemix:servicemix-pom:pom:5-SNAPSHOT

from the specified remote repositories:
  central (http://repo1.maven.org/maven2),
  java.net (http://download.java.net/maven/2),
  jboss (http://repository.jboss.com/maven2),
  scriptengines (http://scriptengines.googlecode.com/svn/m2-repo)

 for project org.apache.servicemix:servicemix-pom
	at org.apache.maven.project.DefaultMavenProjectBuilder.findModelFromRepository(DefaultMavenProjectBuilder.java:605)
	at org.apache.maven.project.DefaultMavenProjectBuilder.assembleLineage(DefaultMavenProjectBuilder.java:1392)
	... 28 more
Caused by: org.apache.maven.artifact.resolver.ArtifactNotFoundException: Unable to download
the artifact from any repository

  org.apache.servicemix:servicemix-pom:pom:5-SNAPSHOT

from the specified remote repositories:
  central (http://repo1.maven.org/maven2),
  java.net (http://download.java.net/maven/2),
  jboss (http://repository.jboss.com/maven2),
  scriptengines (http://scriptengines.googlecode.com/svn/m2-repo)


	at org.apache.maven.artifact.resolver.DefaultArtifactResolver.resolve(DefaultArtifactResolver.java:228)
	at org.apache.maven.artifact.resolver.DefaultArtifactResolver.resolve(DefaultArtifactResolver.java:90)
	at org.apache.maven.project.DefaultMavenProjectBuilder.findModelFromRepository(DefaultMavenProjectBuilder.java:558)
	... 29 more
Caused by: org.apache.maven.wagon.ResourceDoesNotExistException: Unable to download the artifact
from any repository
	at org.apache.maven.artifact.manager.DefaultWagonManager.getArtifact(DefaultWagonManager.java:404)
	at org.apache.maven.artifact.resolver.DefaultArtifactResolver.resolve(DefaultArtifactResolver.java:216)
	... 31 more
[INFO] ------------------------------------------------------------------------
[INFO] Total time: < 1 second
[INFO] Finished at: Fri Oct 15 22:02:54 UTC 2010
[INFO] Final Memory: 2M/13M
[INFO] ------------------------------------------------------------------------
channel stopped
[locks-and-latches] Releasing all the locks
[locks-and-latches] All the locks released


Mime
View raw message