servicemix-commits mailing list archives

Site index · List index
Message view « Date » · « Thread »
Top « Date » · « Thread »
From Apache Hudson Server <hud...@hudson.apache.org>
Subject Build failed in Hudson: ServiceMix3 #112
Date Tue, 04 Jan 2011 10:41:38 GMT
See <https://hudson.apache.org/hudson/job/ServiceMix3/112/>

------------------------------------------
[...truncated 687 lines...]
[INFO] [pmd:check {execution: validate}]
[INFO] [remote-resources:process {execution: default}]
[INFO] [servicemix-build:spring.schemas {execution: default}]
[INFO] Skipping - spring.schemas file does not exist in serviceengines
[INFO] [site:attach-descriptor {execution: default-attach-descriptor}]
[INFO] [install:install {execution: default-install}]
[INFO] Installing <https://hudson.apache.org/hudson/job/ServiceMix3/ws/smx3/deployables/serviceengines/pom.xml>
to <https://hudson.apache.org/hudson/job/ServiceMix3/ws/.repository/org/apache/servicemix/serviceengines/3.3.3-SNAPSHOT/serviceengines-3.3.3-SNAPSHOT.pom>
[HUDSON] Archiving <https://hudson.apache.org/hudson/job/ServiceMix3/ws/.repository/org/apache/servicemix/serviceengines/3.3.3-SNAPSHOT/serviceengines-3.3.3-SNAPSHOT.pom>
to /home/hudson/hudson/jobs/ServiceMix3/modules/org.apache.servicemix$serviceengines/builds/2011-01-04_10-36-23/archive/org.apache.servicemix/serviceengines/3.3.3-SNAPSHOT/serviceengines-3.3.3-SNAPSHOT.pom
[INFO] ------------------------------------------------------------------------
[INFO] Building ServiceMix :: Lightweight container Service Engine
[INFO]    task-segment: [clean, install]
[INFO] ------------------------------------------------------------------------
[INFO] [clean:clean {execution: default-clean}]
[INFO] Deleting file set: <https://hudson.apache.org/hudson/job/ServiceMix3/ws/smx3/deployables/serviceengines/servicemix-lwcontainer/target>
(included: [**], excluded: [])
[INFO] [checkstyle:checkstyle {execution: validate}]
[INFO] Starting audit...
Audit done.

[INFO] Preparing pmd:check
[HUDSON] Archiving <https://hudson.apache.org/hudson/job/ServiceMix3/ws/smx3/deployables/serviceengines/servicemix-lwcontainer/pom.xml>
to /home/hudson/hudson/jobs/ServiceMix3/modules/org.apache.servicemix$servicemix-lwcontainer/builds/2011-01-04_10-36-23/archive/org.apache.servicemix/servicemix-lwcontainer/3.3.3-SNAPSHOT/pom.xml
[INFO] [pmd:pmd {execution: pmd}]
[INFO] [pmd:check {execution: validate}]
[INFO] 
[INFO] [jbi:generate-jbi-component-descriptor {execution: default-generate-jbi-component-descriptor}]
[INFO] Generating jbi.xml
[INFO] [remote-resources:process {execution: default}]
[INFO] [resources:resources {execution: default-resources}]
[INFO] Using 'UTF-8' encoding to copy filtered resources.
[INFO] Copying 1 resource
[INFO] skip non existing resourceDirectory <https://hudson.apache.org/hudson/job/ServiceMix3/ws/smx3/deployables/serviceengines/servicemix-lwcontainer/target/generated>
[INFO] Copying 3 resources
[INFO] [servicemix-build:spring.schemas {execution: default}]
[INFO] Skipping - spring.schemas file does not exist in servicemix-lwcontainer
[INFO] [compiler:compile {execution: default-compile}]
[INFO] Compiling 5 source files to <https://hudson.apache.org/hudson/job/ServiceMix3/ws/smx3/deployables/serviceengines/servicemix-lwcontainer/target/classes>
[INFO] [resources:testResources {execution: default-testResources}]
[INFO] Using 'UTF-8' encoding to copy filtered resources.
[INFO] Copying 4 resources
[INFO] Copying 3 resources
[INFO] [compiler:testCompile {execution: default-testCompile}]
[INFO] Compiling 1 source file to <https://hudson.apache.org/hudson/job/ServiceMix3/ws/smx3/deployables/serviceengines/servicemix-lwcontainer/target/test-classes>
[INFO] [surefire:test {execution: default-test}]
[INFO] Surefire report directory: <https://hudson.apache.org/hudson/job/ServiceMix3/ws/smx3/deployables/serviceengines/servicemix-lwcontainer/target/surefire-reports>

-------------------------------------------------------
 T E S T S
-------------------------------------------------------
Running org.apache.servicemix.lwcontainer.LwContainerComponentTest
WARN: The method class org.apache.commons.logging.impl.SLF4JLogFactory#release() was invoked.
WARN: Please see http://www.slf4j.org/codes.html#release for an explanation.
Tests run: 2, Failures: 0, Errors: 0, Skipped: 0, Time elapsed: 1.744 sec

Results :

Tests run: 2, Failures: 0, Errors: 0, Skipped: 0

[HUDSON] Recording test results
[INFO] [jar:jar {execution: default-jar}]
[INFO] Building jar: <https://hudson.apache.org/hudson/job/ServiceMix3/ws/smx3/deployables/serviceengines/servicemix-lwcontainer/target/servicemix-lwcontainer-3.3.3-SNAPSHOT.jar>
[INFO] [jbi:jbi-component {execution: default-jbi-component}]
[INFO] Generating installer <https://hudson.apache.org/hudson/job/ServiceMix3/ws/smx3/deployables/serviceengines/servicemix-lwcontainer/target/servicemix-lwcontainer-3.3.3-SNAPSHOT-installer.zip>
[INFO] Building jar: <https://hudson.apache.org/hudson/job/ServiceMix3/ws/smx3/deployables/serviceengines/servicemix-lwcontainer/target/servicemix-lwcontainer-3.3.3-SNAPSHOT-installer.zip>
[INFO]  already added, skipping
[INFO] [install:install {execution: default-install}]
[INFO] Installing <https://hudson.apache.org/hudson/job/ServiceMix3/ws/smx3/deployables/serviceengines/servicemix-lwcontainer/target/servicemix-lwcontainer-3.3.3-SNAPSHOT.jar>
to <https://hudson.apache.org/hudson/job/ServiceMix3/ws/.repository/org/apache/servicemix/servicemix-lwcontainer/3.3.3-SNAPSHOT/servicemix-lwcontainer-3.3.3-SNAPSHOT.jar>
[INFO] Installing <https://hudson.apache.org/hudson/job/ServiceMix3/ws/smx3/deployables/serviceengines/servicemix-lwcontainer/target/servicemix-lwcontainer-3.3.3-SNAPSHOT-installer.zip>
to <https://hudson.apache.org/hudson/job/ServiceMix3/ws/.repository/org/apache/servicemix/servicemix-lwcontainer/3.3.3-SNAPSHOT/servicemix-lwcontainer-3.3.3-SNAPSHOT-installer.zip>
[HUDSON] Archiving <https://hudson.apache.org/hudson/job/ServiceMix3/ws/smx3/deployables/serviceengines/servicemix-lwcontainer/target/servicemix-lwcontainer-3.3.3-SNAPSHOT.jar>
to /home/hudson/hudson/jobs/ServiceMix3/modules/org.apache.servicemix$servicemix-lwcontainer/builds/2011-01-04_10-36-23/archive/org.apache.servicemix/servicemix-lwcontainer/3.3.3-SNAPSHOT/servicemix-lwcontainer-3.3.3-SNAPSHOT.jar
[HUDSON] Archiving <https://hudson.apache.org/hudson/job/ServiceMix3/ws/smx3/deployables/serviceengines/servicemix-lwcontainer/target/servicemix-lwcontainer-3.3.3-SNAPSHOT-installer.zip>
to /home/hudson/hudson/jobs/ServiceMix3/modules/org.apache.servicemix$servicemix-lwcontainer/builds/2011-01-04_10-36-23/archive/org.apache.servicemix/servicemix-lwcontainer/3.3.3-SNAPSHOT/servicemix-lwcontainer-3.3.3-SNAPSHOT-installer.zip
[INFO] ------------------------------------------------------------------------
[INFO] Building ServiceMix :: Deployables
[INFO]    task-segment: [clean, install]
[INFO] ------------------------------------------------------------------------
[INFO] [clean:clean {execution: default-clean}]
[INFO] Deleting file set: <https://hudson.apache.org/hudson/job/ServiceMix3/ws/smx3/deployables/target>
(included: [**], excluded: [])
[INFO] [remote-resources:process {execution: default}]
[INFO] [servicemix-build:copy {execution: default}]
[INFO] [site:attach-descriptor {execution: default-attach-descriptor}]
[INFO] [install:install {execution: default-install}]
[INFO] Installing <https://hudson.apache.org/hudson/job/ServiceMix3/ws/smx3/deployables/pom.xml>
to <https://hudson.apache.org/hudson/job/ServiceMix3/ws/.repository/org/apache/servicemix/deployables/3.3.3-SNAPSHOT/deployables-3.3.3-SNAPSHOT.pom>
[HUDSON] Archiving <https://hudson.apache.org/hudson/job/ServiceMix3/ws/smx3/deployables/pom.xml>
to /home/hudson/hudson/jobs/ServiceMix3/modules/org.apache.servicemix$deployables/builds/2011-01-04_10-36-23/archive/org.apache.servicemix/deployables/3.3.3-SNAPSHOT/pom.xml
[HUDSON] Archiving <https://hudson.apache.org/hudson/job/ServiceMix3/ws/.repository/org/apache/servicemix/deployables/3.3.3-SNAPSHOT/deployables-3.3.3-SNAPSHOT.pom>
to /home/hudson/hudson/jobs/ServiceMix3/modules/org.apache.servicemix$deployables/builds/2011-01-04_10-36-23/archive/org.apache.servicemix/deployables/3.3.3-SNAPSHOT/deployables-3.3.3-SNAPSHOT.pom
[INFO] ------------------------------------------------------------------------
[INFO] Building ServiceMix :: ITests
[INFO]    task-segment: [clean, install]
[INFO] ------------------------------------------------------------------------
[INFO] [clean:clean {execution: default-clean}]
[INFO] [remote-resources:process {execution: default}]
[WARNING] POM for 'xfire:xfire-jsr181-api:pom:1.0-M1:test' is invalid.

Its dependencies (if any) will NOT be available to the current build.
Downloading: http://svn.apache.org/repos/asf/servicemix/m2-repo//com/sun/mail/all/1.4.3/all-1.4.3.pom
[INFO] Unable to find resource 'com.sun.mail:all:pom:1.4.3' in repository smx.m2-repo (http://svn.apache.org/repos/asf/servicemix/m2-repo/)
Downloading: http://repo1.maven.org/maven2/com/sun/mail/all/1.4.3/all-1.4.3.pom
[INFO] Unable to find resource 'com.sun.mail:all:pom:1.4.3' in repository central (http://repo1.maven.org/maven2)
[HUDSON] Archiving <https://hudson.apache.org/hudson/job/ServiceMix3/ws/smx3/servicemix-itests/pom.xml>
to /home/hudson/hudson/jobs/ServiceMix3/modules/org.apache.servicemix$servicemix-itests/builds/2011-01-04_10-36-23/archive/org.apache.servicemix/servicemix-itests/3.3.3-SNAPSHOT/pom.xml
[INFO] ------------------------------------------------------------------------
[ERROR] BUILD ERROR
[INFO] ------------------------------------------------------------------------
[INFO] Failed to resolve artifact.

GroupId: com.sun.mail
ArtifactId: all
Version: 1.4.3

Reason: Unable to download the artifact from any repository

  com.sun.mail:all:pom:1.4.3

from the specified remote repositories:
  central (http://repo1.maven.org/maven2),
  smx.m2-repo (http://svn.apache.org/repos/asf/servicemix/m2-repo/),
  Nexus (http://repository.apache.org/snapshots)



[INFO] ------------------------------------------------------------------------
[INFO] Trace
org.apache.maven.lifecycle.LifecycleExecutionException: Failed to resolve dependencies for
one or more projects in the reactor. Reason: Unable to get dependency information: Unable
to read the metadata file for artifact 'javax.mail:mail:jar': Cannot find parent: com.sun.mail:all
for project: javax.mail:mail:jar:null for project javax.mail:mail:jar:null
  javax.mail:mail:jar:1.4.3

from the specified remote repositories:
  central (http://repo1.maven.org/maven2),
  smx.m2-repo (http://svn.apache.org/repos/asf/servicemix/m2-repo/),
  apache.snapshots (http://repository.apache.org/snapshots)

Path to dependency: 
	1) org.apache.servicemix:servicemix-itests:jar:3.3.3-SNAPSHOT


	at org.apache.maven.lifecycle.DefaultLifecycleExecutor.executeGoals(DefaultLifecycleExecutor.java:719)
	at org.apache.maven.lifecycle.DefaultLifecycleExecutor.executeGoalWithLifecycle(DefaultLifecycleExecutor.java:556)
	at org.apache.maven.lifecycle.DefaultLifecycleExecutor.executeGoal(DefaultLifecycleExecutor.java:535)
	at org.apache.maven.lifecycle.DefaultLifecycleExecutor.executeGoalAndHandleFailures(DefaultLifecycleExecutor.java:387)
	at org.apache.maven.lifecycle.DefaultLifecycleExecutor.executeTaskSegments(DefaultLifecycleExecutor.java:348)
	at org.apache.maven.lifecycle.DefaultLifecycleExecutor.execute(DefaultLifecycleExecutor.java:180)
	at org.apache.maven.lifecycle.LifecycleExecutorInterceptor.execute(LifecycleExecutorInterceptor.java:65)
	at org.apache.maven.DefaultMaven.doExecute(DefaultMaven.java:328)
	at org.apache.maven.DefaultMaven.execute(DefaultMaven.java:138)
	at org.apache.maven.cli.MavenCli.main(MavenCli.java:362)
	at sun.reflect.NativeMethodAccessorImpl.invoke0(Native Method)
	at sun.reflect.NativeMethodAccessorImpl.invoke(NativeMethodAccessorImpl.java:39)
	at sun.reflect.DelegatingMethodAccessorImpl.invoke(DelegatingMethodAccessorImpl.java:25)
	at java.lang.reflect.Method.invoke(Method.java:592)
	at org.codehaus.classworlds.Launcher.launchEnhanced(Launcher.java:315)
	at org.codehaus.classworlds.Launcher.launch(Launcher.java:255)
	at hudson.maven.agent.Main.launch(Main.java:165)
	at hudson.maven.MavenBuilder.call(MavenBuilder.java:165)
	at hudson.maven.MavenModuleSetBuild$Builder.call(MavenModuleSetBuild.java:750)
	at hudson.maven.MavenModuleSetBuild$Builder.call(MavenModuleSetBuild.java:694)
	at hudson.remoting.UserRequest.perform(UserRequest.java:114)
	at hudson.remoting.UserRequest.perform(UserRequest.java:48)
	at hudson.remoting.Request$2.run(Request.java:270)
	at java.util.concurrent.Executors$RunnableAdapter.call(Executors.java:417)
	at java.util.concurrent.FutureTask$Sync.innerRun(FutureTask.java:269)
	at java.util.concurrent.FutureTask.run(FutureTask.java:123)
	at java.util.concurrent.ThreadPoolExecutor$Worker.runTask(ThreadPoolExecutor.java:651)
	at java.util.concurrent.ThreadPoolExecutor$Worker.run(ThreadPoolExecutor.java:676)
	at java.lang.Thread.run(Thread.java:595)
Caused by: org.apache.maven.plugin.MojoExecutionException: Failed to resolve dependencies
for one or more projects in the reactor. Reason: Unable to get dependency information: Unable
to read the metadata file for artifact 'javax.mail:mail:jar': Cannot find parent: com.sun.mail:all
for project: javax.mail:mail:jar:null for project javax.mail:mail:jar:null
  javax.mail:mail:jar:1.4.3

from the specified remote repositories:
  central (http://repo1.maven.org/maven2),
  smx.m2-repo (http://svn.apache.org/repos/asf/servicemix/m2-repo/),
  apache.snapshots (http://repository.apache.org/snapshots)

Path to dependency: 
	1) org.apache.servicemix:servicemix-itests:jar:3.3.3-SNAPSHOT


	at org.apache.maven.plugin.resources.remote.ProcessRemoteResourcesMojo.resolveProjectArtifacts(ProcessRemoteResourcesMojo.java:702)
	at org.apache.maven.plugin.resources.remote.ProcessRemoteResourcesMojo.getProjects(ProcessRemoteResourcesMojo.java:602)
	at org.apache.maven.plugin.resources.remote.ProcessRemoteResourcesMojo.configureVelocityContext(ProcessRemoteResourcesMojo.java:969)
	at org.apache.maven.plugin.resources.remote.ProcessRemoteResourcesMojo.execute(ProcessRemoteResourcesMojo.java:492)
	at org.apache.maven.plugin.DefaultPluginManager.executeMojo(DefaultPluginManager.java:490)
	at hudson.maven.agent.PluginManagerInterceptor.executeMojo(PluginManagerInterceptor.java:182)
	at org.apache.maven.lifecycle.DefaultLifecycleExecutor.executeGoals(DefaultLifecycleExecutor.java:694)
	... 28 more
Caused by: org.apache.maven.artifact.resolver.ArtifactResolutionException: Unable to get dependency
information: Unable to read the metadata file for artifact 'javax.mail:mail:jar': Cannot find
parent: com.sun.mail:all for project: javax.mail:mail:jar:null for project javax.mail:mail:jar:null
  javax.mail:mail:jar:1.4.3

from the specified remote repositories:
  central (http://repo1.maven.org/maven2),
  smx.m2-repo (http://svn.apache.org/repos/asf/servicemix/m2-repo/),
  apache.snapshots (http://repository.apache.org/snapshots)

Path to dependency: 
	1) org.apache.servicemix:servicemix-itests:jar:3.3.3-SNAPSHOT


	at org.apache.maven.artifact.resolver.DefaultArtifactCollector.recurse(DefaultArtifactCollector.java:430)
	at org.apache.maven.artifact.resolver.DefaultArtifactCollector.collect(DefaultArtifactCollector.java:74)
	at org.apache.maven.artifact.resolver.DefaultArtifactResolver.resolveTransitively(DefaultArtifactResolver.java:316)
	at org.apache.maven.artifact.resolver.DefaultArtifactResolver.resolveTransitively(DefaultArtifactResolver.java:304)
	at org.apache.maven.shared.artifact.resolver.DefaultProjectDependenciesResolver.resolve(DefaultProjectDependenciesResolver.java:140)
	at org.apache.maven.shared.artifact.resolver.DefaultProjectDependenciesResolver.resolve(DefaultProjectDependenciesResolver.java:187)
	at org.apache.maven.plugin.resources.remote.ProcessRemoteResourcesMojo.resolveProjectArtifacts(ProcessRemoteResourcesMojo.java:697)
	... 34 more
Caused by: org.apache.maven.artifact.metadata.ArtifactMetadataRetrievalException: Unable to
read the metadata file for artifact 'javax.mail:mail:jar': Cannot find parent: com.sun.mail:all
for project: javax.mail:mail:jar:null for project javax.mail:mail:jar:null
	at org.apache.maven.project.artifact.MavenMetadataSource.retrieveRelocatedProject(MavenMetadataSource.java:200)
	at org.apache.maven.project.artifact.MavenMetadataSource.retrieveRelocatedArtifact(MavenMetadataSource.java:94)
	at org.apache.maven.artifact.resolver.DefaultArtifactCollector.recurse(DefaultArtifactCollector.java:387)
	... 40 more
Caused by: org.apache.maven.project.ProjectBuildingException: Cannot find parent: com.sun.mail:all
for project: javax.mail:mail:jar:null for project javax.mail:mail:jar:null
	at org.apache.maven.project.DefaultMavenProjectBuilder.assembleLineage(DefaultMavenProjectBuilder.java:1396)
	at org.apache.maven.project.DefaultMavenProjectBuilder.buildInternal(DefaultMavenProjectBuilder.java:823)
	at org.apache.maven.project.DefaultMavenProjectBuilder.buildFromRepository(DefaultMavenProjectBuilder.java:255)
	at org.apache.maven.project.artifact.MavenMetadataSource.retrieveRelocatedProject(MavenMetadataSource.java:163)
	... 42 more
Caused by: org.apache.maven.project.ProjectBuildingException: POM 'com.sun.mail:all' not found
in repository: Unable to download the artifact from any repository

  com.sun.mail:all:pom:1.4.3

from the specified remote repositories:
  central (http://repo1.maven.org/maven2),
  smx.m2-repo (http://svn.apache.org/repos/asf/servicemix/m2-repo/),
  Nexus (http://repository.apache.org/snapshots)

 for project com.sun.mail:all
	at org.apache.maven.project.DefaultMavenProjectBuilder.findModelFromRepository(DefaultMavenProjectBuilder.java:605)
	at org.apache.maven.project.DefaultMavenProjectBuilder.assembleLineage(DefaultMavenProjectBuilder.java:1392)
	... 45 more
Caused by: org.apache.maven.artifact.resolver.ArtifactNotFoundException: Unable to download
the artifact from any repository

  com.sun.mail:all:pom:1.4.3

from the specified remote repositories:
  central (http://repo1.maven.org/maven2),
  smx.m2-repo (http://svn.apache.org/repos/asf/servicemix/m2-repo/),
  Nexus (http://repository.apache.org/snapshots)


	at org.apache.maven.artifact.resolver.DefaultArtifactResolver.resolve(DefaultArtifactResolver.java:228)
	at org.apache.maven.artifact.resolver.DefaultArtifactResolver.resolve(DefaultArtifactResolver.java:90)
	at org.apache.maven.project.DefaultMavenProjectBuilder.findModelFromRepository(DefaultMavenProjectBuilder.java:558)
	... 46 more
Caused by: org.apache.maven.wagon.ResourceDoesNotExistException: Unable to download the artifact
from any repository
	at org.apache.maven.artifact.manager.DefaultWagonManager.getArtifact(DefaultWagonManager.java:404)
	at org.apache.maven.artifact.resolver.DefaultArtifactResolver.resolve(DefaultArtifactResolver.java:216)
	... 48 more
[INFO] ------------------------------------------------------------------------
[INFO] Total time: 5 minutes 3 seconds
[INFO] Finished at: Tue Jan 04 10:41:36 UTC 2011
[INFO] Final Memory: 92M/137M
[INFO] ------------------------------------------------------------------------
Sending e-mails to: commits@servicemix.apache.org
channel stopped
[locks-and-latches] Releasing all the locks
[locks-and-latches] All the locks released


Mime
View raw message