servicemix-commits mailing list archives

Site index · List index
Message view « Date » · « Thread »
Top « Date » · « Thread »
From Apache Hudson Server <hud...@hudson.apache.org>
Subject Build failed in Jenkins: ServiceMix-NMR-Deploy #114
Date Thu, 03 Mar 2011 23:56:55 GMT
See <https://hudson.apache.org/hudson/job/ServiceMix-NMR-Deploy/114/changes>

Changes:

[gertv] SMX4NMR-256: Use 'import' scope to reduce number of managed dependencies

------------------------------------------
Started by upstream project "ServiceMix-NMR" build number 254
Building remotely on ubuntu1
Updating http://svn.apache.org/repos/asf/servicemix/smx4/nmr/trunk
U         assembly/pom.xml
U         pom.xml
U         jbi/itests/src/test/java/org/apache/servicemix/jbi/itests/IntegrationTest.java
U         jbi/itests/src/test/java/org/apache/servicemix/jbi/itests/ManagementTest.java
U         jbi/itests/pom.xml
At revision 1076895
Found mavenVersion 2.2.1 from file jar:file:/home/hudson/tools/maven/apache-maven-2.2.1/lib/maven-2.2.1-uber.jar!/META-INF/maven/org.apache.maven/maven-core/pom.properties
Parsing POMs
[smx4-nmr] $ /home/hudson/tools/java/latest1.5/bin/java -da -dsa -XX:MaxPermSize=192m -Xmx512M
-cp /home/hudson/hudson-slave/maven-agent.jar:/home/hudson/hudson-slave/classworlds.jar hudson.maven.agent.Main
/home/hudson/tools/maven/apache-maven-2.2.1 /home/hudson/hudson-slave/slave.jar /home/hudson/hudson-slave/maven-interceptor.jar
48015 /home/hudson/hudson-slave/maven2.1-interceptor.jar
<===[HUDSON REMOTING CAPACITY]===>channel started
   Executing Maven:  -B -f <https://hudson.apache.org/hudson/job/ServiceMix-NMR-Deploy/ws/smx4-nmr/pom.xml>
-Dmaven.repo.local=<https://hudson.apache.org/hudson/job/ServiceMix-NMR-Deploy/ws/.repository>
-fae -U -B -e -Dmaven.test.skip.exec=true -Dtest=false clean package source:jar deploy+ Error
stacktraces are turned on.

[INFO] Scanning for projects...
[INFO] ------------------------------------------------------------------------
[ERROR] BUILD FAILURE
[INFO] ------------------------------------------------------------------------
[INFO] Unable to build project '<https://hudson.apache.org/hudson/job/ServiceMix-NMR-Deploy/ws/smx4-nmr/pom.xml;>
it requires Maven version 3.0.0
[INFO] ------------------------------------------------------------------------
[INFO] Trace
org.apache.maven.BuildFailureException: Unable to build project '<https://hudson.apache.org/hudson/job/ServiceMix-NMR-Deploy/ws/smx4-nmr/pom.xml;>
it requires Maven version 3.0.0
	at org.apache.maven.DefaultMaven.collectProjects(DefaultMaven.java:499)
	at org.apache.maven.DefaultMaven.getProjects(DefaultMaven.java:391)
	at org.apache.maven.DefaultMaven.doExecute(DefaultMaven.java:272)
	at org.apache.maven.DefaultMaven.execute(DefaultMaven.java:138)
	at org.apache.maven.cli.MavenCli.main(MavenCli.java:362)
	at sun.reflect.NativeMethodAccessorImpl.invoke0(Native Method)
	at sun.reflect.NativeMethodAccessorImpl.invoke(NativeMethodAccessorImpl.java:39)
	at sun.reflect.DelegatingMethodAccessorImpl.invoke(DelegatingMethodAccessorImpl.java:25)
	at java.lang.reflect.Method.invoke(Method.java:592)
	at org.codehaus.classworlds.Launcher.launchEnhanced(Launcher.java:315)
	at org.codehaus.classworlds.Launcher.launch(Launcher.java:255)
	at hudson.maven.agent.Main.launch(Main.java:173)
	at hudson.maven.MavenBuilder.call(MavenBuilder.java:164)
	at hudson.maven.MavenModuleSetBuild$Builder.call(MavenModuleSetBuild.java:872)
	at hudson.maven.MavenModuleSetBuild$Builder.call(MavenModuleSetBuild.java:803)
	at hudson.remoting.UserRequest.perform(UserRequest.java:114)
	at hudson.remoting.UserRequest.perform(UserRequest.java:48)
	at hudson.remoting.Request$2.run(Request.java:270)
	at java.util.concurrent.Executors$RunnableAdapter.call(Executors.java:417)
	at java.util.concurrent.FutureTask$Sync.innerRun(FutureTask.java:269)
	at java.util.concurrent.FutureTask.run(FutureTask.java:123)
	at java.util.concurrent.ThreadPoolExecutor$Worker.runTask(ThreadPoolExecutor.java:651)
	at java.util.concurrent.ThreadPoolExecutor$Worker.run(ThreadPoolExecutor.java:676)
	at java.lang.Thread.run(Thread.java:595)
[INFO] ------------------------------------------------------------------------
[INFO] Total time: < 1 second
[INFO] Finished at: Thu Mar 03 15:56:54 GMT-08:00 2011
[INFO] Final Memory: 3M/10M
[INFO] ------------------------------------------------------------------------
channel stopped


Mime
View raw message