servicemix-commits mailing list archives

Site index · List index
Message view « Date » · « Thread »
Top « Date » · « Thread »
From Apache Hudson Server <hud...@hudson.apache.org>
Subject Build failed in Jenkins: ServiceMix3 » ServiceMix :: Samples :: Loan Broker :: Drools #126
Date Fri, 18 Mar 2011 21:14:30 GMT
See <https://hudson.apache.org/hudson/job/ServiceMix3/org.apache.servicemix.samples.loan-broker$loan-broker-drools-su/126/changes>

Changes:

[jbonofre] [SM-2055] Prepare ServiceMix 3.4 release.

------------------------------------------
[INFO] ------------------------------------------------------------------------
[INFO] Building ServiceMix :: Samples :: Loan Broker :: Drools
[INFO]    task-segment: [clean, install]
[INFO] ------------------------------------------------------------------------
[INFO] [clean:clean {execution: default-clean}]
[INFO] Deleting file set: <https://hudson.apache.org/hudson/job/ServiceMix3/org.apache.servicemix.samples.loan-broker$loan-broker-drools-su/ws/target>
(included: [**], excluded: [])
[INFO] [remote-resources:process {execution: default}]
[WARNING] POM for 'org.eclipse.jdt.core.compiler:ecj:pom:3.5.1:compile' is invalid.

Its dependencies (if any) will NOT be available to the current build.
[INFO] [servicemix-build:copy {execution: default}]
[INFO] [resources:resources {execution: default-resources}]
[INFO] Using 'UTF-8' encoding to copy filtered resources.
[INFO] Copying 2 resources
[INFO] skip non existing resourceDirectory <https://hudson.apache.org/hudson/job/ServiceMix3/org.apache.servicemix.samples.loan-broker$loan-broker-drools-su/ws/target/generated>
[INFO] Copying 3 resources
[WARNING] POM for 'org.eclipse.jdt.core.compiler:ecj:pom:3.5.1:compile' is invalid.

Its dependencies (if any) will NOT be available to the current build.
[INFO] [jbi:generate-depends-file {execution: default-generate-depends-file}]
[INFO] Created: <https://hudson.apache.org/hudson/job/ServiceMix3/org.apache.servicemix.samples.loan-broker$loan-broker-drools-su/ws/target/classes/META-INF/maven/dependencies.properties>
[INFO] [compiler:compile {execution: default-compile}]
[INFO] No sources to compile
[INFO] [jbi:generate-jbi-service-unit-descriptor {execution: default-generate-jbi-service-unit-descriptor}]
[INFO] Generating jbi.xml
[INFO] generated : consumes [] provides []
[INFO] [resources:testResources {execution: default-testResources}]
[INFO] Using 'UTF-8' encoding to copy filtered resources.
[INFO] Copying 1 resource
[INFO] Copying 3 resources
[INFO] [compiler:testCompile {execution: default-testCompile}]
[INFO] Compiling 1 source file to <https://hudson.apache.org/hudson/job/ServiceMix3/org.apache.servicemix.samples.loan-broker$loan-broker-drools-su/ws/target/test-classes>
[JENKINS] Archiving <https://hudson.apache.org/hudson/job/ServiceMix3/org.apache.servicemix.samples.loan-broker$loan-broker-drools-su/ws/pom.xml>
to /home/hudson/hudson/jobs/ServiceMix3/modules/org.apache.servicemix.samples.loan-broker$loan-broker-drools-su/builds/2011-03-18_21-06-52/archive/org.apache.servicemix.samples.loan-broker/loan-broker-drools-su/3.4-SNAPSHOT/pom.xml
[INFO] ------------------------------------------------------------------------
[ERROR] BUILD FAILURE
[INFO] ------------------------------------------------------------------------
[INFO] Compilation failure
error: error reading /home/hudson/hudson-slave/workspace/ServiceMix3/.repository/org/eclipse/jdt/core/compiler/ecj/3.5.1/ecj-3.5.1.jar;
error in opening zip file

[INFO] ------------------------------------------------------------------------
[INFO] Trace
org.apache.maven.BuildFailureException: Compilation failure
error: error reading /home/hudson/hudson-slave/workspace/ServiceMix3/.repository/org/eclipse/jdt/core/compiler/ecj/3.5.1/ecj-3.5.1.jar;
error in opening zip file

	at org.apache.maven.lifecycle.DefaultLifecycleExecutor.executeGoals(DefaultLifecycleExecutor.java:715)
	at org.apache.maven.lifecycle.DefaultLifecycleExecutor.executeGoalWithLifecycle(DefaultLifecycleExecutor.java:556)
	at org.apache.maven.lifecycle.DefaultLifecycleExecutor.executeGoal(DefaultLifecycleExecutor.java:535)
	at org.apache.maven.lifecycle.DefaultLifecycleExecutor.executeGoalAndHandleFailures(DefaultLifecycleExecutor.java:387)
	at org.apache.maven.lifecycle.DefaultLifecycleExecutor.executeTaskSegments(DefaultLifecycleExecutor.java:348)
	at org.apache.maven.lifecycle.DefaultLifecycleExecutor.execute(DefaultLifecycleExecutor.java:180)
	at org.apache.maven.lifecycle.LifecycleExecutorInterceptor.execute(LifecycleExecutorInterceptor.java:65)
	at org.apache.maven.DefaultMaven.doExecute(DefaultMaven.java:328)
	at org.apache.maven.DefaultMaven.execute(DefaultMaven.java:138)
	at org.apache.maven.cli.MavenCli.main(MavenCli.java:362)
	at sun.reflect.NativeMethodAccessorImpl.invoke0(Native Method)
	at sun.reflect.NativeMethodAccessorImpl.invoke(NativeMethodAccessorImpl.java:39)
	at sun.reflect.DelegatingMethodAccessorImpl.invoke(DelegatingMethodAccessorImpl.java:25)
	at java.lang.reflect.Method.invoke(Method.java:592)
	at org.codehaus.classworlds.Launcher.launchEnhanced(Launcher.java:315)
	at org.codehaus.classworlds.Launcher.launch(Launcher.java:255)
	at hudson.maven.agent.Main.launch(Main.java:173)
	at hudson.maven.MavenBuilder.call(MavenBuilder.java:164)
	at hudson.maven.MavenModuleSetBuild$Builder.call(MavenModuleSetBuild.java:872)
	at hudson.maven.MavenModuleSetBuild$Builder.call(MavenModuleSetBuild.java:803)
	at hudson.remoting.UserRequest.perform(UserRequest.java:114)
	at hudson.remoting.UserRequest.perform(UserRequest.java:48)
	at hudson.remoting.Request$2.run(Request.java:270)
	at java.util.concurrent.Executors$RunnableAdapter.call(Executors.java:417)
	at java.util.concurrent.FutureTask$Sync.innerRun(FutureTask.java:269)
	at java.util.concurrent.FutureTask.run(FutureTask.java:123)
	at java.util.concurrent.ThreadPoolExecutor$Worker.runTask(ThreadPoolExecutor.java:651)
	at java.util.concurrent.ThreadPoolExecutor$Worker.run(ThreadPoolExecutor.java:676)
	at java.lang.Thread.run(Thread.java:595)
Caused by: org.apache.maven.plugin.CompilationFailureException: Compilation failure
error: error reading /home/hudson/hudson-slave/workspace/ServiceMix3/.repository/org/eclipse/jdt/core/compiler/ecj/3.5.1/ecj-3.5.1.jar;
error in opening zip file

	at org.apache.maven.plugin.AbstractCompilerMojo.execute(AbstractCompilerMojo.java:516)
	at org.apache.maven.plugin.TestCompilerMojo.execute(TestCompilerMojo.java:102)
	at org.apache.maven.plugin.DefaultPluginManager.executeMojo(DefaultPluginManager.java:490)
	at hudson.maven.agent.PluginManagerInterceptor.executeMojo(PluginManagerInterceptor.java:182)
	at org.apache.maven.lifecycle.DefaultLifecycleExecutor.executeGoals(DefaultLifecycleExecutor.java:694)
	... 28 more
[INFO] ------------------------------------------------------------------------
[INFO] Total time: 7 minutes 8 seconds
[INFO] Finished at: Fri Mar 18 21:14:28 UTC 2011
[INFO] Final Memory: 120M/160M
[INFO] ------------------------------------------------------------------------


Mime
View raw message