servicemix-commits mailing list archives

Site index · List index
Message view « Date » · « Thread »
Top « Date » · « Thread »
From Apache Jenkins Server <hud...@hudson.apache.org>
Subject Build failed in Jenkins: ServiceMix3 #134
Date Thu, 28 Apr 2011 21:26:35 GMT
See <https://builds.apache.org/hudson/job/ServiceMix3/134/changes>

Changes:

[lhein] fixed wrong jndi names in properties file (see SM-1206)

------------------------------------------
[...truncated 3955 lines...]
<attribute name='SpecificationName' type='java.lang.String'>Java Management Extensions</attribute>
<attribute name='SpecificationVersion' type='java.lang.String'>1.2 Maintenance Release</attribute>
<attribute name='SpecificationVendor' type='java.lang.String'>Sun Microsystems</attribute>
<attribute name='ImplementationName' type='java.lang.String'>JMX</attribute>
<attribute name='ImplementationVersion' type='java.lang.String'>1.5.0_22-b03</attribute>
<attribute name='ImplementationVendor' type='java.lang.String'>Sun Microsystems</attribute>
</mbean>
[JENKINS] Recording test results
[INFO] [war:war {execution: default-war}]
[INFO] Packaging webapp
[INFO] Assembling webapp[servicemix-web] in [<https://builds.apache.org/hudson/job/ServiceMix3/ws/smx3/samples/servicemix-web/target/servicemix-web-3.4-SNAPSHOT]>
[INFO] Processing war project
[INFO] Copying webapp resources[<https://builds.apache.org/hudson/job/ServiceMix3/ws/smx3/samples/servicemix-web/src/webapp]>
[INFO] Processing overlay[ id org.apache.servicemix:servicemix-web-console]
[INFO] Webapp assembled in[618 msecs]
[INFO] Building war: <https://builds.apache.org/hudson/job/ServiceMix3/ws/smx3/samples/servicemix-web/target/servicemix-web-3.4-SNAPSHOT.war>
[INFO] [assembly:single {execution: bin}]
[INFO] Building tar : <https://builds.apache.org/hudson/job/ServiceMix3/ws/smx3/samples/servicemix-web/target/servicemix-web-3.4-SNAPSHOT-src.tar.gz>
[INFO] Building zip: <https://builds.apache.org/hudson/job/ServiceMix3/ws/smx3/samples/servicemix-web/target/servicemix-web-3.4-SNAPSHOT-src.zip>
[INFO] [install:install {execution: default-install}]
[INFO] Installing <https://builds.apache.org/hudson/job/ServiceMix3/ws/smx3/samples/servicemix-web/target/servicemix-web-3.4-SNAPSHOT.war>
to <https://builds.apache.org/hudson/job/ServiceMix3/ws/.repository/org/apache/servicemix/samples/servicemix-web/3.4-SNAPSHOT/servicemix-web-3.4-SNAPSHOT.war>
[INFO] Installing <https://builds.apache.org/hudson/job/ServiceMix3/ws/smx3/samples/servicemix-web/target/servicemix-web-3.4-SNAPSHOT-src.tar.gz>
to <https://builds.apache.org/hudson/job/ServiceMix3/ws/.repository/org/apache/servicemix/samples/servicemix-web/3.4-SNAPSHOT/servicemix-web-3.4-SNAPSHOT-src.tar.gz>
[INFO] Installing <https://builds.apache.org/hudson/job/ServiceMix3/ws/smx3/samples/servicemix-web/target/servicemix-web-3.4-SNAPSHOT-src.zip>
to <https://builds.apache.org/hudson/job/ServiceMix3/ws/.repository/org/apache/servicemix/samples/servicemix-web/3.4-SNAPSHOT/servicemix-web-3.4-SNAPSHOT-src.zip>
[JENKINS] Archiving <https://builds.apache.org/hudson/job/ServiceMix3/ws/smx3/samples/servicemix-web/pom.xml>
to /home/hudson/hudson/jobs/ServiceMix3/modules/org.apache.servicemix.samples$servicemix-web/builds/2011-04-28_21-00-59/archive/org.apache.servicemix.samples/servicemix-web/3.4-SNAPSHOT/servicemix-web-3.4-SNAPSHOT.pom
[JENKINS] Archiving <https://builds.apache.org/hudson/job/ServiceMix3/ws/smx3/samples/servicemix-web/target/servicemix-web-3.4-SNAPSHOT.war>
to /home/hudson/hudson/jobs/ServiceMix3/modules/org.apache.servicemix.samples$servicemix-web/builds/2011-04-28_21-00-59/archive/org.apache.servicemix.samples/servicemix-web/3.4-SNAPSHOT/servicemix-web-3.4-SNAPSHOT.war
[JENKINS] Archiving <https://builds.apache.org/hudson/job/ServiceMix3/ws/smx3/samples/servicemix-web/target/servicemix-web-3.4-SNAPSHOT-src.tar.gz>
to /home/hudson/hudson/jobs/ServiceMix3/modules/org.apache.servicemix.samples$servicemix-web/builds/2011-04-28_21-00-59/archive/org.apache.servicemix.samples/servicemix-web/3.4-SNAPSHOT/servicemix-web-3.4-SNAPSHOT-src.tar.gz
[JENKINS] Archiving <https://builds.apache.org/hudson/job/ServiceMix3/ws/smx3/samples/servicemix-web/target/servicemix-web-3.4-SNAPSHOT-src.zip>
to /home/hudson/hudson/jobs/ServiceMix3/modules/org.apache.servicemix.samples$servicemix-web/builds/2011-04-28_21-00-59/archive/org.apache.servicemix.samples/servicemix-web/3.4-SNAPSHOT/servicemix-web-3.4-SNAPSHOT-src.zip
[INFO] ------------------------------------------------------------------------
[INFO] Building ServiceMix :: Samples :: Basic
[INFO]    task-segment: [clean, install]
[INFO] ------------------------------------------------------------------------
[INFO] [clean:clean {execution: default-clean}]
[INFO] Deleting file set: <https://builds.apache.org/hudson/job/ServiceMix3/ws/smx3/samples/basic/target>
(included: [**], excluded: [])
[INFO] [remote-resources:process {execution: default}]
[INFO] [servicemix-build:copy {execution: default}]
[INFO] [resources:resources {execution: default-resources}]
[INFO] Using 'UTF-8' encoding to copy filtered resources.
[INFO] Copying 1 resource
[INFO] skip non existing resourceDirectory <https://builds.apache.org/hudson/job/ServiceMix3/ws/smx3/samples/basic/target/generated>
[INFO] Copying 3 resources
[INFO] [compiler:compile {execution: default-compile}]
[INFO] No sources to compile
[INFO] [resources:testResources {execution: default-testResources}]
[INFO] Using 'UTF-8' encoding to copy filtered resources.
[INFO] skip non existing resourceDirectory <https://builds.apache.org/hudson/job/ServiceMix3/ws/smx3/samples/basic/src/test/resources>
[INFO] Copying 3 resources
[INFO] [compiler:testCompile {execution: default-testCompile}]
[INFO] No sources to compile
[INFO] [surefire:test {execution: default-test}]
[INFO] Surefire report directory: <https://builds.apache.org/hudson/job/ServiceMix3/ws/smx3/samples/basic/target/surefire-reports>

-------------------------------------------------------
 T E S T S
-------------------------------------------------------
There are no tests to run.

Results :

Tests run: 0, Failures: 0, Errors: 0, Skipped: 0

[JENKINS] Recording test results
[INFO] [jar:jar {execution: default-jar}]
[INFO] Building jar: <https://builds.apache.org/hudson/job/ServiceMix3/ws/smx3/samples/basic/target/basic-3.4-SNAPSHOT.jar>
[INFO] [assembly:single {execution: src}]
[INFO] Building tar : <https://builds.apache.org/hudson/job/ServiceMix3/ws/smx3/samples/basic/target/basic-3.4-SNAPSHOT-src.tar.gz>
[INFO] Building zip: <https://builds.apache.org/hudson/job/ServiceMix3/ws/smx3/samples/basic/target/basic-3.4-SNAPSHOT-src.zip>
[INFO] [install:install {execution: default-install}]
[INFO] Installing <https://builds.apache.org/hudson/job/ServiceMix3/ws/smx3/samples/basic/target/basic-3.4-SNAPSHOT.jar>
to <https://builds.apache.org/hudson/job/ServiceMix3/ws/.repository/org/apache/servicemix/samples/basic/3.4-SNAPSHOT/basic-3.4-SNAPSHOT.jar>
[INFO] Installing <https://builds.apache.org/hudson/job/ServiceMix3/ws/smx3/samples/basic/target/basic-3.4-SNAPSHOT-src.tar.gz>
to <https://builds.apache.org/hudson/job/ServiceMix3/ws/.repository/org/apache/servicemix/samples/basic/3.4-SNAPSHOT/basic-3.4-SNAPSHOT-src.tar.gz>
[INFO] Installing <https://builds.apache.org/hudson/job/ServiceMix3/ws/smx3/samples/basic/target/basic-3.4-SNAPSHOT-src.zip>
to <https://builds.apache.org/hudson/job/ServiceMix3/ws/.repository/org/apache/servicemix/samples/basic/3.4-SNAPSHOT/basic-3.4-SNAPSHOT-src.zip>
[JENKINS] Archiving <https://builds.apache.org/hudson/job/ServiceMix3/ws/smx3/samples/basic/pom.xml>
to /home/hudson/hudson/jobs/ServiceMix3/modules/org.apache.servicemix.samples$basic/builds/2011-04-28_21-00-59/archive/org.apache.servicemix.samples/basic/3.4-SNAPSHOT/basic-3.4-SNAPSHOT.pom
[JENKINS] Archiving <https://builds.apache.org/hudson/job/ServiceMix3/ws/smx3/samples/basic/target/basic-3.4-SNAPSHOT.jar>
to /home/hudson/hudson/jobs/ServiceMix3/modules/org.apache.servicemix.samples$basic/builds/2011-04-28_21-00-59/archive/org.apache.servicemix.samples/basic/3.4-SNAPSHOT/basic-3.4-SNAPSHOT.jar
[JENKINS] Archiving <https://builds.apache.org/hudson/job/ServiceMix3/ws/smx3/samples/basic/target/basic-3.4-SNAPSHOT-src.tar.gz>
to /home/hudson/hudson/jobs/ServiceMix3/modules/org.apache.servicemix.samples$basic/builds/2011-04-28_21-00-59/archive/org.apache.servicemix.samples/basic/3.4-SNAPSHOT/basic-3.4-SNAPSHOT-src.tar.gz
[JENKINS] Archiving <https://builds.apache.org/hudson/job/ServiceMix3/ws/smx3/samples/basic/target/basic-3.4-SNAPSHOT-src.zip>
to /home/hudson/hudson/jobs/ServiceMix3/modules/org.apache.servicemix.samples$basic/builds/2011-04-28_21-00-59/archive/org.apache.servicemix.samples/basic/3.4-SNAPSHOT/basic-3.4-SNAPSHOT-src.zip
[INFO] ------------------------------------------------------------------------
[INFO] Building ServiceMix :: Samples :: Camel
[INFO]    task-segment: [clean, install]
[INFO] ------------------------------------------------------------------------
[INFO] [clean:clean {execution: default-clean}]
[INFO] Deleting file set: <https://builds.apache.org/hudson/job/ServiceMix3/ws/smx3/samples/camel/target>
(included: [**], excluded: [])
[INFO] [remote-resources:process {execution: default}]
[INFO] [servicemix-build:copy {execution: default}]
[INFO] [site:attach-descriptor {execution: default-attach-descriptor}]
[INFO] [assembly:single {execution: src}]
[INFO] Initializing assembly filters...
[INFO] Building tar : <https://builds.apache.org/hudson/job/ServiceMix3/ws/smx3/samples/camel/target/camel-3.4-SNAPSHOT-src.tar.gz>
[INFO] Initializing assembly filters...
[INFO] Building zip: <https://builds.apache.org/hudson/job/ServiceMix3/ws/smx3/samples/camel/target/camel-3.4-SNAPSHOT-src.zip>
[INFO] [install:install {execution: default-install}]
[INFO] Installing <https://builds.apache.org/hudson/job/ServiceMix3/ws/smx3/samples/camel/pom.xml>
to <https://builds.apache.org/hudson/job/ServiceMix3/ws/.repository/org/apache/servicemix/samples/camel/3.4-SNAPSHOT/camel-3.4-SNAPSHOT.pom>
[INFO] Installing <https://builds.apache.org/hudson/job/ServiceMix3/ws/smx3/samples/camel/target/camel-3.4-SNAPSHOT-src.tar.gz>
to <https://builds.apache.org/hudson/job/ServiceMix3/ws/.repository/org/apache/servicemix/samples/camel/3.4-SNAPSHOT/camel-3.4-SNAPSHOT-src.tar.gz>
[INFO] Installing <https://builds.apache.org/hudson/job/ServiceMix3/ws/smx3/samples/camel/target/camel-3.4-SNAPSHOT-src.zip>
to <https://builds.apache.org/hudson/job/ServiceMix3/ws/.repository/org/apache/servicemix/samples/camel/3.4-SNAPSHOT/camel-3.4-SNAPSHOT-src.zip>
[JENKINS] Archiving <https://builds.apache.org/hudson/job/ServiceMix3/ws/smx3/samples/camel/pom.xml>
to /home/hudson/hudson/jobs/ServiceMix3/modules/org.apache.servicemix.samples$camel/builds/2011-04-28_21-00-59/archive/org.apache.servicemix.samples/camel/3.4-SNAPSHOT/camel-3.4-SNAPSHOT.pom
[JENKINS] Archiving <https://builds.apache.org/hudson/job/ServiceMix3/ws/smx3/samples/camel/target/camel-3.4-SNAPSHOT-src.tar.gz>
to /home/hudson/hudson/jobs/ServiceMix3/modules/org.apache.servicemix.samples$camel/builds/2011-04-28_21-00-59/archive/org.apache.servicemix.samples/camel/3.4-SNAPSHOT/camel-3.4-SNAPSHOT-src.tar.gz
[JENKINS] Archiving <https://builds.apache.org/hudson/job/ServiceMix3/ws/smx3/samples/camel/target/camel-3.4-SNAPSHOT-src.zip>
to /home/hudson/hudson/jobs/ServiceMix3/modules/org.apache.servicemix.samples$camel/builds/2011-04-28_21-00-59/archive/org.apache.servicemix.samples/camel/3.4-SNAPSHOT/camel-3.4-SNAPSHOT-src.zip
[INFO] ------------------------------------------------------------------------
[INFO] Building ServiceMix :: Samples :: Camel :: Simple SU
[INFO]    task-segment: [clean, install]
[INFO] ------------------------------------------------------------------------
[INFO] [clean:clean {execution: default-clean}]
[INFO] Deleting file set: <https://builds.apache.org/hudson/job/ServiceMix3/ws/smx3/samples/camel/camel-simple-su/target>
(included: [**], excluded: [])
[INFO] [remote-resources:process {execution: default}]
[INFO] snapshot org.apache.servicemix:servicemix-camel:2011.02-SNAPSHOT: checking for updates
from apache.snapshots
[INFO] snapshot org.apache.servicemix:servicemix-camel:2011.02-SNAPSHOT: checking for updates
from smx.m2-repo
[INFO] snapshot org.apache.servicemix:servicemix-camel:2011.02-SNAPSHOT: checking for updates
from java.net
[INFO] snapshot org.apache.servicemix:servicemix-camel:2011.02-SNAPSHOT: checking for updates
from jboss
Downloading: http://repository.jboss.com/nexus/content/groups/public//org/apache/servicemix/servicemix-camel/2011.02-SNAPSHOT/servicemix-camel-2011.02-20110401.125329-7.pom
8K downloaded  (servicemix-camel-2011.02-20110401.125329-7.pom)
Downloading: http://svn.apache.org/repos/asf/servicemix/m2-repo//org/apache/camel/camel-core/2.7.0/camel-core-2.7.0.pom
[INFO] Unable to find resource 'org.apache.camel:camel-core:pom:2.7.0' in repository smx.m2-repo
(http://svn.apache.org/repos/asf/servicemix/m2-repo/)
Downloading: http://download.java.net/maven/2/org/apache/camel/camel-core/2.7.0/camel-core-2.7.0.pom
[INFO] Unable to find resource 'org.apache.camel:camel-core:pom:2.7.0' in repository java.net
(http://download.java.net/maven/2)
Downloading: http://repository.jboss.com/nexus/content/groups/public//org/apache/camel/camel-core/2.7.0/camel-core-2.7.0.pom
[INFO] Unable to find resource 'org.apache.camel:camel-core:pom:2.7.0' in repository jboss
(http://repository.jboss.com/nexus/content/groups/public/)
Downloading: http://svn.apache.org/repos/asf/servicemix/m2-repo//org/apache/camel/camel-core/2.7.0/camel-core-2.7.0.pom
[INFO] Unable to find resource 'org.apache.camel:camel-core:pom:2.7.0' in repository servicemix-m2-repo
(http://svn.apache.org/repos/asf/servicemix/m2-repo/)
Downloading: http://repo1.maven.org/maven2/org/apache/camel/camel-core/2.7.0/camel-core-2.7.0.pom

Downloading: http://svn.apache.org/repos/asf/servicemix/m2-repo//org/apache/camel/camel-parent/2.7.0/camel-parent-2.7.0.pom
[INFO] Unable to find resource 'org.apache.camel:camel-parent:pom:2.7.0' in repository smx.m2-repo
(http://svn.apache.org/repos/asf/servicemix/m2-repo/)
Downloading: http://download.java.net/maven/2/org/apache/camel/camel-parent/2.7.0/camel-parent-2.7.0.pom
[INFO] Unable to find resource 'org.apache.camel:camel-parent:pom:2.7.0' in repository java.net
(http://download.java.net/maven/2)
Downloading: http://repository.jboss.com/nexus/content/groups/public//org/apache/camel/camel-parent/2.7.0/camel-parent-2.7.0.pom
[INFO] Unable to find resource 'org.apache.camel:camel-parent:pom:2.7.0' in repository jboss
(http://repository.jboss.com/nexus/content/groups/public/)
Downloading: http://svn.apache.org/repos/asf/servicemix/m2-repo//org/apache/camel/camel-parent/2.7.0/camel-parent-2.7.0.pom
[INFO] Unable to find resource 'org.apache.camel:camel-parent:pom:2.7.0' in repository servicemix-m2-repo
(http://svn.apache.org/repos/asf/servicemix/m2-repo/)
Downloading: http://repo1.maven.org/maven2/org/apache/camel/camel-parent/2.7.0/camel-parent-2.7.0.pom

Downloading: http://svn.apache.org/repos/asf/servicemix/m2-repo//org/apache/camel/camel/2.7.0/camel-2.7.0.pom
[INFO] Unable to find resource 'org.apache.camel:camel:pom:2.7.0' in repository smx.m2-repo
(http://svn.apache.org/repos/asf/servicemix/m2-repo/)
Downloading: http://download.java.net/maven/2/org/apache/camel/camel/2.7.0/camel-2.7.0.pom
[INFO] Unable to find resource 'org.apache.camel:camel:pom:2.7.0' in repository java.net (http://download.java.net/maven/2)
Downloading: http://repository.jboss.com/nexus/content/groups/public//org/apache/camel/camel/2.7.0/camel-2.7.0.pom
[INFO] Unable to find resource 'org.apache.camel:camel:pom:2.7.0' in repository jboss (http://repository.jboss.com/nexus/content/groups/public/)
Downloading: http://svn.apache.org/repos/asf/servicemix/m2-repo//org/apache/camel/camel/2.7.0/camel-2.7.0.pom
[INFO] Unable to find resource 'org.apache.camel:camel:pom:2.7.0' in repository servicemix-m2-repo
(http://svn.apache.org/repos/asf/servicemix/m2-repo/)
Downloading: http://repo1.maven.org/maven2/org/apache/camel/camel/2.7.0/camel-2.7.0.pom

Downloading: http://svn.apache.org/repos/asf/servicemix/m2-repo//org/apache/camel/camel-spring/2.7.0/camel-spring-2.7.0.pom
[INFO] Unable to find resource 'org.apache.camel:camel-spring:pom:2.7.0' in repository smx.m2-repo
(http://svn.apache.org/repos/asf/servicemix/m2-repo/)
Downloading: http://download.java.net/maven/2/org/apache/camel/camel-spring/2.7.0/camel-spring-2.7.0.pom
[INFO] Unable to find resource 'org.apache.camel:camel-spring:pom:2.7.0' in repository java.net
(http://download.java.net/maven/2)
Downloading: http://repository.jboss.com/nexus/content/groups/public//org/apache/camel/camel-spring/2.7.0/camel-spring-2.7.0.pom
[INFO] Unable to find resource 'org.apache.camel:camel-spring:pom:2.7.0' in repository jboss
(http://repository.jboss.com/nexus/content/groups/public/)
Downloading: http://svn.apache.org/repos/asf/servicemix/m2-repo//org/apache/camel/camel-spring/2.7.0/camel-spring-2.7.0.pom
[INFO] Unable to find resource 'org.apache.camel:camel-spring:pom:2.7.0' in repository servicemix-m2-repo
(http://svn.apache.org/repos/asf/servicemix/m2-repo/)
Downloading: http://repo1.maven.org/maven2/org/apache/camel/camel-spring/2.7.0/camel-spring-2.7.0.pom

Downloading: http://svn.apache.org/repos/asf/servicemix/m2-repo//org/apache/camel/camel-core/2.7.0/camel-core-2.7.0.jar
Downloading: http://repository.jboss.com/nexus/content/groups/public//org/apache/servicemix/servicemix-camel/2011.02-SNAPSHOT/servicemix-camel-2011.02-20110401.125329-7.jar
[INFO] Unable to find resource 'org.apache.camel:camel-core:jar:2.7.0' in repository smx.m2-repo
(http://svn.apache.org/repos/asf/servicemix/m2-repo/)
Downloading: http://download.java.net/maven/2/org/apache/camel/camel-core/2.7.0/camel-core-2.7.0.jar
[INFO] Unable to find resource 'org.apache.camel:camel-core:jar:2.7.0' in repository java.net
(http://download.java.net/maven/2)
Downloading: http://repository.jboss.com/nexus/content/groups/public//org/apache/camel/camel-core/2.7.0/camel-core-2.7.0.jar
57K downloaded  (servicemix-camel-2011.02-20110401.125329-7.jar)
[INFO] Unable to find resource 'org.apache.camel:camel-core:jar:2.7.0' in repository jboss
(http://repository.jboss.com/nexus/content/groups/public/)
Downloading: http://svn.apache.org/repos/asf/servicemix/m2-repo//org/apache/camel/camel-core/2.7.0/camel-core-2.7.0.jar
[INFO] Unable to find resource 'org.apache.camel:camel-core:jar:2.7.0' in repository servicemix-m2-repo
(http://svn.apache.org/repos/asf/servicemix/m2-repo/)
Downloading: http://repo1.maven.org/maven2/org/apache/camel/camel-core/2.7.0/camel-core-2.7.0.jar

Downloading: http://svn.apache.org/repos/asf/servicemix/m2-repo//org/apache/camel/camel-spring/2.7.0/camel-spring-2.7.0.jar
[INFO] Unable to find resource 'org.apache.camel:camel-spring:jar:2.7.0' in repository smx.m2-repo
(http://svn.apache.org/repos/asf/servicemix/m2-repo/)
Downloading: http://download.java.net/maven/2/org/apache/camel/camel-spring/2.7.0/camel-spring-2.7.0.jar
[INFO] Unable to find resource 'org.apache.camel:camel-spring:jar:2.7.0' in repository java.net
(http://download.java.net/maven/2)
Downloading: http://repository.jboss.com/nexus/content/groups/public//org/apache/camel/camel-spring/2.7.0/camel-spring-2.7.0.jar
[INFO] Unable to find resource 'org.apache.camel:camel-spring:jar:2.7.0' in repository jboss
(http://repository.jboss.com/nexus/content/groups/public/)
Downloading: http://svn.apache.org/repos/asf/servicemix/m2-repo//org/apache/camel/camel-spring/2.7.0/camel-spring-2.7.0.jar
[INFO] Unable to find resource 'org.apache.camel:camel-spring:jar:2.7.0' in repository servicemix-m2-repo
(http://svn.apache.org/repos/asf/servicemix/m2-repo/)
Downloading: http://repo1.maven.org/maven2/org/apache/camel/camel-spring/2.7.0/camel-spring-2.7.0.jar

[INFO] [servicemix-build:copy {execution: default}]
[INFO] [resources:resources {execution: default-resources}]
[INFO] Using 'UTF-8' encoding to copy filtered resources.
[INFO] Copying 1 resource
[INFO] skip non existing resourceDirectory <https://builds.apache.org/hudson/job/ServiceMix3/ws/smx3/samples/camel/camel-simple-su/target/generated>
[INFO] Copying 3 resources
[INFO] [jbi:generate-depends-file {execution: default-generate-depends-file}]
[INFO] Created: <https://builds.apache.org/hudson/job/ServiceMix3/ws/smx3/samples/camel/camel-simple-su/target/classes/META-INF/maven/dependencies.properties>
[INFO] [compiler:compile {execution: default-compile}]
[INFO] Compiling 1 source file to <https://builds.apache.org/hudson/job/ServiceMix3/ws/smx3/samples/camel/camel-simple-su/target/classes>
[JENKINS] Archiving <https://builds.apache.org/hudson/job/ServiceMix3/ws/smx3/samples/camel/camel-simple-su/pom.xml>
to /home/hudson/hudson/jobs/ServiceMix3/modules/org.apache.servicemix.samples$camel-simple-su/builds/2011-04-28_21-00-59/archive/org.apache.servicemix.samples/camel-simple-su/3.4-SNAPSHOT/camel-simple-su-3.4-SNAPSHOT.pom
[INFO] ------------------------------------------------------------------------
[ERROR] BUILD FAILURE
[INFO] ------------------------------------------------------------------------
[INFO] Compilation failure
<https://builds.apache.org/hudson/job/ServiceMix3/ws/smx3/samples/camel/camel-simple-su/src/main/java/org/apache/servicemix/samples/MyRouteBuilder.java>:[19,-1]
cannot access org.apache.camel.Exchange
bad class file: <https://builds.apache.org/hudson/job/ServiceMix3/ws/.repository/org/apache/camel/camel-core/2.7.0/camel-core-2.7.0.jar(org/apache/camel/Exchange.class)>
class file has wrong version 50.0, should be 49.0


[INFO] ------------------------------------------------------------------------
[INFO] Trace
org.apache.maven.BuildFailureException: Compilation failure
<https://builds.apache.org/hudson/job/ServiceMix3/ws/smx3/samples/camel/camel-simple-su/src/main/java/org/apache/servicemix/samples/MyRouteBuilder.java>:[19,-1]
cannot access org.apache.camel.Exchange
bad class file: <https://builds.apache.org/hudson/job/ServiceMix3/ws/.repository/org/apache/camel/camel-core/2.7.0/camel-core-2.7.0.jar(org/apache/camel/Exchange.class)>
class file has wrong version 50.0, should be 49.0


	at org.apache.maven.lifecycle.DefaultLifecycleExecutor.executeGoals(DefaultLifecycleExecutor.java:715)
	at org.apache.maven.lifecycle.DefaultLifecycleExecutor.executeGoalWithLifecycle(DefaultLifecycleExecutor.java:556)
	at org.apache.maven.lifecycle.DefaultLifecycleExecutor.executeGoal(DefaultLifecycleExecutor.java:535)
	at org.apache.maven.lifecycle.DefaultLifecycleExecutor.executeGoalAndHandleFailures(DefaultLifecycleExecutor.java:387)
	at org.apache.maven.lifecycle.DefaultLifecycleExecutor.executeTaskSegments(DefaultLifecycleExecutor.java:348)
	at org.apache.maven.lifecycle.DefaultLifecycleExecutor.execute(DefaultLifecycleExecutor.java:180)
	at org.apache.maven.lifecycle.LifecycleExecutorInterceptor.execute(LifecycleExecutorInterceptor.java:65)
	at org.apache.maven.DefaultMaven.doExecute(DefaultMaven.java:328)
	at org.apache.maven.DefaultMaven.execute(DefaultMaven.java:138)
	at org.apache.maven.cli.MavenCli.main(MavenCli.java:362)
	at sun.reflect.NativeMethodAccessorImpl.invoke0(Native Method)
	at sun.reflect.NativeMethodAccessorImpl.invoke(NativeMethodAccessorImpl.java:39)
	at sun.reflect.DelegatingMethodAccessorImpl.invoke(DelegatingMethodAccessorImpl.java:25)
	at java.lang.reflect.Method.invoke(Method.java:592)
	at org.codehaus.classworlds.Launcher.launchEnhanced(Launcher.java:315)
	at org.codehaus.classworlds.Launcher.launch(Launcher.java:255)
	at hudson.maven.agent.Main.launch(Main.java:173)
	at hudson.maven.MavenBuilder.call(MavenBuilder.java:164)
	at hudson.maven.MavenModuleSetBuild$Builder.call(MavenModuleSetBuild.java:987)
	at hudson.maven.MavenModuleSetBuild$Builder.call(MavenModuleSetBuild.java:918)
	at hudson.remoting.UserRequest.perform(UserRequest.java:118)
	at hudson.remoting.UserRequest.perform(UserRequest.java:48)
	at hudson.remoting.Request$2.run(Request.java:270)
	at java.util.concurrent.Executors$RunnableAdapter.call(Executors.java:417)
	at java.util.concurrent.FutureTask$Sync.innerRun(FutureTask.java:269)
	at java.util.concurrent.FutureTask.run(FutureTask.java:123)
	at java.util.concurrent.ThreadPoolExecutor$Worker.runTask(ThreadPoolExecutor.java:651)
	at java.util.concurrent.ThreadPoolExecutor$Worker.run(ThreadPoolExecutor.java:676)
	at java.lang.Thread.run(Thread.java:595)
Caused by: org.apache.maven.plugin.CompilationFailureException: Compilation failure
<https://builds.apache.org/hudson/job/ServiceMix3/ws/smx3/samples/camel/camel-simple-su/src/main/java/org/apache/servicemix/samples/MyRouteBuilder.java>:[19,-1]
cannot access org.apache.camel.Exchange
bad class file: <https://builds.apache.org/hudson/job/ServiceMix3/ws/.repository/org/apache/camel/camel-core/2.7.0/camel-core-2.7.0.jar(org/apache/camel/Exchange.class)>
class file has wrong version 50.0, should be 49.0


	at org.apache.maven.plugin.AbstractCompilerMojo.execute(AbstractCompilerMojo.java:516)
	at org.apache.maven.plugin.CompilerMojo.execute(CompilerMojo.java:114)
	at org.apache.maven.plugin.DefaultPluginManager.executeMojo(DefaultPluginManager.java:490)
	at hudson.maven.agent.PluginManagerInterceptor.executeMojo(PluginManagerInterceptor.java:182)
	at org.apache.maven.lifecycle.DefaultLifecycleExecutor.executeGoals(DefaultLifecycleExecutor.java:694)
	... 28 more
[INFO] ------------------------------------------------------------------------
[INFO] Total time: 25 minutes 6 seconds
[INFO] Finished at: Thu Apr 28 13:26:33 GMT-08:00 2011
[INFO] Final Memory: 139M/193M
[INFO] ------------------------------------------------------------------------
Sending e-mails to: commits@servicemix.apache.org
Sending e-mails to: commits@servicemix.apache.org
channel stopped
[locks-and-latches] Releasing all the locks
[locks-and-latches] All the locks released


Mime
View raw message