servicemix-commits mailing list archives

Site index · List index
Message view « Date » · « Thread »
Top « Date » · « Thread »
From Apache Jenkins Server <hud...@hudson.apache.org>
Subject Build failed in Jenkins: ServiceMix3 » ServiceMix :: Samples :: Camel :: Simple SU #135
Date Mon, 02 May 2011 13:23:17 GMT
See <https://builds.apache.org/hudson/job/ServiceMix3/org.apache.servicemix.samples$camel-simple-su/135/>

------------------------------------------
[INFO] ------------------------------------------------------------------------
[INFO] Building ServiceMix :: Samples :: Camel :: Simple SU
[INFO]    task-segment: [clean, install]
[INFO] ------------------------------------------------------------------------
[INFO] [clean:clean {execution: default-clean}]
[INFO] Deleting file set: <https://builds.apache.org/hudson/job/ServiceMix3/org.apache.servicemix.samples$camel-simple-su/ws/target>
(included: [**], excluded: [])
[INFO] [remote-resources:process {execution: default}]
[INFO] snapshot org.apache.servicemix:servicemix-camel:2011.02-SNAPSHOT: checking for updates
from apache.snapshots
[INFO] snapshot org.apache.servicemix:servicemix-camel:2011.02-SNAPSHOT: checking for updates
from smx.m2-repo
[INFO] snapshot org.apache.servicemix:servicemix-camel:2011.02-SNAPSHOT: checking for updates
from java.net
[INFO] snapshot org.apache.servicemix:servicemix-camel:2011.02-SNAPSHOT: checking for updates
from jboss
[INFO] [servicemix-build:copy {execution: default}]
[INFO] [resources:resources {execution: default-resources}]
[INFO] Using 'UTF-8' encoding to copy filtered resources.
[INFO] Copying 1 resource
[INFO] skip non existing resourceDirectory <https://builds.apache.org/hudson/job/ServiceMix3/org.apache.servicemix.samples$camel-simple-su/ws/target/generated>
[INFO] Copying 3 resources
[INFO] [jbi:generate-depends-file {execution: default-generate-depends-file}]
[INFO] Created: <https://builds.apache.org/hudson/job/ServiceMix3/org.apache.servicemix.samples$camel-simple-su/ws/target/classes/META-INF/maven/dependencies.properties>
[INFO] [compiler:compile {execution: default-compile}]
[INFO] Compiling 1 source file to <https://builds.apache.org/hudson/job/ServiceMix3/org.apache.servicemix.samples$camel-simple-su/ws/target/classes>
[JENKINS] Archiving <https://builds.apache.org/hudson/job/ServiceMix3/org.apache.servicemix.samples$camel-simple-su/ws/pom.xml>
to /home/hudson/hudson/jobs/ServiceMix3/modules/org.apache.servicemix.samples$camel-simple-su/builds/2011-05-02_13-02-47/archive/org.apache.servicemix.samples/camel-simple-su/3.4-SNAPSHOT/camel-simple-su-3.4-SNAPSHOT.pom
[INFO] ------------------------------------------------------------------------
[ERROR] BUILD FAILURE
[INFO] ------------------------------------------------------------------------
[INFO] Compilation failure
<https://builds.apache.org/hudson/job/ServiceMix3/org.apache.servicemix.samples$camel-simple-su/ws/src/main/java/org/apache/servicemix/samples/MyRouteBuilder.java>:[19,-1]
cannot access org.apache.camel.Exchange
bad class file: /home/hudson/hudson-slave/workspace/ServiceMix3/.repository/org/apache/camel/camel-core/2.7.0/camel-core-2.7.0.jar(org/apache/camel/Exchange.class)
class file has wrong version 50.0, should be 49.0


[INFO] ------------------------------------------------------------------------
[INFO] Trace
org.apache.maven.BuildFailureException: Compilation failure
<https://builds.apache.org/hudson/job/ServiceMix3/org.apache.servicemix.samples$camel-simple-su/ws/src/main/java/org/apache/servicemix/samples/MyRouteBuilder.java>:[19,-1]
cannot access org.apache.camel.Exchange
bad class file: /home/hudson/hudson-slave/workspace/ServiceMix3/.repository/org/apache/camel/camel-core/2.7.0/camel-core-2.7.0.jar(org/apache/camel/Exchange.class)
class file has wrong version 50.0, should be 49.0


	at org.apache.maven.lifecycle.DefaultLifecycleExecutor.executeGoals(DefaultLifecycleExecutor.java:715)
	at org.apache.maven.lifecycle.DefaultLifecycleExecutor.executeGoalWithLifecycle(DefaultLifecycleExecutor.java:556)
	at org.apache.maven.lifecycle.DefaultLifecycleExecutor.executeGoal(DefaultLifecycleExecutor.java:535)
	at org.apache.maven.lifecycle.DefaultLifecycleExecutor.executeGoalAndHandleFailures(DefaultLifecycleExecutor.java:387)
	at org.apache.maven.lifecycle.DefaultLifecycleExecutor.executeTaskSegments(DefaultLifecycleExecutor.java:348)
	at org.apache.maven.lifecycle.DefaultLifecycleExecutor.execute(DefaultLifecycleExecutor.java:180)
	at org.apache.maven.lifecycle.LifecycleExecutorInterceptor.execute(LifecycleExecutorInterceptor.java:65)
	at org.apache.maven.DefaultMaven.doExecute(DefaultMaven.java:328)
	at org.apache.maven.DefaultMaven.execute(DefaultMaven.java:138)
	at org.apache.maven.cli.MavenCli.main(MavenCli.java:362)
	at sun.reflect.NativeMethodAccessorImpl.invoke0(Native Method)
	at sun.reflect.NativeMethodAccessorImpl.invoke(NativeMethodAccessorImpl.java:39)
	at sun.reflect.DelegatingMethodAccessorImpl.invoke(DelegatingMethodAccessorImpl.java:25)
	at java.lang.reflect.Method.invoke(Method.java:592)
	at org.codehaus.classworlds.Launcher.launchEnhanced(Launcher.java:315)
	at org.codehaus.classworlds.Launcher.launch(Launcher.java:255)
	at hudson.maven.agent.Main.launch(Main.java:173)
	at hudson.maven.MavenBuilder.call(MavenBuilder.java:164)
	at hudson.maven.MavenModuleSetBuild$Builder.call(MavenModuleSetBuild.java:987)
	at hudson.maven.MavenModuleSetBuild$Builder.call(MavenModuleSetBuild.java:918)
	at hudson.remoting.UserRequest.perform(UserRequest.java:118)
	at hudson.remoting.UserRequest.perform(UserRequest.java:48)
	at hudson.remoting.Request$2.run(Request.java:270)
	at java.util.concurrent.Executors$RunnableAdapter.call(Executors.java:417)
	at java.util.concurrent.FutureTask$Sync.innerRun(FutureTask.java:269)
	at java.util.concurrent.FutureTask.run(FutureTask.java:123)
	at java.util.concurrent.ThreadPoolExecutor$Worker.runTask(ThreadPoolExecutor.java:651)
	at java.util.concurrent.ThreadPoolExecutor$Worker.run(ThreadPoolExecutor.java:676)
	at java.lang.Thread.run(Thread.java:595)
Caused by: org.apache.maven.plugin.CompilationFailureException: Compilation failure
<https://builds.apache.org/hudson/job/ServiceMix3/org.apache.servicemix.samples$camel-simple-su/ws/src/main/java/org/apache/servicemix/samples/MyRouteBuilder.java>:[19,-1]
cannot access org.apache.camel.Exchange
bad class file: /home/hudson/hudson-slave/workspace/ServiceMix3/.repository/org/apache/camel/camel-core/2.7.0/camel-core-2.7.0.jar(org/apache/camel/Exchange.class)
class file has wrong version 50.0, should be 49.0


	at org.apache.maven.plugin.AbstractCompilerMojo.execute(AbstractCompilerMojo.java:516)
	at org.apache.maven.plugin.CompilerMojo.execute(CompilerMojo.java:114)
	at org.apache.maven.plugin.DefaultPluginManager.executeMojo(DefaultPluginManager.java:490)
	at hudson.maven.agent.PluginManagerInterceptor.executeMojo(PluginManagerInterceptor.java:182)
	at org.apache.maven.lifecycle.DefaultLifecycleExecutor.executeGoals(DefaultLifecycleExecutor.java:694)
	... 28 more
[INFO] ------------------------------------------------------------------------
[INFO] Total time: 20 minutes 1 second
[INFO] Finished at: Mon May 02 05:23:16 GMT-08:00 2011
[INFO] Final Memory: 139M/200M
[INFO] ------------------------------------------------------------------------


Mime
View raw message