servicemix-commits mailing list archives

Site index · List index
Message view « Date » · « Thread »
Top « Date » · « Thread »
From Apache Jenkins Server <jenk...@builds.apache.org>
Subject Build failed in Jenkins: ServiceMix3 #155
Date Wed, 20 Jul 2011 08:56:39 GMT
See <https://builds.apache.org/job/ServiceMix3/155/changes>

Changes:

[jbonofre] [SM-2048] Use slf4j as default logging system in place of commons-logging.

------------------------------------------
[...truncated 252 lines...]
U         web/servicemix-console/pom.xml
At revision 1148655
WARNING: clock of the subversion server appears to be out of sync. This can result in inconsistent
check out behavior.
ERROR: Ignore Problem expanding maven opts macros org.jenkinsci.plugins.tokenmacro.TokenMacro
Found mavenVersion 2.2.1 from file jar:file:/home/hudson/tools/maven/apache-maven-2.2.1/lib/maven-2.2.1-uber.jar!/META-INF/maven/org.apache.maven/maven-core/pom.properties
[locks-and-latches] Checking to see if we really have the locks
[locks-and-latches] Have all the locks, build can start
Parsing POMs
failed to transfer Unable to locate resource in repository
failed to transfer Unable to locate resource in repository
downloaded artifact http://repository.apache.org/snapshots//org/apache/servicemix/apache-servicemix-web/3.4-SNAPSHOT/maven-metadata.xml
downloaded artifact http://repository.jboss.com/nexus/content/groups/public//org/apache/servicemix/apache-servicemix-web/3.4-SNAPSHOT/maven-metadata.xml
failed to transfer Unable to locate resource in repository
failed to transfer Unable to locate resource in repository
downloaded artifact http://repository.apache.org/snapshots//org/apache/servicemix/assemblies/3.4-SNAPSHOT/maven-metadata.xml
downloaded artifact http://repository.jboss.com/nexus/content/groups/public//org/apache/servicemix/assemblies/3.4-SNAPSHOT/maven-metadata.xml
ERROR: Ignore Problem expanding maven opts macros org.jenkinsci.plugins.tokenmacro.TokenMacro
[smx3] $ /home/hudson/tools/java/latest1.6/bin/java -da -dsa -XX:MaxPermSize=192m -Xmx512M
-cp /home/jenkins/jenkins-slave/maven-agent.jar:/home/jenkins/jenkins-slave/classworlds.jar
hudson.maven.agent.Main /home/hudson/tools/maven/apache-maven-2.2.1 /x1/jenkins/jenkins-slave/slave.jar
/home/jenkins/jenkins-slave/maven-interceptor.jar 60911 /home/jenkins/jenkins-slave/maven2.1-interceptor.jar
<===[HUDSON REMOTING CAPACITY]===>   channel started
Executing Maven:  -B -f <https://builds.apache.org/job/ServiceMix3/ws/smx3/pom.xml>
-Dmaven.repo.local=<https://builds.apache.org/job/ServiceMix3/ws/.repository> -B -e
clean install
+ Error stacktraces are turned on.
[INFO] Scanning for projects...
[INFO] snapshot org.apache.servicemix:apache-servicemix-web:3.4-SNAPSHOT: checking for updates
from apache.snapshots
[INFO] snapshot org.apache.servicemix:apache-servicemix-web:3.4-SNAPSHOT: checking for updates
from smx.m2-repo
[INFO] snapshot org.apache.servicemix:apache-servicemix-web:3.4-SNAPSHOT: checking for updates
from java.net
[INFO] snapshot org.apache.servicemix:assemblies:3.4-SNAPSHOT: checking for updates from apache.snapshots
[INFO] snapshot org.apache.servicemix:assemblies:3.4-SNAPSHOT: checking for updates from smx.m2-repo
[INFO] snapshot org.apache.servicemix:assemblies:3.4-SNAPSHOT: checking for updates from java.net
[INFO] Reactor build order: 
[INFO]   ServiceMix
[INFO]   ServiceMix :: Parent
[INFO]   ServiceMix :: Core
[INFO]   ServiceMix :: Core
[INFO]   ServiceMix :: Audit
[INFO]   ServiceMix :: Common
[INFO]   ServiceMix :: Components
[INFO]   ServiceMix :: Service Engines
[INFO]   ServiceMix :: Lightweight container Service Engine
[INFO]   ServiceMix :: Deployables
[INFO]   ServiceMix :: ITests
[INFO]   ServiceMix :: Samples
[INFO]   ServiceMix :: Samples :: WSDL first
[INFO]   ServiceMix :: Samples :: WSDL first :: JSR181
[INFO]   ServiceMix :: Samples :: WSDL first :: HTTP
[INFO]   ServiceMix :: Samples :: WSDL first :: SA
[INFO]   ServiceMix :: Samples :: CXF WSDL first
[INFO]   ServiceMix :: Samples :: WSDL first :: CXF SE
[INFO]   ServiceMix :: Samples :: WSDL first :: CXF BC
[INFO]   ServiceMix :: Samples :: WSDL first :: SA
[INFO]   ServiceMix :: Samples :: Loan Broker
[INFO]   ServiceMix :: Samples :: Loan Broker :: Bean
[INFO]   ServiceMix :: Samples :: Loan Broker :: Drools
[INFO]   ServiceMix :: Samples :: Loan Broker :: Ode
[INFO]   ServiceMix :: Samples :: Loan Broker :: JMS
[INFO]   ServiceMix :: Samples :: Loan Broker :: SA
[INFO]   ServiceMix :: Samples :: Bridge
[INFO]   ServiceMix :: Samples :: Bridge :: HTTP
[INFO]   ServiceMix :: Samples :: Bridge :: EIP
[INFO]   ServiceMix :: Samples :: Bridge :: XSLT
[INFO]   ServiceMix :: Samples :: Bridge :: JMS
[INFO]   ServiceMix :: Samples :: Bridge :: SA
[INFO]   ServiceMix :: Samples :: Bridge :: SA :: iTest
[INFO]   ServiceMix :: Samples :: Bridge :: Camel
[INFO]   ServiceMix :: Samples :: Bridge :: Camel :: SU
[INFO]   ServiceMix :: Samples :: Bridge :: Camel :: SA
[INFO]   ServiceMix :: Samples :: Web
[INFO]   ServiceMix :: Samples :: Basic
[INFO]   ServiceMix :: Samples :: Camel
[INFO]   ServiceMix :: Samples :: Camel :: Simple SU
[INFO]   ServiceMix :: Samples :: Camel :: SA
[INFO]   ServiceMix :: Samples :: Camel :: SA :: iTest
[INFO]   ServiceMix :: Console
[INFO]   ServiceMix :: Web Console
[INFO]   ServiceMix :: Web Apps
[INFO]   ServiceMix :: Platforms
[INFO]   Servicemix :: Geronimo
[INFO]   ServiceMix :: Geronimo :: ServiceMix service
[INFO]   ServiceMix :: Geronimo :: Deployer service
[INFO]   ServiceMix :: Geronimo :: ServiceMix plugin
[INFO]   ServiceMix :: Geronimo :: Deployer plugin
[INFO]   Servicemix :: JBoss
[INFO]   ServiceMix :: JBoss :: Deployer
[INFO]   ServiceMix :: Assemblies
[INFO]   Servicemix :: Distribution
[INFO]   ServiceMix :: WebApp distribution
[INFO] ------------------------------------------------------------------------
[INFO] Building ServiceMix
[INFO]    task-segment: [clean, install]
[INFO] ------------------------------------------------------------------------
[INFO] [clean:clean {execution: default-clean}]
[INFO] Deleting file set: <https://builds.apache.org/job/ServiceMix3/ws/smx3/target>
(included: [**], excluded: [])
[INFO] Setting property: classpath.resource.loader.class => 'org.codehaus.plexus.velocity.ContextClassLoaderResourceLoader'.
[INFO] Setting property: velocimacro.messages.on => 'false'.
[INFO] Setting property: resource.loader => 'classpath'.
[INFO] Setting property: resource.manager.logwhenfound => 'false'.
[INFO] [remote-resources:process {execution: default}]
[INFO] [site:attach-descriptor {execution: default-attach-descriptor}]
[INFO] [install:install {execution: default-install}]
[INFO] Installing <https://builds.apache.org/job/ServiceMix3/ws/smx3/pom.xml> to <https://builds.apache.org/job/ServiceMix3/ws/.repository/org/apache/servicemix/servicemix/3.4-SNAPSHOT/servicemix-3.4-SNAPSHOT.pom>
[JENKINS] Archiving <https://builds.apache.org/job/ServiceMix3/ws/smx3/pom.xml> to /home/hudson/hudson/jobs/ServiceMix3/modules/org.apache.servicemix$servicemix/builds/2011-07-20_08-56-08/archive/org.apache.servicemix/servicemix/3.4-SNAPSHOT/servicemix-3.4-SNAPSHOT.pom
[INFO] ------------------------------------------------------------------------
[INFO] Building ServiceMix :: Parent
[INFO]    task-segment: [clean, install]
[INFO] ------------------------------------------------------------------------
[INFO] [clean:clean {execution: default-clean}]
[INFO] Deleting file set: <https://builds.apache.org/job/ServiceMix3/ws/smx3/parent/target>
(included: [**], excluded: [])
[INFO] Setting property: classpath.resource.loader.class => 'org.codehaus.plexus.velocity.ContextClassLoaderResourceLoader'.
[INFO] Setting property: velocimacro.messages.on => 'false'.
[INFO] Setting property: resource.loader => 'classpath'.
[INFO] Setting property: resource.manager.logwhenfound => 'false'.
[INFO] ************************************************************** 
[INFO] Starting Jakarta Velocity v1.4
[INFO] RuntimeInstance initializing.
[INFO] Default Properties File: org/apache/velocity/runtime/defaults/velocity.properties
[INFO] Default ResourceManager initializing. (class org.apache.velocity.runtime.resource.ResourceManagerImpl)
[INFO] Resource Loader Instantiated: org.codehaus.plexus.velocity.ContextClassLoaderResourceLoader
[INFO] ClasspathResourceLoader : initialization starting.
[INFO] ClasspathResourceLoader : initialization complete.
[INFO] ResourceCache : initialized. (class org.apache.velocity.runtime.resource.ResourceCacheImpl)
[INFO] Default ResourceManager initialization complete.
[INFO] Loaded System Directive: org.apache.velocity.runtime.directive.Literal
[INFO] Loaded System Directive: org.apache.velocity.runtime.directive.Macro
[INFO] Loaded System Directive: org.apache.velocity.runtime.directive.Parse
[INFO] Loaded System Directive: org.apache.velocity.runtime.directive.Include
[INFO] Loaded System Directive: org.apache.velocity.runtime.directive.Foreach
[INFO] Created: 20 parsers.
[INFO] Velocimacro : initialization starting.
[INFO] Velocimacro : adding VMs from VM library template : VM_global_library.vm
[ERROR] ResourceManager : unable to find resource 'VM_global_library.vm' in any resource loader.
[INFO] Velocimacro : error using  VM library template VM_global_library.vm : org.apache.velocity.exception.ResourceNotFoundException:
Unable to find resource 'VM_global_library.vm'
[INFO] Velocimacro :  VM library template macro registration complete.
[INFO] Velocimacro : allowInline = true : VMs can be defined inline in templates
[INFO] Velocimacro : allowInlineToOverride = false : VMs defined inline may NOT replace previous
VM definitions
[INFO] Velocimacro : allowInlineLocal = false : VMs defined inline will be  global in scope
if allowed.
[INFO] Velocimacro : initialization complete.
[INFO] Velocity successfully started.
[INFO] [checkstyle:checkstyle {execution: validate}]
[INFO] Source directory does not exist - skipping report.
[INFO] Preparing pmd:check
[JENKINS] Archiving <https://builds.apache.org/job/ServiceMix3/ws/smx3/parent/pom.xml>
to /home/hudson/hudson/jobs/ServiceMix3/modules/org.apache.servicemix$parent/builds/2011-07-20_08-56-08/archive/org.apache.servicemix/parent/3.4-SNAPSHOT/parent-3.4-SNAPSHOT.pom
[INFO] [pmd:pmd {execution: pmd}]
[INFO] [pmd:check {execution: validate}]
[INFO] [remote-resources:process {execution: default}]
[INFO] [site:attach-descriptor {execution: default-attach-descriptor}]
[INFO] [install:install {execution: default-install}]
[INFO] Installing <https://builds.apache.org/job/ServiceMix3/ws/smx3/parent/pom.xml>
to <https://builds.apache.org/job/ServiceMix3/ws/.repository/org/apache/servicemix/parent/3.4-SNAPSHOT/parent-3.4-SNAPSHOT.pom>
[INFO] ------------------------------------------------------------------------
[INFO] Building ServiceMix :: Core
[INFO]    task-segment: [clean, install]
[INFO] ------------------------------------------------------------------------
[INFO] [clean:clean {execution: default-clean}]
[INFO] Deleting file set: <https://builds.apache.org/job/ServiceMix3/ws/smx3/core/target>
(included: [**], excluded: [])
[INFO] [checkstyle:checkstyle {execution: validate}]
[INFO] Source directory does not exist - skipping report.
[INFO] Preparing pmd:check
[JENKINS] Archiving <https://builds.apache.org/job/ServiceMix3/ws/smx3/core/pom.xml>
to /home/hudson/hudson/jobs/ServiceMix3/modules/org.apache.servicemix$core/builds/2011-07-20_08-56-08/archive/org.apache.servicemix/core/3.4-SNAPSHOT/core-3.4-SNAPSHOT.pom
[INFO] [pmd:pmd {execution: pmd}]
[INFO] [pmd:check {execution: validate}]
[INFO] [remote-resources:process {execution: default}]
[INFO] [servicemix-build:copy {execution: default}]
[INFO] [site:attach-descriptor {execution: default-attach-descriptor}]
[INFO] [install:install {execution: default-install}]
[INFO] Installing <https://builds.apache.org/job/ServiceMix3/ws/smx3/core/pom.xml> to
<https://builds.apache.org/job/ServiceMix3/ws/.repository/org/apache/servicemix/core/3.4-SNAPSHOT/core-3.4-SNAPSHOT.pom>
[INFO] ------------------------------------------------------------------------
[INFO] Building ServiceMix :: Core
[INFO]    task-segment: [clean, install]
[INFO] ------------------------------------------------------------------------
[INFO] [clean:clean {execution: default-clean}]
[INFO] Deleting file set: <https://builds.apache.org/job/ServiceMix3/ws/smx3/core/servicemix-core/target>
(included: [**], excluded: [])
[INFO] snapshot org.apache.servicemix:servicemix-utils:1.5.0-SNAPSHOT: checking for updates
from smx.m2-repo
[INFO] snapshot org.apache.servicemix:servicemix-utils:1.5.0-SNAPSHOT: checking for updates
from java.net
[INFO] snapshot org.apache.servicemix:servicemix-utils:1.5.0-SNAPSHOT: checking for updates
from jboss
[INFO] snapshot org.apache.servicemix:servicemix-utils:1.5.0-SNAPSHOT: checking for updates
from apache.snapshots
Downloading: http://repository.apache.org/snapshots/org/apache/servicemix/servicemix-utils/1.5.0-SNAPSHOT/servicemix-utils-1.5.0-20110716.041523-21.pom
16K downloaded  (servicemix-utils-1.5.0-20110716.041523-21.pom)
[WARNING] While downloading ant:ant:1.7.0
  This artifact has been relocated to org.apache.ant:ant:1.7.0.


Downloading: http://repository.apache.org/snapshots/org/apache/servicemix/servicemix-utils/1.5.0-SNAPSHOT/servicemix-utils-1.5.0-20110716.041523-21.jar
234K downloaded  (servicemix-utils-1.5.0-20110716.041523-21.jar)
[INFO] [checkstyle:checkstyle {execution: validate}]
[INFO] Starting audit...
<https://builds.apache.org/job/ServiceMix3/ws/smx3/core/servicemix-core/src/main/java/org/apache/servicemix/jbi/nmr/flow/AbstractFlow.java>:54:21:
'static' modifier out of order with the JLS suggestions.
<https://builds.apache.org/job/ServiceMix3/ws/smx3/core/servicemix-core/src/main/java/org/apache/servicemix/jbi/util/DOMUtil.java>:36:
Wrong order for 'org.w3c.dom.Attr' import.
<https://builds.apache.org/job/ServiceMix3/ws/smx3/core/servicemix-core/src/main/java/org/apache/servicemix/jbi/util/FileVersionUtil.java>:22:
Wrong order for 'java.io.File' import.
Audit done.

[JENKINS] Archiving <https://builds.apache.org/job/ServiceMix3/ws/smx3/core/servicemix-core/pom.xml>
to /home/hudson/hudson/jobs/ServiceMix3/modules/org.apache.servicemix$servicemix-core/builds/2011-07-20_08-56-08/archive/org.apache.servicemix/servicemix-core/3.4-SNAPSHOT/servicemix-core-3.4-SNAPSHOT.pom
[INFO] ------------------------------------------------------------------------
[ERROR] BUILD ERROR
[INFO] ------------------------------------------------------------------------
[INFO] An error has occurred in Checkstyle report generation.

Embedded error: There are 3 checkstyle errors.
[INFO] ------------------------------------------------------------------------
[INFO] Trace
org.apache.maven.lifecycle.LifecycleExecutionException: An error has occurred in Checkstyle
report generation.
	at org.apache.maven.lifecycle.DefaultLifecycleExecutor.executeGoals(DefaultLifecycleExecutor.java:719)
	at org.apache.maven.lifecycle.DefaultLifecycleExecutor.executeGoalWithLifecycle(DefaultLifecycleExecutor.java:556)
	at org.apache.maven.lifecycle.DefaultLifecycleExecutor.executeGoal(DefaultLifecycleExecutor.java:535)
	at org.apache.maven.lifecycle.DefaultLifecycleExecutor.executeGoalAndHandleFailures(DefaultLifecycleExecutor.java:387)
	at org.apache.maven.lifecycle.DefaultLifecycleExecutor.executeTaskSegments(DefaultLifecycleExecutor.java:348)
	at org.apache.maven.lifecycle.DefaultLifecycleExecutor.execute(DefaultLifecycleExecutor.java:180)
	at org.apache.maven.lifecycle.LifecycleExecutorInterceptor.execute(LifecycleExecutorInterceptor.java:65)
	at org.apache.maven.DefaultMaven.doExecute(DefaultMaven.java:328)
	at org.apache.maven.DefaultMaven.execute(DefaultMaven.java:138)
	at org.apache.maven.cli.MavenCli.main(MavenCli.java:362)
	at sun.reflect.NativeMethodAccessorImpl.invoke0(Native Method)
	at sun.reflect.NativeMethodAccessorImpl.invoke(NativeMethodAccessorImpl.java:39)
	at sun.reflect.DelegatingMethodAccessorImpl.invoke(DelegatingMethodAccessorImpl.java:25)
	at java.lang.reflect.Method.invoke(Method.java:597)
	at org.codehaus.classworlds.Launcher.launchEnhanced(Launcher.java:315)
	at org.codehaus.classworlds.Launcher.launch(Launcher.java:255)
	at hudson.maven.agent.Main.launch(Main.java:185)
	at hudson.maven.MavenBuilder.call(MavenBuilder.java:164)
	at hudson.maven.MavenModuleSetBuild$Builder.call(MavenModuleSetBuild.java:987)
	at hudson.maven.MavenModuleSetBuild$Builder.call(MavenModuleSetBuild.java:918)
	at hudson.remoting.UserRequest.perform(UserRequest.java:118)
	at hudson.remoting.UserRequest.perform(UserRequest.java:48)
	at hudson.remoting.Request$2.run(Request.java:270)
	at java.util.concurrent.Executors$RunnableAdapter.call(Executors.java:441)
	at java.util.concurrent.FutureTask$Sync.innerRun(FutureTask.java:303)
	at java.util.concurrent.FutureTask.run(FutureTask.java:138)
	at java.util.concurrent.ThreadPoolExecutor$Worker.runTask(ThreadPoolExecutor.java:886)
	at java.util.concurrent.ThreadPoolExecutor$Worker.run(ThreadPoolExecutor.java:908)
	at java.lang.Thread.run(Thread.java:619)
Caused by: org.apache.maven.plugin.MojoExecutionException: An error has occurred in Checkstyle
report generation.
	at org.apache.maven.reporting.AbstractMavenReport.execute(AbstractMavenReport.java:79)
	at org.apache.maven.plugin.DefaultPluginManager.executeMojo(DefaultPluginManager.java:490)
	at hudson.maven.agent.PluginManagerInterceptor.executeMojo(PluginManagerInterceptor.java:182)
	at org.apache.maven.lifecycle.DefaultLifecycleExecutor.executeGoals(DefaultLifecycleExecutor.java:694)
	... 28 more
Caused by: org.apache.maven.reporting.MavenReportException: There are 3 checkstyle errors.
	at org.apache.maven.plugin.checkstyle.CheckstyleReport.executeCheckstyle(CheckstyleReport.java:955)
	at org.apache.maven.plugin.checkstyle.CheckstyleReport.executeReport(CheckstyleReport.java:635)
	at org.apache.maven.reporting.AbstractMavenReport.generate(AbstractMavenReport.java:98)
	at org.apache.maven.reporting.AbstractMavenReport.execute(AbstractMavenReport.java:73)
	... 31 more
[INFO] ------------------------------------------------------------------------
[INFO] Total time: 22 seconds
[INFO] Finished at: Wed Jul 20 08:50:12 UTC 2011
[INFO] Final Memory: 77M/241M
[INFO] ------------------------------------------------------------------------
Waiting for Jenkins to finish collecting data
Sending e-mails to: commits@servicemix.apache.org
channel stopped
[locks-and-latches] Releasing all the locks
[locks-and-latches] All the locks released


Mime
View raw message