servicemix-commits mailing list archives

Site index · List index
Message view « Date » · « Thread »
Top « Date » · « Thread »
From Apache Jenkins Server <jenk...@builds.apache.org>
Subject Build failed in Jenkins: ServiceMix-Bundles #367
Date Fri, 06 Apr 2012 01:22:25 GMT
See <https://builds.apache.org/job/ServiceMix-Bundles/367/changes>

Changes:

[jbonofre] [SMX4-1110] Fix warning messages in commons-pool 1.4 bundle
[SMX4-1122] Upgrade to bundles-pom 9-SNAPSHOT

[jbonofre] [SMX4-1119] Fix warning messages in commons-net 1.4.1 bundle
[SMX4-1122] Upgrade to bundles-pom 9-SNAPSHOT

[jbonofre] [SMX4-1119] Fix warning messages in commons-lang 2.4 bundle
[SMX4-1122] Upgrade to bundles-pom 9-SNAPSHOT

[jbonofre] [SMX4-1119] Fix warning messages in commons-jxpath 1.2 bundle
[SMX4-1122] Upgrade to bundles-pom 9-SNAPSHOT

[jbonofre] [SMX4-1119] Fix warning messages in commons-jexl 1.1 bundle
[SMX4-1122] Upgrade to bundles-pom 9-SNAPSHOT

[jbonofre] [SMX4-1119] Fix warning messages in commons-io 1.4 bundle
[SMX4-1122] Upgrade to bundles-pom 9-SNAPSHOT

[jbonofre] [SMX4-1119] Fix warning messages in commons-io 1.3.2 bundle
[SMX4-1122] Upgrade to bundles-pom 9-SNAPSHOT

------------------------------------------
[...truncated 2375 lines...]
[INFO] --- maven-bundle-plugin:2.3.7:install (default-install) @ org.apache.servicemix.bundles.bcpg-jdk15
---
[JENKINS] Archiving <https://builds.apache.org/job/ServiceMix-Bundles/ws/smx4-bundles/bcpg-jdk15-1.46/dependency-reduced-pom.xml>
to /home/hudson/hudson/jobs/ServiceMix-Bundles/modules/org.apache.servicemix.bundles$org.apache.servicemix.bundles.bcpg-jdk15/builds/2012-04-06_01-12-50/archive/org.apache.servicemix.bundles/org.apache.servicemix.bundles.bcpg-jdk15/1.46_3-SNAPSHOT/org.apache.servicemix.bundles.bcpg-jdk15-1.46_3-SNAPSHOT.pom
[JENKINS] Archiving <https://builds.apache.org/job/ServiceMix-Bundles/ws/smx4-bundles/bcpg-jdk15-1.46/target/org.apache.servicemix.bundles.bcpg-jdk15-1.46_3-SNAPSHOT.jar>
to /home/hudson/hudson/jobs/ServiceMix-Bundles/modules/org.apache.servicemix.bundles$org.apache.servicemix.bundles.bcpg-jdk15/builds/2012-04-06_01-12-50/archive/org.apache.servicemix.bundles/org.apache.servicemix.bundles.bcpg-jdk15/1.46_3-SNAPSHOT/org.apache.servicemix.bundles.bcpg-jdk15-1.46_3-SNAPSHOT.jar
[JENKINS] Archiving <https://builds.apache.org/job/ServiceMix-Bundles/ws/smx4-bundles/bcpg-jdk15-1.46/target/org.apache.servicemix.bundles.bcpg-jdk15-1.46_3-SNAPSHOT-sources.jar>
to /home/hudson/hudson/jobs/ServiceMix-Bundles/modules/org.apache.servicemix.bundles$org.apache.servicemix.bundles.bcpg-jdk15/builds/2012-04-06_01-12-50/archive/org.apache.servicemix.bundles/org.apache.servicemix.bundles.bcpg-jdk15/1.46_3-SNAPSHOT/org.apache.servicemix.bundles.bcpg-jdk15-1.46_3-SNAPSHOT-sources.jar
[INFO]                                                                         
[INFO] ------------------------------------------------------------------------
[INFO] Building Apache ServiceMix :: Bundles :: bcpg-jdk16 1.46_3-SNAPSHOT
[INFO] ------------------------------------------------------------------------
[INFO] Deleting file set: <https://builds.apache.org/job/ServiceMix-Bundles/ws/smx4-bundles/bcpg-jdk16-1.46/target>
(included: [**], excluded: [])
[INFO] 
[INFO] --- maven-clean-plugin:2.3:clean (default-clean) @ org.apache.servicemix.bundles.bcpg-jdk16
---
[INFO] Configured Artifact: org.apache.servicemix.legal:legal:1.0:xml
[INFO] [INFO] Copying legal-1.0.xml to <https://builds.apache.org/job/ServiceMix-Bundles/ws/smx4-bundles/bcpg-jdk16-1.46/target/legal/legal.xml>

[INFO] --- maven-dependency-plugin:2.3:copy (copy-legal) @ org.apache.servicemix.bundles.bcpg-jdk16
---
[INFO] 
[INFO] --- maven-remote-resources-plugin:1.2.1:process (default) @ org.apache.servicemix.bundles.bcpg-jdk16
---
[INFO] Using 'UTF-8' encoding to copy filtered resources.
[INFO] [INFO] Copying 1 resource
[INFO] Copying 3 resources

[INFO] --- maven-resources-plugin:2.4:resources (default-resources) @ org.apache.servicemix.bundles.bcpg-jdk16
---
[INFO] [INFO] No sources to compile

[INFO] --- maven-compiler-plugin:2.3.2:compile (default-compile) @ org.apache.servicemix.bundles.bcpg-jdk16
---
[INFO] [INFO] Using 'UTF-8' encoding to copy filtered resources.
[INFO] skip non existing resourceDirectory <https://builds.apache.org/job/ServiceMix-Bundles/ws/smx4-bundles/bcpg-jdk16-1.46/src/test/resources>
[INFO] Copying 3 resources

[INFO] --- maven-resources-plugin:2.4:testResources (default-testResources) @ org.apache.servicemix.bundles.bcpg-jdk16
---
[INFO] [INFO] No sources to compile

[INFO] --- maven-compiler-plugin:2.3.2:testCompile (default-testCompile) @ org.apache.servicemix.bundles.bcpg-jdk16
---
[INFO] [INFO] Tests are skipped.

[INFO] --- maven-surefire-plugin:2.9:test (default-test) @ org.apache.servicemix.bundles.bcpg-jdk16
---
[INFO] 
[INFO] --- maven-bundle-plugin:2.3.7:bundle (default-bundle) @ org.apache.servicemix.bundles.bcpg-jdk16
---
[INFO] [INFO] Excluding org.bouncycastle:bcpg-jdk16:jar:1.46 from the shaded jar.
[INFO] Excluding org.bouncycastle:bcprov-jdk16:jar:1.46 from the shaded jar.
[INFO] Including org.bouncycastle:bcpg-jdk16:jar:sources:1.46 in the shaded jar.

[INFO] --- maven-shade-plugin:1.4:shade (sources) @ org.apache.servicemix.bundles.bcpg-jdk16
---
[INFO] Attaching shaded artifact.
[INFO] [INFO] Including org.bouncycastle:bcpg-jdk16:jar:1.46 in the shaded jar.
[INFO] Excluding org.bouncycastle:bcprov-jdk16:jar:1.46 from the shaded jar.
[INFO] Including org.bouncycastle:bcpg-jdk16:jar:sources:1.46 in the shaded jar.

[INFO] --- maven-shade-plugin:1.4:shade (default) @ org.apache.servicemix.bundles.bcpg-jdk16
---
[INFO] Replacing original artifact with shaded artifact.
[INFO] Replacing <https://builds.apache.org/job/ServiceMix-Bundles/ws/smx4-bundles/bcpg-jdk16-1.46/target/org.apache.servicemix.bundles.bcpg-jdk16-1.46_3-SNAPSHOT.jar>
with <https://builds.apache.org/job/ServiceMix-Bundles/ws/smx4-bundles/bcpg-jdk16-1.46/target/org.apache.servicemix.bundles.bcpg-jdk16-1.46_3-SNAPSHOT-shaded.jar>
[INFO] [INFO] Installing <https://builds.apache.org/job/ServiceMix-Bundles/ws/smx4-bundles/bcpg-jdk16-1.46/target/org.apache.servicemix.bundles.bcpg-jdk16-1.46_3-SNAPSHOT.jar>
to <https://builds.apache.org/job/ServiceMix-Bundles/ws/.repository/org/apache/servicemix/bundles/org.apache.servicemix.bundles.bcpg-jdk16/1.46_3-SNAPSHOT/org.apache.servicemix.bundles.bcpg-jdk16-1.46_3-SNAPSHOT.jar>
[INFO] Installing <https://builds.apache.org/job/ServiceMix-Bundles/ws/smx4-bundles/bcpg-jdk16-1.46/dependency-reduced-pom.xml>
to <https://builds.apache.org/job/ServiceMix-Bundles/ws/.repository/org/apache/servicemix/bundles/org.apache.servicemix.bundles.bcpg-jdk16/1.46_3-SNAPSHOT/org.apache.servicemix.bundles.bcpg-jdk16-1.46_3-SNAPSHOT.pom>
[INFO] Installing <https://builds.apache.org/job/ServiceMix-Bundles/ws/smx4-bundles/bcpg-jdk16-1.46/target/org.apache.servicemix.bundles.bcpg-jdk16-1.46_3-SNAPSHOT-sources.jar>
to <https://builds.apache.org/job/ServiceMix-Bundles/ws/.repository/org/apache/servicemix/bundles/org.apache.servicemix.bundles.bcpg-jdk16/1.46_3-SNAPSHOT/org.apache.servicemix.bundles.bcpg-jdk16-1.46_3-SNAPSHOT-sources.jar>

[INFO] --- maven-install-plugin:2.3:install (default-install) @ org.apache.servicemix.bundles.bcpg-jdk16
---
[INFO] [INFO] Installing org/apache/servicemix/bundles/org.apache.servicemix.bundles.bcpg-jdk16/1.46_3-SNAPSHOT/org.apache.servicemix.bundles.bcpg-jdk16-1.46_3-SNAPSHOT.jar
[INFO] Installing org/apache/servicemix/bundles/org.apache.servicemix.bundles.bcpg-jdk16/1.46_3-SNAPSHOT/org.apache.servicemix.bundles.bcpg-jdk16-1.46_3-SNAPSHOT-sources.jar
[INFO] Writing OBR metadata

[INFO] --- maven-bundle-plugin:2.3.7:install (default-install) @ org.apache.servicemix.bundles.bcpg-jdk16
---
[JENKINS] Archiving <https://builds.apache.org/job/ServiceMix-Bundles/ws/smx4-bundles/bcpg-jdk16-1.46/dependency-reduced-pom.xml>
to /home/hudson/hudson/jobs/ServiceMix-Bundles/modules/org.apache.servicemix.bundles$org.apache.servicemix.bundles.bcpg-jdk16/builds/2012-04-06_01-12-50/archive/org.apache.servicemix.bundles/org.apache.servicemix.bundles.bcpg-jdk16/1.46_3-SNAPSHOT/org.apache.servicemix.bundles.bcpg-jdk16-1.46_3-SNAPSHOT.pom
[JENKINS] Archiving <https://builds.apache.org/job/ServiceMix-Bundles/ws/smx4-bundles/bcpg-jdk16-1.46/target/org.apache.servicemix.bundles.bcpg-jdk16-1.46_3-SNAPSHOT.jar>
to /home/hudson/hudson/jobs/ServiceMix-Bundles/modules/org.apache.servicemix.bundles$org.apache.servicemix.bundles.bcpg-jdk16/builds/2012-04-06_01-12-50/archive/org.apache.servicemix.bundles/org.apache.servicemix.bundles.bcpg-jdk16/1.46_3-SNAPSHOT/org.apache.servicemix.bundles.bcpg-jdk16-1.46_3-SNAPSHOT.jar
[JENKINS] Archiving <https://builds.apache.org/job/ServiceMix-Bundles/ws/smx4-bundles/bcpg-jdk16-1.46/target/org.apache.servicemix.bundles.bcpg-jdk16-1.46_3-SNAPSHOT-sources.jar>
to /home/hudson/hudson/jobs/ServiceMix-Bundles/modules/org.apache.servicemix.bundles$org.apache.servicemix.bundles.bcpg-jdk16/builds/2012-04-06_01-12-50/archive/org.apache.servicemix.bundles/org.apache.servicemix.bundles.bcpg-jdk16/1.46_3-SNAPSHOT/org.apache.servicemix.bundles.bcpg-jdk16-1.46_3-SNAPSHOT-sources.jar
[INFO]                                                                         
[INFO] ------------------------------------------------------------------------
[INFO] Building Apache ServiceMix :: Bundles :: bcprov-jdk15 1.46_4-SNAPSHOT
[INFO] ------------------------------------------------------------------------
[INFO] Deleting file set: <https://builds.apache.org/job/ServiceMix-Bundles/ws/smx4-bundles/bcprov-jdk15-1.46/target>
(included: [**], excluded: [])
[INFO] 
[INFO] --- maven-clean-plugin:2.3:clean (default-clean) @ org.apache.servicemix.bundles.bcprov-jdk15
---
[INFO] 
[INFO] --- maven-antrun-plugin:1.7:run (default) @ org.apache.servicemix.bundles.bcprov-jdk15
---
[INFO] Executing tasks

main:
     [echo] This bundle requires jar signing. In order to properly jar sign this bundle, you
     [echo]                                     will need the following:
     [echo]                                     1. Create a keystore using the keytool that
ships with your jdk.
     [echo]                                     keytool -genkeypair -alias [alias] -keyalg
RSA -keystore [path].
     [echo]                                     2. Add the required keystore properties [keystore,alias,keypass,storepass]
inside
     [echo]                                     your maven profile [settings.xml]
[INFO] Executed tasks
[INFO] [INFO] Configured Artifact: org.apache.servicemix.legal:legal:1.0:xml
[INFO] Copying legal-1.0.xml to <https://builds.apache.org/job/ServiceMix-Bundles/ws/smx4-bundles/bcprov-jdk15-1.46/target/legal/legal.xml>

[INFO] --- maven-dependency-plugin:2.3:copy (copy-legal) @ org.apache.servicemix.bundles.bcprov-jdk15
---
[INFO] 
[INFO] --- maven-remote-resources-plugin:1.2.1:process (default) @ org.apache.servicemix.bundles.bcprov-jdk15
---
[INFO] [INFO] Using 'UTF-8' encoding to copy filtered resources.
[INFO] Copying 1 resource
[INFO] Copying 3 resources

[INFO] --- maven-resources-plugin:2.4:resources (default-resources) @ org.apache.servicemix.bundles.bcprov-jdk15
---
[INFO] [INFO] No sources to compile

[INFO] --- maven-compiler-plugin:2.3.2:compile (default-compile) @ org.apache.servicemix.bundles.bcprov-jdk15
---
[INFO] [INFO] Using 'UTF-8' encoding to copy filtered resources.
[INFO] skip non existing resourceDirectory <https://builds.apache.org/job/ServiceMix-Bundles/ws/smx4-bundles/bcprov-jdk15-1.46/src/test/resources>
[INFO] Copying 3 resources

[INFO] --- maven-resources-plugin:2.4:testResources (default-testResources) @ org.apache.servicemix.bundles.bcprov-jdk15
---
[INFO] [INFO] No sources to compile

[INFO] --- maven-compiler-plugin:2.3.2:testCompile (default-testCompile) @ org.apache.servicemix.bundles.bcprov-jdk15
---
[INFO] [INFO] Tests are skipped.

[INFO] --- maven-surefire-plugin:2.9:test (default-test) @ org.apache.servicemix.bundles.bcprov-jdk15
---
[INFO] 
[INFO] --- maven-bundle-plugin:2.3.7:bundle (default-bundle) @ org.apache.servicemix.bundles.bcprov-jdk15
---
[INFO] Excluding org.bouncycastle:bcprov-jdk15:jar:1.46 from the shaded jar.
[INFO] Including org.bouncycastle:bcprov-jdk15:jar:sources:1.46 in the shaded jar.
[INFO] 
[INFO] --- maven-shade-plugin:1.4:shade (sources) @ org.apache.servicemix.bundles.bcprov-jdk15
---
[INFO] Attaching shaded artifact.
[INFO] [INFO] Including org.bouncycastle:bcprov-jdk15:jar:1.46 in the shaded jar.
[INFO] Including org.bouncycastle:bcprov-jdk15:jar:sources:1.46 in the shaded jar.

[INFO] --- maven-shade-plugin:1.4:shade (default) @ org.apache.servicemix.bundles.bcprov-jdk15
---
[INFO] Replacing original artifact with shaded artifact.
[INFO] Replacing <https://builds.apache.org/job/ServiceMix-Bundles/ws/smx4-bundles/bcprov-jdk15-1.46/target/org.apache.servicemix.bundles.bcprov-jdk15-1.46_4-SNAPSHOT.jar>
with <https://builds.apache.org/job/ServiceMix-Bundles/ws/smx4-bundles/bcprov-jdk15-1.46/target/org.apache.servicemix.bundles.bcprov-jdk15-1.46_4-SNAPSHOT-shaded.jar>
[INFO] 
[INFO] --- maven-jarsigner-plugin:1.2:sign (package) @ org.apache.servicemix.bundles.bcprov-jdk15
---
[JENKINS] Archiving <https://builds.apache.org/job/ServiceMix-Bundles/ws/smx4-bundles/bcprov-jdk15-1.46/dependency-reduced-pom.xml>
to /home/hudson/hudson/jobs/ServiceMix-Bundles/modules/org.apache.servicemix.bundles$org.apache.servicemix.bundles.bcprov-jdk15/builds/2012-04-06_01-12-50/archive/org.apache.servicemix.bundles/org.apache.servicemix.bundles.bcprov-jdk15/1.46_4-SNAPSHOT/org.apache.servicemix.bundles.bcprov-jdk15-1.46_4-SNAPSHOT.pom
[JENKINS] Archiving <https://builds.apache.org/job/ServiceMix-Bundles/ws/smx4-bundles/bcprov-jdk15-1.46/target/org.apache.servicemix.bundles.bcprov-jdk15-1.46_4-SNAPSHOT.jar>
to /home/hudson/hudson/jobs/ServiceMix-Bundles/modules/org.apache.servicemix.bundles$org.apache.servicemix.bundles.bcprov-jdk15/builds/2012-04-06_01-12-50/archive/org.apache.servicemix.bundles/org.apache.servicemix.bundles.bcprov-jdk15/1.46_4-SNAPSHOT/org.apache.servicemix.bundles.bcprov-jdk15-1.46_4-SNAPSHOT.jar
[JENKINS] Archiving <https://builds.apache.org/job/ServiceMix-Bundles/ws/smx4-bundles/bcprov-jdk15-1.46/target/org.apache.servicemix.bundles.bcprov-jdk15-1.46_4-SNAPSHOT-sources.jar>
to /home/hudson/hudson/jobs/ServiceMix-Bundles/modules/org.apache.servicemix.bundles$org.apache.servicemix.bundles.bcprov-jdk15/builds/2012-04-06_01-12-50/archive/org.apache.servicemix.bundles/org.apache.servicemix.bundles.bcprov-jdk15/1.46_4-SNAPSHOT/org.apache.servicemix.bundles.bcprov-jdk15-1.46_4-SNAPSHOT-sources.jar
[INFO] ------------------------------------------------------------------------
[INFO] Reactor Summary:
[INFO] 
[INFO] Apache ServiceMix :: Bundles ...................... SUCCESS [27.800s]
[INFO] Apache ServiceMix :: Bundles :: ezmorph ........... SUCCESS [4.076s]
[INFO] Apache ServiceMix :: Bundles :: json-lib .......... SUCCESS [2.409s]
[INFO] Apache ServiceMix :: Bundles :: quartz ............ SUCCESS [3.460s]
[INFO] Apache ServiceMix :: Bundles :: quartz ............ SUCCESS [2.782s]
[INFO] Apache ServiceMix :: Bundles :: jung-api .......... SUCCESS [1.846s]
[INFO] Apache ServiceMix :: Bundles :: jung-graph-impl ... SUCCESS [1.999s]
[INFO] Apache ServiceMix :: Bundles :: ant ............... SUCCESS [4.745s]
[INFO] Apache ServiceMix :: Bundles :: antlr ............. SUCCESS [2.338s]
[INFO] Apache ServiceMix :: Bundles :: antlr ............. SUCCESS [2.883s]
[INFO] Apache ServiceMix :: Bundles :: antlr ............. SUCCESS [4.220s]
[INFO] Apache ServiceMix :: Bundles :: antlr-runtime ..... SUCCESS [2.403s]
[INFO] Apache ServiceMix :: Bundles :: antlr-runtime ..... SUCCESS [3.379s]
[INFO] Apache ServiceMix :: Bundles :: antlr-runtime ..... SUCCESS [2.233s]
[INFO] Apache ServiceMix :: Bundles :: aopalliance ....... SUCCESS [1.683s]
[INFO] Apache ServiceMix :: Bundles :: asm ............... SUCCESS [2.152s]
[INFO] Apache ServiceMix :: Bundles :: asm ............... SUCCESS [2.740s]
[INFO] Apache ServiceMix :: Bundles :: asm ............... SUCCESS [2.464s]
[INFO] Apache ServiceMix :: Bundles :: asm ............... SUCCESS [2.232s]
[INFO] Apache ServiceMix :: Bundles :: aspectj ........... SUCCESS [4.408s]
[INFO] Apache ServiceMix :: Bundles :: aspectj ........... SUCCESS [4.924s]
[INFO] Apache ServiceMix :: Bundles :: Atlassian XMLRPC .. SUCCESS [2.338s]
[INFO] Apache ServiceMix :: Bundles :: avalon-framework .. SUCCESS [2.096s]
[INFO] Apache ServiceMix :: Bundles :: avro .............. SUCCESS [3.351s]
[INFO] Apache ServiceMix :: Bundles :: avro .............. SUCCESS [4.120s]
[INFO] Apache ServiceMix :: Bundles :: avro-ipc .......... SUCCESS [3.315s]
[INFO] Apache ServiceMix :: Bundles :: avro-ipc .......... SUCCESS [4.186s]
[INFO] Apache ServiceMix :: Bundles :: aws-java-sdk ...... SUCCESS [15.042s]
[INFO] Apache ServiceMix :: Bundles :: aws-java-sdk ...... SUCCESS [15.114s]
[INFO] Apache ServiceMix :: Bundles :: aws-java-sdk ...... SUCCESS [13.379s]
[INFO] Apache ServiceMix :: Bundles :: axiom-api ......... SUCCESS [3.010s]
[INFO] Apache ServiceMix :: Bundles :: axiom-impl ........ SUCCESS [3.143s]
[INFO] Apache ServiceMix :: Bundles :: batik ............. SUCCESS [8.016s]
[INFO] Apache ServiceMix :: Bundles :: bcel .............. SUCCESS [2.487s]
[INFO] Apache ServiceMix :: Bundles :: bcpg-jdk15 ........ SUCCESS [5.543s]
[INFO] Apache ServiceMix :: Bundles :: bcpg-jdk16 ........ SUCCESS [6.552s]
[INFO] Apache ServiceMix :: Bundles :: bcprov-jdk15 ...... FAILURE [6.072s]
[INFO] Apache ServiceMix :: Bundles :: bcprov-jdk16 ...... SKIPPED
[INFO] Apache ServiceMix :: Bundles :: beanio ............ SKIPPED
[INFO] Apache ServiceMix :: Bundles :: beanlib ........... SKIPPED
[INFO] Apache ServiceMix :: Bundles :: casbah ............ SKIPPED
[INFO] Apache ServiceMix :: Bundles :: castor ............ SKIPPED
[INFO] Apache ServiceMix :: Bundles :: castor ............ SKIPPED
[INFO] Apache ServiceMix :: Bundles :: castor ............ SKIPPED
[INFO] Apache ServiceMix :: Bundles :: cglib ............. SKIPPED
[INFO] Apache ServiceMix :: Bundles :: cglib ............. SKIPPED
[INFO] Apache ServiceMix :: Bundles :: cglib ............. SKIPPED
[INFO] Apache ServiceMix :: Bundles :: collections-generic  SKIPPED
[INFO] Apache ServiceMix :: Bundles :: colt .............. SKIPPED
[INFO] Apache ServiceMix :: Bundles :: cometd-java-server  SKIPPED
[INFO] Apache ServiceMix :: Bundles :: cometd-java-server  SKIPPED
[INFO] Apache ServiceMix :: Bundles :: commons-attributes  SKIPPED
[INFO] Apache ServiceMix :: Bundles :: commons-beanutils . SKIPPED
[INFO] Apache ServiceMix :: Bundles :: commons-beanutils . SKIPPED
[INFO] Apache ServiceMix :: Bundles :: commons-beanutils . SKIPPED
[INFO] Apache ServiceMix :: Bundles :: commons-codec ..... SKIPPED
[INFO] Apache ServiceMix :: Bundles :: commons-codec ..... SKIPPED
[INFO] Apache ServiceMix :: Bundles :: commons-collections  SKIPPED
[INFO] Apache ServiceMix :: Bundles :: commons-configuration  SKIPPED
[INFO] Apache ServiceMix :: Bundles :: commons-csv ....... SKIPPED
[INFO] Apache ServiceMix :: Bundles :: commons-dbcp ...... SKIPPED
[INFO] Apache ServiceMix :: Bundles :: commons-dbcp ...... SKIPPED
[INFO] Apache ServiceMix :: Bundles :: commons-dbcp ...... SKIPPED
[INFO] Apache ServiceMix :: Bundles :: commons-digester .. SKIPPED
[INFO] Apache ServiceMix :: Bundles :: commons-httpclient  SKIPPED
[INFO] Apache ServiceMix :: Bundles :: commons-io ........ SKIPPED
[INFO] Apache ServiceMix :: Bundles :: commons-io ........ SKIPPED
[INFO] Apache ServiceMix :: Bundles :: commons-jexl ...... SKIPPED
[INFO] Apache ServiceMix :: Bundles :: commons-jxpath .... SKIPPED
[INFO] Apache ServiceMix :: Bundles :: commons-lang ...... SKIPPED
[INFO] Apache ServiceMix :: Bundles :: commons-net ....... SKIPPED
[INFO] Apache ServiceMix :: Bundles :: commons-pool ...... SKIPPED
[INFO] Apache ServiceMix :: Bundles ...................... SKIPPED
[INFO] ------------------------------------------------------------------------
[INFO] BUILD FAILURE
[INFO] ------------------------------------------------------------------------
[INFO] Total time: 9:13.171s
[INFO] Finished at: Fri Apr 06 01:22:22 UTC 2012
[INFO] Final Memory: 29M/96M
[INFO] ------------------------------------------------------------------------
mavenExecutionResult exceptions not empty
message : Failed to execute goal org.apache.maven.plugins:maven-jarsigner-plugin:1.2:sign
(package) on project org.apache.servicemix.bundles.bcprov-jdk15: The parameters 'alias' for
goal org.apache.maven.plugins:maven-jarsigner-plugin:1.2:sign are missing or invalid
cause : The parameters 'alias' for goal org.apache.maven.plugins:maven-jarsigner-plugin:1.2:sign
are missing or invalid
Stack trace : 
org.apache.maven.lifecycle.LifecycleExecutionException: Failed to execute goal org.apache.maven.plugins:maven-jarsigner-plugin:1.2:sign
(package) on project org.apache.servicemix.bundles.bcprov-jdk15: The parameters 'alias' for
goal org.apache.maven.plugins:maven-jarsigner-plugin:1.2:sign are missing or invalid
	at org.apache.maven.lifecycle.internal.MojoExecutor.execute(MojoExecutor.java:221)
	at org.apache.maven.lifecycle.internal.MojoExecutor.execute(MojoExecutor.java:153)
	at org.apache.maven.lifecycle.internal.MojoExecutor.execute(MojoExecutor.java:145)
	at org.apache.maven.lifecycle.internal.LifecycleModuleBuilder.buildProject(LifecycleModuleBuilder.java:84)
	at org.apache.maven.lifecycle.internal.LifecycleModuleBuilder.buildProject(LifecycleModuleBuilder.java:59)
	at org.apache.maven.lifecycle.internal.LifecycleStarter.singleThreadedBuild(LifecycleStarter.java:183)
	at org.apache.maven.lifecycle.internal.LifecycleStarter.execute(LifecycleStarter.java:161)
	at org.apache.maven.DefaultMaven.doExecute(DefaultMaven.java:319)
	at org.apache.maven.DefaultMaven.execute(DefaultMaven.java:156)
	at org.jvnet.hudson.maven3.launcher.Maven3Launcher.main(Maven3Launcher.java:79)
	at sun.reflect.NativeMethodAccessorImpl.invoke0(Native Method)
	at sun.reflect.NativeMethodAccessorImpl.invoke(NativeMethodAccessorImpl.java:39)
	at sun.reflect.DelegatingMethodAccessorImpl.invoke(DelegatingMethodAccessorImpl.java:25)
	at java.lang.reflect.Method.invoke(Method.java:597)
	at org.codehaus.plexus.classworlds.launcher.Launcher.launchStandard(Launcher.java:329)
	at org.codehaus.plexus.classworlds.launcher.Launcher.launch(Launcher.java:239)
	at org.jvnet.hudson.maven3.agent.Maven3Main.launch(Maven3Main.java:158)
	at hudson.maven.Maven3Builder.call(Maven3Builder.java:104)
	at hudson.maven.Maven3Builder.call(Maven3Builder.java:70)
	at hudson.remoting.UserRequest.perform(UserRequest.java:118)
	at hudson.remoting.UserRequest.perform(UserRequest.java:48)
	at hudson.remoting.Request$2.run(Request.java:287)
	at hudson.remoting.InterceptingExecutorService$1.call(InterceptingExecutorService.java:72)
	at java.util.concurrent.FutureTask$Sync.innerRun(FutureTask.java:303)
	at java.util.concurrent.FutureTask.run(FutureTask.java:138)
	at java.util.concurrent.ThreadPoolExecutor$Worker.runTask(ThreadPoolExecutor.java:886)
	at java.util.concurrent.ThreadPoolExecutor$Worker.run(ThreadPoolExecutor.java:908)
	at java.lang.Thread.run(Thread.java:662)
Caused by: org.apache.maven.plugin.PluginParameterException: The parameters 'alias' for goal
org.apache.maven.plugins:maven-jarsigner-plugin:1.2:sign are missing or invalid
	at org.apache.maven.plugin.internal.DefaultMavenPluginManager.populatePluginFields(DefaultMavenPluginManager.java:576)
	at org.apache.maven.plugin.internal.DefaultMavenPluginManager.getConfiguredMojo(DefaultMavenPluginManager.java:529)
	at org.apache.maven.plugin.DefaultBuildPluginManager.executeMojo(DefaultBuildPluginManager.java:92)
	at org.apache.maven.lifecycle.internal.MojoExecutor.execute(MojoExecutor.java:209)
	... 27 more
channel stopped

Mime
View raw message