servicemix-commits mailing list archives

Site index · List index
Message view « Date » · « Thread »
Top « Date » · « Thread »
From Apache Jenkins Server <jenk...@builds.apache.org>
Subject Build failed in Jenkins: ServiceMix-Bundles #366
Date Thu, 05 Apr 2012 17:02:40 GMT
See <https://builds.apache.org/job/ServiceMix-Bundles/366/>

------------------------------------------
[...truncated 6827 lines...]

[INFO] --- maven-surefire-plugin:2.9:test (default-test) @ org.apache.servicemix.bundles.bcpg-jdk16
---
[INFO] 
[INFO] --- maven-bundle-plugin:2.3.7:bundle (default-bundle) @ org.apache.servicemix.bundles.bcpg-jdk16
---
[INFO] Excluding org.bouncycastle:bcpg-jdk16:jar:1.46 from the shaded jar.
[INFO] [INFO] Excluding org.bouncycastle:bcprov-jdk16:jar:1.46 from the shaded jar.
[INFO] Including org.bouncycastle:bcpg-jdk16:jar:sources:1.46 in the shaded jar.

[INFO] Attaching shaded artifact.
[INFO] --- maven-shade-plugin:1.4:shade (sources) @ org.apache.servicemix.bundles.bcpg-jdk16
---
[INFO] [INFO] Including org.bouncycastle:bcpg-jdk16:jar:1.46 in the shaded jar.
[INFO] Excluding org.bouncycastle:bcprov-jdk16:jar:1.46 from the shaded jar.
[INFO] Including org.bouncycastle:bcpg-jdk16:jar:sources:1.46 in the shaded jar.

[INFO] --- maven-shade-plugin:1.4:shade (default) @ org.apache.servicemix.bundles.bcpg-jdk16
---
[INFO] Replacing original artifact with shaded artifact.
[INFO] Replacing <https://builds.apache.org/job/ServiceMix-Bundles/ws/smx4-bundles/bcpg-jdk16-1.46/target/org.apache.servicemix.bundles.bcpg-jdk16-1.46_3-SNAPSHOT.jar>
with <https://builds.apache.org/job/ServiceMix-Bundles/ws/smx4-bundles/bcpg-jdk16-1.46/target/org.apache.servicemix.bundles.bcpg-jdk16-1.46_3-SNAPSHOT-shaded.jar>
[INFO] [INFO] Installing <https://builds.apache.org/job/ServiceMix-Bundles/ws/smx4-bundles/bcpg-jdk16-1.46/target/org.apache.servicemix.bundles.bcpg-jdk16-1.46_3-SNAPSHOT.jar>
to <https://builds.apache.org/job/ServiceMix-Bundles/ws/.repository/org/apache/servicemix/bundles/org.apache.servicemix.bundles.bcpg-jdk16/1.46_3-SNAPSHOT/org.apache.servicemix.bundles.bcpg-jdk16-1.46_3-SNAPSHOT.jar>
[INFO] Installing <https://builds.apache.org/job/ServiceMix-Bundles/ws/smx4-bundles/bcpg-jdk16-1.46/dependency-reduced-pom.xml>
to <https://builds.apache.org/job/ServiceMix-Bundles/ws/.repository/org/apache/servicemix/bundles/org.apache.servicemix.bundles.bcpg-jdk16/1.46_3-SNAPSHOT/org.apache.servicemix.bundles.bcpg-jdk16-1.46_3-SNAPSHOT.pom>
[INFO] Installing <https://builds.apache.org/job/ServiceMix-Bundles/ws/smx4-bundles/bcpg-jdk16-1.46/target/org.apache.servicemix.bundles.bcpg-jdk16-1.46_3-SNAPSHOT-sources.jar>
to <https://builds.apache.org/job/ServiceMix-Bundles/ws/.repository/org/apache/servicemix/bundles/org.apache.servicemix.bundles.bcpg-jdk16/1.46_3-SNAPSHOT/org.apache.servicemix.bundles.bcpg-jdk16-1.46_3-SNAPSHOT-sources.jar>

[INFO] --- maven-install-plugin:2.3:install (default-install) @ org.apache.servicemix.bundles.bcpg-jdk16
---
[INFO] [INFO] Installing org/apache/servicemix/bundles/org.apache.servicemix.bundles.bcpg-jdk16/1.46_3-SNAPSHOT/org.apache.servicemix.bundles.bcpg-jdk16-1.46_3-SNAPSHOT.jar
[INFO] Installing org/apache/servicemix/bundles/org.apache.servicemix.bundles.bcpg-jdk16/1.46_3-SNAPSHOT/org.apache.servicemix.bundles.bcpg-jdk16-1.46_3-SNAPSHOT-sources.jar
[INFO] Writing OBR metadata

[INFO] --- maven-bundle-plugin:2.3.7:install (default-install) @ org.apache.servicemix.bundles.bcpg-jdk16
---
[JENKINS] Archiving <https://builds.apache.org/job/ServiceMix-Bundles/ws/smx4-bundles/bcpg-jdk16-1.46/dependency-reduced-pom.xml>
to /home/hudson/hudson/jobs/ServiceMix-Bundles/modules/org.apache.servicemix.bundles$org.apache.servicemix.bundles.bcpg-jdk16/builds/2012-04-05_16-44-27/archive/org.apache.servicemix.bundles/org.apache.servicemix.bundles.bcpg-jdk16/1.46_3-SNAPSHOT/org.apache.servicemix.bundles.bcpg-jdk16-1.46_3-SNAPSHOT.pom
[JENKINS] Archiving <https://builds.apache.org/job/ServiceMix-Bundles/ws/smx4-bundles/bcpg-jdk16-1.46/target/org.apache.servicemix.bundles.bcpg-jdk16-1.46_3-SNAPSHOT.jar>
to /home/hudson/hudson/jobs/ServiceMix-Bundles/modules/org.apache.servicemix.bundles$org.apache.servicemix.bundles.bcpg-jdk16/builds/2012-04-05_16-44-27/archive/org.apache.servicemix.bundles/org.apache.servicemix.bundles.bcpg-jdk16/1.46_3-SNAPSHOT/org.apache.servicemix.bundles.bcpg-jdk16-1.46_3-SNAPSHOT.jar
[JENKINS] Archiving <https://builds.apache.org/job/ServiceMix-Bundles/ws/smx4-bundles/bcpg-jdk16-1.46/target/org.apache.servicemix.bundles.bcpg-jdk16-1.46_3-SNAPSHOT-sources.jar>
to /home/hudson/hudson/jobs/ServiceMix-Bundles/modules/org.apache.servicemix.bundles$org.apache.servicemix.bundles.bcpg-jdk16/builds/2012-04-05_16-44-27/archive/org.apache.servicemix.bundles/org.apache.servicemix.bundles.bcpg-jdk16/1.46_3-SNAPSHOT/org.apache.servicemix.bundles.bcpg-jdk16-1.46_3-SNAPSHOT-sources.jar
[INFO] Downloading: http://repo1.maven.org/maven2/org/apache/maven/plugins/maven-jarsigner-plugin/1.2/maven-jarsigner-plugin-1.2.pom
                                                                        
[INFO] ------------------------------------------------------------------------
[INFO] Building Apache ServiceMix :: Bundles :: bcprov-jdk15 1.46_4-SNAPSHOT
[INFO] ------------------------------------------------------------------------
Downloaded: http://repo1.maven.org/maven2/org/apache/maven/plugins/maven-jarsigner-plugin/1.2/maven-jarsigner-plugin-1.2.pom
(6 KB at 14.5 KB/sec)
Downloading: http://repo1.maven.org/maven2/org/apache/maven/plugins/maven-plugins/14/maven-plugins-14.pom
Downloaded: http://repo1.maven.org/maven2/org/apache/maven/plugins/maven-plugins/14/maven-plugins-14.pom
(13 KB at 23.3 KB/sec)
Downloading: http://repo1.maven.org/maven2/org/apache/maven/plugins/maven-jarsigner-plugin/1.2/maven-jarsigner-plugin-1.2.jar
Downloaded: http://repo1.maven.org/maven2/org/apache/maven/plugins/maven-jarsigner-plugin/1.2/maven-jarsigner-plugin-1.2.jar
(28 KB at 56.4 KB/sec)
Downloading: http://repo1.maven.org/maven2/org/apache/maven/plugins/maven-antrun-plugin/1.7/maven-antrun-plugin-1.7.pom
Downloaded: http://repo1.maven.org/maven2/org/apache/maven/plugins/maven-antrun-plugin/1.7/maven-antrun-plugin-1.7.pom
(5 KB at 8.4 KB/sec)
Downloading: http://repo1.maven.org/maven2/org/apache/maven/plugins/maven-plugins/22/maven-plugins-22.pom
Downloaded: http://repo1.maven.org/maven2/org/apache/maven/plugins/maven-plugins/22/maven-plugins-22.pom
(13 KB at 25.8 KB/sec)
Downloading: http://repo1.maven.org/maven2/org/apache/maven/maven-parent/21/maven-parent-21.pom
Downloaded: http://repo1.maven.org/maven2/org/apache/maven/maven-parent/21/maven-parent-21.pom
(26 KB at 51.7 KB/sec)
Downloading: http://repo1.maven.org/maven2/org/apache/maven/plugins/maven-antrun-plugin/1.7/maven-antrun-plugin-1.7.jar
Downloaded: http://repo1.maven.org/maven2/org/apache/maven/plugins/maven-antrun-plugin/1.7/maven-antrun-plugin-1.7.jar
(31 KB at 62.2 KB/sec)
Downloading: http://repo1.maven.org/maven2/org/bouncycastle/bcprov-jdk15/1.46/bcprov-jdk15-1.46-sources.jar
Downloaded: http://repo1.maven.org/maven2/org/bouncycastle/bcprov-jdk15/1.46/bcprov-jdk15-1.46-sources.jar
(1354 KB at 1192.7 KB/sec)
[INFO] 
[INFO] --- maven-clean-plugin:2.3:clean (default-clean) @ org.apache.servicemix.bundles.bcprov-jdk15
---
[INFO] Downloading: http://repo1.maven.org/maven2/org/apache/maven/maven-plugin-api/2.0.11/maven-plugin-api-2.0.11.pom

[INFO] --- maven-antrun-plugin:1.7:run (default) @ org.apache.servicemix.bundles.bcprov-jdk15
---
Downloaded: http://repo1.maven.org/maven2/org/apache/maven/maven-plugin-api/2.0.11/maven-plugin-api-2.0.11.pom
(2 KB at 4.5 KB/sec)
Downloading: http://repo1.maven.org/maven2/org/apache/maven/maven/2.0.11/maven-2.0.11.pom
Downloaded: http://repo1.maven.org/maven2/org/apache/maven/maven/2.0.11/maven-2.0.11.pom (22
KB at 40.1 KB/sec)
Downloading: http://repo1.maven.org/maven2/org/apache/maven/maven-parent/12/maven-parent-12.pom
Downloaded: http://repo1.maven.org/maven2/org/apache/maven/maven-parent/12/maven-parent-12.pom
(22 KB at 46.7 KB/sec)
Downloading: http://repo1.maven.org/maven2/org/apache/maven/maven-project/2.0.11/maven-project-2.0.11.pom
Downloaded: http://repo1.maven.org/maven2/org/apache/maven/maven-project/2.0.11/maven-project-2.0.11.pom
(3 KB at 5.5 KB/sec)
Downloading: http://repo1.maven.org/maven2/org/apache/maven/maven-settings/2.0.11/maven-settings-2.0.11.pom
Downloaded: http://repo1.maven.org/maven2/org/apache/maven/maven-settings/2.0.11/maven-settings-2.0.11.pom
(3 KB at 4.3 KB/sec)
Downloading: http://repo1.maven.org/maven2/org/apache/maven/maven-model/2.0.11/maven-model-2.0.11.pom
Downloaded: http://repo1.maven.org/maven2/org/apache/maven/maven-model/2.0.11/maven-model-2.0.11.pom
(4 KB at 4.0 KB/sec)
Downloading: http://repo1.maven.org/maven2/org/codehaus/plexus/plexus-interpolation/1.1/plexus-interpolation-1.1.pom
Downloaded: http://repo1.maven.org/maven2/org/codehaus/plexus/plexus-interpolation/1.1/plexus-interpolation-1.1.pom
(2 KB at 6.0 KB/sec)
Downloading: http://repo1.maven.org/maven2/org/apache/maven/maven-profile/2.0.11/maven-profile-2.0.11.pom
Downloaded: http://repo1.maven.org/maven2/org/apache/maven/maven-profile/2.0.11/maven-profile-2.0.11.pom
(2 KB at 4.0 KB/sec)
Downloading: http://repo1.maven.org/maven2/org/apache/maven/maven-artifact-manager/2.0.11/maven-artifact-manager-2.0.11.pom
Downloaded: http://repo1.maven.org/maven2/org/apache/maven/maven-artifact-manager/2.0.11/maven-artifact-manager-2.0.11.pom
(3 KB at 5.2 KB/sec)
Downloading: http://repo1.maven.org/maven2/org/apache/maven/maven-repository-metadata/2.0.11/maven-repository-metadata-2.0.11.pom
Downloaded: http://repo1.maven.org/maven2/org/apache/maven/maven-repository-metadata/2.0.11/maven-repository-metadata-2.0.11.pom
(3 KB at 4.5 KB/sec)
Downloading: http://repo1.maven.org/maven2/org/apache/maven/maven-artifact/2.0.11/maven-artifact-2.0.11.pom
Downloaded: http://repo1.maven.org/maven2/org/apache/maven/maven-artifact/2.0.11/maven-artifact-2.0.11.pom
(2 KB at 3.1 KB/sec)
Downloading: http://repo1.maven.org/maven2/org/apache/maven/maven-plugin-registry/2.0.11/maven-plugin-registry-2.0.11.pom
Downloaded: http://repo1.maven.org/maven2/org/apache/maven/maven-plugin-registry/2.0.11/maven-plugin-registry-2.0.11.pom
(2 KB at 3.8 KB/sec)
Downloading: http://repo1.maven.org/maven2/org/codehaus/plexus/plexus-interpolation/1.1/plexus-interpolation-1.1.jar
Downloaded: http://repo1.maven.org/maven2/org/codehaus/plexus/plexus-interpolation/1.1/plexus-interpolation-1.1.jar
(35 KB at 70.1 KB/sec)
[INFO] Executing tasks

main:
     [echo] This bundle requires jar signing. In order to properly jar sign this bundle, you
     [echo]                                     will need the following:
     [echo]                                     1. Create a keystore using the keytool that
ships with your jdk.
     [echo]                                     keytool -genkeypair -alias [alias] -keyalg
RSA -keystore [path].
     [echo]                                     2. Add the required keystore properties [keystore,alias,keypass,storepass]
inside
     [echo]                                     your maven profile [settings.xml]
[INFO] Executed tasks
[INFO] Configured Artifact: org.apache.servicemix.legal:legal:1.0:xml
[INFO] [INFO] Copying legal-1.0.xml to <https://builds.apache.org/job/ServiceMix-Bundles/ws/smx4-bundles/bcprov-jdk15-1.46/target/legal/legal.xml>

[INFO] --- maven-dependency-plugin:2.3:copy (copy-legal) @ org.apache.servicemix.bundles.bcprov-jdk15
---
[INFO] 
[INFO] --- maven-remote-resources-plugin:1.2.1:process (default) @ org.apache.servicemix.bundles.bcprov-jdk15
---
[INFO] [INFO] Using 'UTF-8' encoding to copy filtered resources.
[INFO] Copying 1 resource
[INFO] Copying 3 resources

[INFO] --- maven-resources-plugin:2.4:resources (default-resources) @ org.apache.servicemix.bundles.bcprov-jdk15
---
[INFO] [INFO] No sources to compile

[INFO] --- maven-compiler-plugin:2.3.2:compile (default-compile) @ org.apache.servicemix.bundles.bcprov-jdk15
---
[INFO] [INFO] Using 'UTF-8' encoding to copy filtered resources.
[INFO] skip non existing resourceDirectory <https://builds.apache.org/job/ServiceMix-Bundles/ws/smx4-bundles/bcprov-jdk15-1.46/src/test/resources>
[INFO] Copying 3 resources

[INFO] --- maven-resources-plugin:2.4:testResources (default-testResources) @ org.apache.servicemix.bundles.bcprov-jdk15
---
[INFO] [INFO] No sources to compile

[INFO] --- maven-compiler-plugin:2.3.2:testCompile (default-testCompile) @ org.apache.servicemix.bundles.bcprov-jdk15
---
[INFO] [INFO] Tests are skipped.

[INFO] --- maven-surefire-plugin:2.9:test (default-test) @ org.apache.servicemix.bundles.bcprov-jdk15
---
[INFO] 
[INFO] --- maven-bundle-plugin:2.3.7:bundle (default-bundle) @ org.apache.servicemix.bundles.bcprov-jdk15
---
[INFO] Excluding org.bouncycastle:bcprov-jdk15:jar:1.46 from the shaded jar.
[INFO] [INFO] Including org.bouncycastle:bcprov-jdk15:jar:sources:1.46 in the shaded jar.

[INFO] --- maven-shade-plugin:1.4:shade (sources) @ org.apache.servicemix.bundles.bcprov-jdk15
---
[INFO] Attaching shaded artifact.
[INFO] [INFO] Including org.bouncycastle:bcprov-jdk15:jar:1.46 in the shaded jar.
[INFO] Including org.bouncycastle:bcprov-jdk15:jar:sources:1.46 in the shaded jar.

[INFO] --- maven-shade-plugin:1.4:shade (default) @ org.apache.servicemix.bundles.bcprov-jdk15
---
[INFO] Replacing original artifact with shaded artifact.
[INFO] Replacing <https://builds.apache.org/job/ServiceMix-Bundles/ws/smx4-bundles/bcprov-jdk15-1.46/target/org.apache.servicemix.bundles.bcprov-jdk15-1.46_4-SNAPSHOT.jar>
with <https://builds.apache.org/job/ServiceMix-Bundles/ws/smx4-bundles/bcprov-jdk15-1.46/target/org.apache.servicemix.bundles.bcprov-jdk15-1.46_4-SNAPSHOT-shaded.jar>
[INFO] 
[INFO] --- maven-jarsigner-plugin:1.2:sign (package) @ org.apache.servicemix.bundles.bcprov-jdk15
---
[JENKINS] Archiving <https://builds.apache.org/job/ServiceMix-Bundles/ws/smx4-bundles/bcprov-jdk15-1.46/dependency-reduced-pom.xml>
to /home/hudson/hudson/jobs/ServiceMix-Bundles/modules/org.apache.servicemix.bundles$org.apache.servicemix.bundles.bcprov-jdk15/builds/2012-04-05_16-44-27/archive/org.apache.servicemix.bundles/org.apache.servicemix.bundles.bcprov-jdk15/1.46_4-SNAPSHOT/org.apache.servicemix.bundles.bcprov-jdk15-1.46_4-SNAPSHOT.pom
[JENKINS] Archiving <https://builds.apache.org/job/ServiceMix-Bundles/ws/smx4-bundles/bcprov-jdk15-1.46/target/org.apache.servicemix.bundles.bcprov-jdk15-1.46_4-SNAPSHOT.jar>
to /home/hudson/hudson/jobs/ServiceMix-Bundles/modules/org.apache.servicemix.bundles$org.apache.servicemix.bundles.bcprov-jdk15/builds/2012-04-05_16-44-27/archive/org.apache.servicemix.bundles/org.apache.servicemix.bundles.bcprov-jdk15/1.46_4-SNAPSHOT/org.apache.servicemix.bundles.bcprov-jdk15-1.46_4-SNAPSHOT.jar
[JENKINS] Archiving <https://builds.apache.org/job/ServiceMix-Bundles/ws/smx4-bundles/bcprov-jdk15-1.46/target/org.apache.servicemix.bundles.bcprov-jdk15-1.46_4-SNAPSHOT-sources.jar>
to /home/hudson/hudson/jobs/ServiceMix-Bundles/modules/org.apache.servicemix.bundles$org.apache.servicemix.bundles.bcprov-jdk15/builds/2012-04-05_16-44-27/archive/org.apache.servicemix.bundles/org.apache.servicemix.bundles.bcprov-jdk15/1.46_4-SNAPSHOT/org.apache.servicemix.bundles.bcprov-jdk15-1.46_4-SNAPSHOT-sources.jar
[INFO] ------------------------------------------------------------------------
[INFO] Reactor Summary:
[INFO] 
[INFO] Apache ServiceMix :: Bundles ...................... SUCCESS [2:44.770s]
[INFO] Apache ServiceMix :: Bundles :: ezmorph ........... SUCCESS [32.572s]
[INFO] Apache ServiceMix :: Bundles :: json-lib .......... SUCCESS [9.367s]
[INFO] Apache ServiceMix :: Bundles :: quartz ............ SUCCESS [7.238s]
[INFO] Apache ServiceMix :: Bundles :: quartz ............ SUCCESS [6.021s]
[INFO] Apache ServiceMix :: Bundles :: jung-api .......... SUCCESS [5.583s]
[INFO] Apache ServiceMix :: Bundles :: jung-graph-impl ... SUCCESS [4.316s]
[INFO] Apache ServiceMix :: Bundles :: ant ............... SUCCESS [8.176s]
[INFO] Apache ServiceMix :: Bundles :: antlr ............. SUCCESS [4.431s]
[INFO] Apache ServiceMix :: Bundles :: antlr ............. SUCCESS [5.643s]
[INFO] Apache ServiceMix :: Bundles :: antlr ............. SUCCESS [10.980s]
[INFO] Apache ServiceMix :: Bundles :: antlr-runtime ..... SUCCESS [3.651s]
[INFO] Apache ServiceMix :: Bundles :: antlr-runtime ..... SUCCESS [6.098s]
[INFO] Apache ServiceMix :: Bundles :: antlr-runtime ..... SUCCESS [2.851s]
[INFO] Apache ServiceMix :: Bundles :: aopalliance ....... SUCCESS [4.222s]
[INFO] Apache ServiceMix :: Bundles :: asm ............... SUCCESS [4.134s]
[INFO] Apache ServiceMix :: Bundles :: asm ............... SUCCESS [4.662s]
[INFO] Apache ServiceMix :: Bundles :: asm ............... SUCCESS [4.380s]
[INFO] Apache ServiceMix :: Bundles :: asm ............... SUCCESS [5.248s]
[INFO] Apache ServiceMix :: Bundles :: aspectj ........... SUCCESS [7.825s]
[INFO] Apache ServiceMix :: Bundles :: aspectj ........... SUCCESS [8.059s]
[INFO] Apache ServiceMix :: Bundles :: Atlassian XMLRPC .. SUCCESS [6.992s]
[INFO] Apache ServiceMix :: Bundles :: avalon-framework .. SUCCESS [6.806s]
[INFO] Apache ServiceMix :: Bundles :: avro .............. SUCCESS [12.551s]
[INFO] Apache ServiceMix :: Bundles :: avro .............. SUCCESS [11.507s]
[INFO] Apache ServiceMix :: Bundles :: avro-ipc .......... SUCCESS [11.784s]
[INFO] Apache ServiceMix :: Bundles :: avro-ipc .......... SUCCESS [5.696s]
[INFO] Apache ServiceMix :: Bundles :: aws-java-sdk ...... SUCCESS [46.797s]
[INFO] Apache ServiceMix :: Bundles :: aws-java-sdk ...... SUCCESS [33.086s]
[INFO] Apache ServiceMix :: Bundles :: aws-java-sdk ...... SUCCESS [14.985s]
[INFO] Apache ServiceMix :: Bundles :: axiom-api ......... SUCCESS [19.371s]
[INFO] Apache ServiceMix :: Bundles :: axiom-impl ........ SUCCESS [5.899s]
[INFO] Apache ServiceMix :: Bundles :: batik ............. SUCCESS [36.352s]
[INFO] Apache ServiceMix :: Bundles :: bcel .............. SUCCESS [5.343s]
[INFO] Apache ServiceMix :: Bundles :: bcpg-jdk15 ........ SUCCESS [8.495s]
[INFO] Apache ServiceMix :: Bundles :: bcpg-jdk16 ........ SUCCESS [8.703s]
[INFO] Apache ServiceMix :: Bundles :: bcprov-jdk15 ...... FAILURE [17.223s]
[INFO] Apache ServiceMix :: Bundles :: bcprov-jdk16 ...... SKIPPED
[INFO] Apache ServiceMix :: Bundles :: beanio ............ SKIPPED
[INFO] Apache ServiceMix :: Bundles :: beanlib ........... SKIPPED
[INFO] Apache ServiceMix :: Bundles :: casbah ............ SKIPPED
[INFO] Apache ServiceMix :: Bundles :: castor ............ SKIPPED
[INFO] Apache ServiceMix :: Bundles :: castor ............ SKIPPED
[INFO] Apache ServiceMix :: Bundles :: castor ............ SKIPPED
[INFO] Apache ServiceMix :: Bundles :: cglib ............. SKIPPED
[INFO] Apache ServiceMix :: Bundles :: cglib ............. SKIPPED
[INFO] Apache ServiceMix :: Bundles :: cglib ............. SKIPPED
[INFO] Apache ServiceMix :: Bundles :: collections-generic  SKIPPED
[INFO] Apache ServiceMix :: Bundles :: colt .............. SKIPPED
[INFO] Apache ServiceMix :: Bundles :: cometd-java-server  SKIPPED
[INFO] Apache ServiceMix :: Bundles :: cometd-java-server  SKIPPED
[INFO] Apache ServiceMix :: Bundles :: commons-attributes  SKIPPED
[INFO] Apache ServiceMix :: Bundles :: commons-beanutils . SKIPPED
[INFO] Apache ServiceMix :: Bundles :: commons-beanutils . SKIPPED
[INFO] Apache ServiceMix :: Bundles :: commons-beanutils . SKIPPED
[INFO] Apache ServiceMix :: Bundles :: commons-codec ..... SKIPPED
[INFO] Apache ServiceMix :: Bundles :: commons-codec ..... SKIPPED
[INFO] Apache ServiceMix :: Bundles :: commons-collections  SKIPPED
[INFO] Apache ServiceMix :: Bundles :: commons-configuration  SKIPPED
[INFO] Apache ServiceMix :: Bundles :: commons-csv ....... SKIPPED
[INFO] Apache ServiceMix :: Bundles :: commons-dbcp ...... SKIPPED
[INFO] Apache ServiceMix :: Bundles :: commons-dbcp ...... SKIPPED
[INFO] Apache ServiceMix :: Bundles :: commons-dbcp ...... SKIPPED
[INFO] Apache ServiceMix :: Bundles :: commons-digester .. SKIPPED
[INFO] Apache ServiceMix :: Bundles :: commons-httpclient  SKIPPED
[INFO] Apache ServiceMix :: Bundles ...................... SKIPPED
[INFO] ------------------------------------------------------------------------
[INFO] BUILD FAILURE
[INFO] ------------------------------------------------------------------------
[INFO] Total time: 17:51.604s
[INFO] Finished at: Thu Apr 05 17:02:38 UTC 2012
[INFO] Final Memory: 29M/90M
[INFO] ------------------------------------------------------------------------
mavenExecutionResult exceptions not empty
message : Failed to execute goal org.apache.maven.plugins:maven-jarsigner-plugin:1.2:sign
(package) on project org.apache.servicemix.bundles.bcprov-jdk15: The parameters 'alias' for
goal org.apache.maven.plugins:maven-jarsigner-plugin:1.2:sign are missing or invalid
cause : The parameters 'alias' for goal org.apache.maven.plugins:maven-jarsigner-plugin:1.2:sign
are missing or invalid
Stack trace : 
org.apache.maven.lifecycle.LifecycleExecutionException: Failed to execute goal org.apache.maven.plugins:maven-jarsigner-plugin:1.2:sign
(package) on project org.apache.servicemix.bundles.bcprov-jdk15: The parameters 'alias' for
goal org.apache.maven.plugins:maven-jarsigner-plugin:1.2:sign are missing or invalid
	at org.apache.maven.lifecycle.internal.MojoExecutor.execute(MojoExecutor.java:221)
	at org.apache.maven.lifecycle.internal.MojoExecutor.execute(MojoExecutor.java:153)
	at org.apache.maven.lifecycle.internal.MojoExecutor.execute(MojoExecutor.java:145)
	at org.apache.maven.lifecycle.internal.LifecycleModuleBuilder.buildProject(LifecycleModuleBuilder.java:84)
	at org.apache.maven.lifecycle.internal.LifecycleModuleBuilder.buildProject(LifecycleModuleBuilder.java:59)
	at org.apache.maven.lifecycle.internal.LifecycleStarter.singleThreadedBuild(LifecycleStarter.java:183)
	at org.apache.maven.lifecycle.internal.LifecycleStarter.execute(LifecycleStarter.java:161)
	at org.apache.maven.DefaultMaven.doExecute(DefaultMaven.java:319)
	at org.apache.maven.DefaultMaven.execute(DefaultMaven.java:156)
	at org.jvnet.hudson.maven3.launcher.Maven3Launcher.main(Maven3Launcher.java:79)
	at sun.reflect.NativeMethodAccessorImpl.invoke0(Native Method)
	at sun.reflect.NativeMethodAccessorImpl.invoke(NativeMethodAccessorImpl.java:39)
	at sun.reflect.DelegatingMethodAccessorImpl.invoke(DelegatingMethodAccessorImpl.java:25)
	at java.lang.reflect.Method.invoke(Method.java:597)
	at org.codehaus.plexus.classworlds.launcher.Launcher.launchStandard(Launcher.java:329)
	at org.codehaus.plexus.classworlds.launcher.Launcher.launch(Launcher.java:239)
	at org.jvnet.hudson.maven3.agent.Maven3Main.launch(Maven3Main.java:158)
	at hudson.maven.Maven3Builder.call(Maven3Builder.java:104)
	at hudson.maven.Maven3Builder.call(Maven3Builder.java:70)
	at hudson.remoting.UserRequest.perform(UserRequest.java:118)
	at hudson.remoting.UserRequest.perform(UserRequest.java:48)
	at hudson.remoting.Request$2.run(Request.java:287)
	at hudson.remoting.InterceptingExecutorService$1.call(InterceptingExecutorService.java:72)
	at java.util.concurrent.FutureTask$Sync.innerRun(FutureTask.java:303)
	at java.util.concurrent.FutureTask.run(FutureTask.java:138)
	at java.util.concurrent.ThreadPoolExecutor$Worker.runTask(ThreadPoolExecutor.java:886)
	at java.util.concurrent.ThreadPoolExecutor$Worker.run(ThreadPoolExecutor.java:908)
	at java.lang.Thread.run(Thread.java:662)
Caused by: org.apache.maven.plugin.PluginParameterException: The parameters 'alias' for goal
org.apache.maven.plugins:maven-jarsigner-plugin:1.2:sign are missing or invalid
	at org.apache.maven.plugin.internal.DefaultMavenPluginManager.populatePluginFields(DefaultMavenPluginManager.java:576)
	at org.apache.maven.plugin.internal.DefaultMavenPluginManager.getConfiguredMojo(DefaultMavenPluginManager.java:529)
	at org.apache.maven.plugin.DefaultBuildPluginManager.executeMojo(DefaultBuildPluginManager.java:92)
	at org.apache.maven.lifecycle.internal.MojoExecutor.execute(MojoExecutor.java:209)
	... 27 more
channel stopped

Mime
View raw message