servicemix-commits mailing list archives

Site index · List index
Message view « Date » · « Thread »
Top « Date » · « Thread »
From Apache Jenkins Server <jenk...@builds.apache.org>
Subject Build failed in Jenkins: ServiceMix3 #178
Date Sat, 23 Jun 2012 21:04:17 GMT
See <https://builds.apache.org/job/ServiceMix3/178/changes>

Changes:

[jbonofre] Update to components 2011.02.1

------------------------------------------
Started by an SCM change
Building remotely on ubuntu2 in workspace <https://builds.apache.org/job/ServiceMix3/ws/>
Updating http://svn.apache.org/repos/asf/servicemix/smx3/trunk
U         pom.xml
At revision 1353202
[locks-and-latches] Checking to see if we really have the locks
[locks-and-latches] Have all the locks, build can start
Parsing POMs
Failed to transfer Could not find metadata org.apache.servicemix:apache-servicemix-web:3.4.1-SNAPSHOT/maven-metadata.xml
in Nexus (http://repository.apache.org/snapshots)
Failed to transfer Could not find metadata org.apache.servicemix:apache-servicemix-web:3.4.1-SNAPSHOT/maven-metadata.xml
in smx.m2-repo (http://svn.apache.org/repos/asf/servicemix/m2-repo/)
Failed to transfer Could not find metadata org.apache.servicemix:apache-servicemix-web:3.4.1-SNAPSHOT/maven-metadata.xml
in jboss (http://repository.jboss.com/nexus/content/groups/public/)
Failed to transfer Could not find artifact org.apache.servicemix:apache-servicemix-web:pom:3.4.1-SNAPSHOT
in Nexus (http://repository.apache.org/snapshots)
Failed to transfer Could not find artifact org.apache.servicemix:apache-servicemix-web:pom:3.4.1-SNAPSHOT
in smx.m2-repo (http://svn.apache.org/repos/asf/servicemix/m2-repo/)
Failed to transfer Could not find artifact org.apache.servicemix:apache-servicemix-web:pom:3.4.1-SNAPSHOT
in jboss (http://repository.jboss.com/nexus/content/groups/public/)
[locks-and-latches] Releasing all the locks
[locks-and-latches] All the locks released
ERROR: Failed to parse POMs
hudson.util.IOException2: remote file operation failed: <https://builds.apache.org/job/ServiceMix3/ws/smx3>
at hudson.remoting.Channel@2faa4bc4:ubuntu2
	at hudson.FilePath.act(FilePath.java:838)
	at hudson.FilePath.act(FilePath.java:824)
	at hudson.maven.MavenModuleSetBuild$MavenModuleSetBuildExecution.parsePoms(MavenModuleSetBuild.java:910)
	at hudson.maven.MavenModuleSetBuild$MavenModuleSetBuildExecution.doRun(MavenModuleSetBuild.java:654)
	at hudson.model.AbstractBuild$AbstractBuildExecution.run(AbstractBuild.java:499)
	at hudson.model.Run.execute(Run.java:1460)
	at hudson.maven.MavenModuleSetBuild.run(MavenModuleSetBuild.java:477)
	at hudson.model.ResourceController.execute(ResourceController.java:88)
	at hudson.model.Executor.run(Executor.java:239)
Caused by: hudson.remoting.ProxyException: hudson.maven.MavenModuleSetBuild$MavenExecutionException:
org.apache.maven.project.ProjectBuildingException: Some problems were encountered while processing
the POMs:
[ERROR] Non-resolvable import POM: Could not find artifact org.apache.servicemix:apache-servicemix-web:pom:3.4.1-SNAPSHOT
in Nexus (http://repository.apache.org/snapshots) @ line 117, column 19

	at hudson.maven.MavenModuleSetBuild$PomParser.invoke(MavenModuleSetBuild.java:1277)
	at hudson.maven.MavenModuleSetBuild$PomParser.invoke(MavenModuleSetBuild.java:1045)
	at hudson.FilePath$FileCallableWrapper.call(FilePath.java:2180)
	at hudson.remoting.UserRequest.perform(UserRequest.java:118)
	at hudson.remoting.UserRequest.perform(UserRequest.java:48)
	at hudson.remoting.Request$2.run(Request.java:287)
	at hudson.remoting.InterceptingExecutorService$1.call(InterceptingExecutorService.java:72)
	at java.util.concurrent.FutureTask$Sync.innerRun(FutureTask.java:334)
	at java.util.concurrent.FutureTask.run(FutureTask.java:166)
	at java.util.concurrent.ThreadPoolExecutor.runWorker(ThreadPoolExecutor.java:1110)
	at java.util.concurrent.ThreadPoolExecutor$Worker.run(ThreadPoolExecutor.java:603)
	at java.lang.Thread.run(Thread.java:636)
Caused by: hudson.remoting.ProxyException: org.apache.maven.project.ProjectBuildingException:
Some problems were encountered while processing the POMs:
[ERROR] Non-resolvable import POM: Could not find artifact org.apache.servicemix:apache-servicemix-web:pom:3.4.1-SNAPSHOT
in Nexus (http://repository.apache.org/snapshots) @ line 117, column 19

	at org.apache.maven.project.DefaultProjectBuilder.build(DefaultProjectBuilder.java:363)
	at hudson.maven.MavenEmbedder.buildProjects(MavenEmbedder.java:361)
	at hudson.maven.MavenEmbedder.readProjects(MavenEmbedder.java:331)
	at hudson.maven.MavenEmbedder.readProject(MavenEmbedder.java:322)
	at hudson.maven.MavenModuleSetBuild$PomParser.readChilds(MavenModuleSetBuild.java:1331)
	at hudson.maven.MavenModuleSetBuild$PomParser.readChilds(MavenModuleSetBuild.java:1334)
	at hudson.maven.MavenModuleSetBuild$PomParser.invoke(MavenModuleSetBuild.java:1238)
	... 11 more

Mime
View raw message