servicemix-commits mailing list archives

Site index · List index
Message view « Date » · « Thread »
Top « Date » · « Thread »
From Apache Jenkins Server <jenk...@builds.apache.org>
Subject Build failed in Jenkins: ServiceMix3 #181
Date Mon, 02 Jul 2012 13:13:38 GMT
See <https://builds.apache.org/job/ServiceMix3/181/changes>

Changes:

[jbonofre] [maven-release-plugin] prepare for next development iteration

[jbonofre] [maven-release-plugin] prepare release servicemix-3.4.1

[jbonofre] Fix RELEASE-NOTES

[jbonofre] [maven-release-plugin] rollback the release of servicemix-3.4.1

[jbonofre] [maven-release-plugin] prepare for next development iteration

[jbonofre] [maven-release-plugin] prepare release servicemix-3.4.1

[jbonofre] Update the RELEASE-NOTES

[jbonofre] [maven-release-plugin] rollback the release of servicemix-3.4.1

[jbonofre] [maven-release-plugin] prepare for next development iteration

[jbonofre] [maven-release-plugin] prepare release servicemix-3.4.1

[jbonofre] [SM-2131] Add MaxPermSize support by default

------------------------------------------
Started by an SCM change
Building remotely on ubuntu2 in workspace <https://builds.apache.org/job/ServiceMix3/ws/>
Updating http://svn.apache.org/repos/asf/servicemix/smx3/trunk
U         servicemix-itests/pom.xml
U         common/servicemix-components/pom.xml
U         common/pom.xml
U         core/servicemix-audit/pom.xml
U         core/servicemix-core/pom.xml
U         core/pom.xml
U         parent/pom.xml
U         pom.xml
U         distributions/apache-servicemix-web/pom.xml
U         distributions/pom.xml
U         distributions/apache-servicemix/src/main/release/bin/servicemix
U         distributions/apache-servicemix/pom.xml
U         deployables/serviceengines/servicemix-lwcontainer/pom.xml
U         deployables/serviceengines/pom.xml
U         deployables/pom.xml
U         samples/basic/pom.xml
U         samples/camel/camel-sa/pom.xml
U         samples/camel/camel-sa-itest/pom.xml
U         samples/camel/pom.xml
U         samples/camel/camel-simple-su/pom.xml
U         samples/servicemix-web/pom.xml
U         samples/pom.xml
U         samples/bridge-camel/bridge-camel-su/pom.xml
U         samples/bridge-camel/pom.xml
U         samples/bridge-camel/bridge-camel-sa/pom.xml
U         samples/loan-broker/loan-broker-drools-su/pom.xml
U         samples/loan-broker/loan-broker-bean-su/pom.xml
U         samples/loan-broker/loan-broker-ode-su/pom.xml
U         samples/loan-broker/loan-broker-jms-su/pom.xml
U         samples/loan-broker/pom.xml
U         samples/loan-broker/loan-broker-sa/pom.xml
U         samples/bridge/bridge-sa-itest/pom.xml
U         samples/bridge/bridge-jms-su/pom.xml
U         samples/bridge/bridge-xslt-su/pom.xml
U         samples/bridge/pom.xml
U         samples/bridge/bridge-eip-su/pom.xml
U         samples/bridge/bridge-sa/pom.xml
U         samples/bridge/bridge-http-su/pom.xml
U         samples/cxf-wsdl-first/wsdl-first-cxfbc-su/pom.xml
U         samples/cxf-wsdl-first/wsdl-first-cxfse-su/pom.xml
U         samples/cxf-wsdl-first/pom.xml
U         samples/cxf-wsdl-first/wsdl-first-cxf-sa/pom.xml
U         samples/wsdl-first/wsdl-first-sa/pom.xml
U         samples/wsdl-first/wsdl-first-http-su/pom.xml
U         samples/wsdl-first/wsdl-first-jsr181-su/pom.xml
U         samples/wsdl-first/pom.xml
U         RELEASE-NOTES
U         platforms/geronimo/deployer-service/pom.xml
U         platforms/geronimo/deployer/pom.xml
U         platforms/geronimo/pom.xml
U         platforms/geronimo/servicemix-service/pom.xml
U         platforms/geronimo/servicemix/pom.xml
U         platforms/jboss/deployer/pom.xml
U         platforms/jboss/pom.xml
U         platforms/pom.xml
U         web/servicemix-web-console/pom.xml
U         web/pom.xml
U         web/servicemix-console/pom.xml
At revision 1356208
[locks-and-latches] Checking to see if we really have the locks
[locks-and-latches] Have all the locks, build can start
Parsing POMs
Failed to transfer Could not find metadata org.apache.servicemix:apache-servicemix-web:3.4.2-SNAPSHOT/maven-metadata.xml
in smx.m2-repo (http://svn.apache.org/repos/asf/servicemix/m2-repo/)
Failed to transfer Could not find metadata org.apache.servicemix:apache-servicemix-web:3.4.2-SNAPSHOT/maven-metadata.xml
in Nexus (http://repository.apache.org/snapshots)
Failed to transfer Could not find metadata org.apache.servicemix:apache-servicemix-web:3.4.2-SNAPSHOT/maven-metadata.xml
in jboss (http://repository.jboss.com/nexus/content/groups/public/)
Failed to transfer Could not find artifact org.apache.servicemix:apache-servicemix-web:pom:3.4.2-SNAPSHOT
in Nexus (http://repository.apache.org/snapshots)
Failed to transfer Could not find artifact org.apache.servicemix:apache-servicemix-web:pom:3.4.2-SNAPSHOT
in smx.m2-repo (http://svn.apache.org/repos/asf/servicemix/m2-repo/)
Failed to transfer Could not find artifact org.apache.servicemix:apache-servicemix-web:pom:3.4.2-SNAPSHOT
in jboss (http://repository.jboss.com/nexus/content/groups/public/)
[locks-and-latches] Releasing all the locks
[locks-and-latches] All the locks released
ERROR: Failed to parse POMs
hudson.util.IOException2: remote file operation failed: <https://builds.apache.org/job/ServiceMix3/ws/smx3>
at hudson.remoting.Channel@3f0af183:ubuntu2
	at hudson.FilePath.act(FilePath.java:838)
	at hudson.FilePath.act(FilePath.java:824)
	at hudson.maven.MavenModuleSetBuild$MavenModuleSetBuildExecution.parsePoms(MavenModuleSetBuild.java:910)
	at hudson.maven.MavenModuleSetBuild$MavenModuleSetBuildExecution.doRun(MavenModuleSetBuild.java:654)
	at hudson.model.AbstractBuild$AbstractBuildExecution.run(AbstractBuild.java:499)
	at hudson.model.Run.execute(Run.java:1460)
	at hudson.maven.MavenModuleSetBuild.run(MavenModuleSetBuild.java:477)
	at hudson.model.ResourceController.execute(ResourceController.java:88)
	at hudson.model.Executor.run(Executor.java:239)
Caused by: hudson.remoting.ProxyException: hudson.maven.MavenModuleSetBuild$MavenExecutionException:
org.apache.maven.project.ProjectBuildingException: Some problems were encountered while processing
the POMs:
[ERROR] Non-resolvable import POM: Could not find artifact org.apache.servicemix:apache-servicemix-web:pom:3.4.2-SNAPSHOT
in Nexus (http://repository.apache.org/snapshots) @ line 117, column 19

	at hudson.maven.MavenModuleSetBuild$PomParser.invoke(MavenModuleSetBuild.java:1277)
	at hudson.maven.MavenModuleSetBuild$PomParser.invoke(MavenModuleSetBuild.java:1045)
	at hudson.FilePath$FileCallableWrapper.call(FilePath.java:2180)
	at hudson.remoting.UserRequest.perform(UserRequest.java:118)
	at hudson.remoting.UserRequest.perform(UserRequest.java:48)
	at hudson.remoting.Request$2.run(Request.java:287)
	at hudson.remoting.InterceptingExecutorService$1.call(InterceptingExecutorService.java:72)
	at java.util.concurrent.FutureTask$Sync.innerRun(FutureTask.java:334)
	at java.util.concurrent.FutureTask.run(FutureTask.java:166)
	at java.util.concurrent.ThreadPoolExecutor.runWorker(ThreadPoolExecutor.java:1110)
	at java.util.concurrent.ThreadPoolExecutor$Worker.run(ThreadPoolExecutor.java:603)
	at java.lang.Thread.run(Thread.java:636)
Caused by: hudson.remoting.ProxyException: org.apache.maven.project.ProjectBuildingException:
Some problems were encountered while processing the POMs:
[ERROR] Non-resolvable import POM: Could not find artifact org.apache.servicemix:apache-servicemix-web:pom:3.4.2-SNAPSHOT
in Nexus (http://repository.apache.org/snapshots) @ line 117, column 19

	at org.apache.maven.project.DefaultProjectBuilder.build(DefaultProjectBuilder.java:363)
	at hudson.maven.MavenEmbedder.buildProjects(MavenEmbedder.java:361)
	at hudson.maven.MavenEmbedder.readProjects(MavenEmbedder.java:331)
	at hudson.maven.MavenEmbedder.readProject(MavenEmbedder.java:322)
	at hudson.maven.MavenModuleSetBuild$PomParser.readChilds(MavenModuleSetBuild.java:1331)
	at hudson.maven.MavenModuleSetBuild$PomParser.readChilds(MavenModuleSetBuild.java:1334)
	at hudson.maven.MavenModuleSetBuild$PomParser.invoke(MavenModuleSetBuild.java:1238)
	... 11 more

Mime
View raw message