servicemix-commits mailing list archives

Site index · List index
Message view « Date » · « Thread »
Top « Date » · « Thread »
From Apache Jenkins Server <jenk...@builds.apache.org>
Subject Build failed in Jenkins: ServiceMix-Bundles #466
Date Fri, 30 Nov 2012 16:31:29 GMT
See <https://builds.apache.org/job/ServiceMix-Bundles/466/changes>

Changes:

[jbonofre] [SMX4-1310] Create OSGi bundle for serp 1.14.1

[jbonofre] [SMX4-1270] Fix optional resolution in import of scalaj-collection 1.0 bundle

[jbonofre] [SMX4-1270] Fix optional resolution in import of scala-compiler 2.9.2 bundle

[jbonofre] [SMX4-1270] Fix optional resolution for import in rjc 0.6.3 bundle

[jbonofre] [SMX4-1309] Create OSGi bundle for qpid 0.18

[jbonofre] [SMX4-1270] Fix optional resolution in import of POI 3.8 bundle

[jbonofre] [SMX4-1308] Create OSGi bundle for paranamer 2.5.1

[jbonofre] [SMX4-1270] Fix optional resolution in import of opensaml 2.5.1 bundle

[jbonofre] [SMX4-1307] Create OSGi bundle for ognl 3.0.6

[jbonofre] [SMX4-1270] Fix optional resolution in import of ognl 3.0.5 bundle

[jbonofre] [SMX4-1306] Create OSGi bundle for lucene 4.0.0

[jbonofre] [SMX4-1305] Create OSGi bundle for libthrift 0.9.0

[jbonofre] [SMX4-1270] Fix optional resolution in import of libthrift 0.8.0 bundle

[jbonofre] [SMX4-1270] Fix optional resolution in import of kxml2 2.3.0 bundle

------------------------------------------
Started by an SCM change
Building remotely on ubuntu3 in workspace <https://builds.apache.org/job/ServiceMix-Bundles/ws/>
Updating http://svn.apache.org/repos/asf/servicemix/smx4/bundles/trunk
U         rjc-0.6.3/pom.xml
U         scalaj-collection-1.0/pom.xml
U         ognl-3.0.5/pom.xml
A         ognl-3.0.6
A         ognl-3.0.6/src
A         ognl-3.0.6/src/main
A         ognl-3.0.6/src/main/resources
A         ognl-3.0.6/src/main/resources/OSGI-INF
A         ognl-3.0.6/src/main/resources/OSGI-INF/bundle.info
A         ognl-3.0.6/pom.xml
A         serp-1.14.1
A         serp-1.14.1/src
A         serp-1.14.1/src/main
A         serp-1.14.1/src/main/resources
A         serp-1.14.1/src/main/resources/OSGI-INF
A         serp-1.14.1/src/main/resources/OSGI-INF/bundle.info
A         serp-1.14.1/pom.xml
U         scala-compiler-2.9.2/pom.xml
A         qpid-0.18
A         qpid-0.18/src
A         qpid-0.18/src/main
A         qpid-0.18/src/main/resources
A         qpid-0.18/src/main/resources/OSGI-INF
A         qpid-0.18/src/main/resources/OSGI-INF/bundle.info
A         qpid-0.18/pom.xml
U         poi-3.8/pom.xml
U         opensaml-2.5.1/pom.xml
U         pom.xml
U         libthrift-0.8.0/pom.xml
U         kxml2-2.3.0/pom.xml
A         paranamer-2.5.1
A         paranamer-2.5.1/src
A         paranamer-2.5.1/src/main
A         paranamer-2.5.1/src/main/resources
A         paranamer-2.5.1/src/main/resources/OSGI-INF
A         paranamer-2.5.1/src/main/resources/OSGI-INF/bundle.info
A         paranamer-2.5.1/pom.xml
A         lucene-4.0.0
A         lucene-4.0.0/src
A         lucene-4.0.0/src/main
A         lucene-4.0.0/src/main/resources
A         lucene-4.0.0/src/main/resources/OSGI-INF
A         lucene-4.0.0/src/main/resources/OSGI-INF/bundle.info
A         lucene-4.0.0/pom.xml
A         libthrift-0.9.0
A         libthrift-0.9.0/src
A         libthrift-0.9.0/src/main
A         libthrift-0.9.0/src/main/resources
A         libthrift-0.9.0/src/main/resources/OSGI-INF
A         libthrift-0.9.0/src/main/resources/OSGI-INF/bundle.info
A         libthrift-0.9.0/pom.xml
At revision 1415731
Parsing POMs
ERROR: Failed to parse POMs
hudson.util.IOException2: remote file operation failed: <https://builds.apache.org/job/ServiceMix-Bundles/ws/smx4-bundles>
at hudson.remoting.Channel@6fd78d89:ubuntu3
	at hudson.FilePath.act(FilePath.java:848)
	at hudson.FilePath.act(FilePath.java:825)
	at hudson.maven.MavenModuleSetBuild$MavenModuleSetBuildExecution.parsePoms(MavenModuleSetBuild.java:855)
	at hudson.maven.MavenModuleSetBuild$MavenModuleSetBuildExecution.doRun(MavenModuleSetBuild.java:620)
	at hudson.model.AbstractBuild$AbstractBuildExecution.run(AbstractBuild.java:586)
	at hudson.model.Run.execute(Run.java:1518)
	at hudson.maven.MavenModuleSetBuild.run(MavenModuleSetBuild.java:477)
	at hudson.model.ResourceController.execute(ResourceController.java:88)
	at hudson.model.Executor.run(Executor.java:236)
Caused by: hudson.remoting.ProxyException: hudson.maven.MavenModuleSetBuild$MavenExecutionException:
org.apache.maven.project.ProjectBuildingException: Some problems were encountered while processing
the POMs:
[FATAL] Non-resolvable parent POM: Could not find artifact org.apache.servicemix.bundles:bundles-pom:pom:9-SNAPSHOT
and 'parent.relativePath' points at wrong local POM @ line 24, column 13
[FATAL] Non-resolvable parent POM: Could not find artifact org.apache.servicemix.bundles:bundles-pom:pom:9-SNAPSHOT
and 'parent.relativePath' points at wrong local POM @ line 24, column 13
[FATAL] Non-resolvable parent POM: Failure to find org.apache.servicemix.bundles:bundles-pom:pom:9-SNAPSHOT
in https://maven.atlassian.com/content/groups/public/ was cached in the local repository,
resolution will not be reattempted until the update interval of atlassian.m2 has elapsed or
updates are forced and 'parent.relativePath' points at wrong local POM @ line 24, column 13

	at hudson.maven.MavenModuleSetBuild$PomParser.invoke(MavenModuleSetBuild.java:1222)
	at hudson.maven.MavenModuleSetBuild$PomParser.invoke(MavenModuleSetBuild.java:990)
	at hudson.FilePath$FileCallableWrapper.call(FilePath.java:2309)
	at hudson.remoting.UserRequest.perform(UserRequest.java:118)
	at hudson.remoting.UserRequest.perform(UserRequest.java:48)
	at hudson.remoting.Request$2.run(Request.java:326)
	at hudson.remoting.InterceptingExecutorService$1.call(InterceptingExecutorService.java:72)
	at java.util.concurrent.FutureTask$Sync.innerRun(FutureTask.java:334)
	at java.util.concurrent.FutureTask.run(FutureTask.java:166)
	at java.util.concurrent.ThreadPoolExecutor.runWorker(ThreadPoolExecutor.java:1110)
	at java.util.concurrent.ThreadPoolExecutor$Worker.run(ThreadPoolExecutor.java:603)
	at java.lang.Thread.run(Thread.java:679)
Caused by: hudson.remoting.ProxyException: org.apache.maven.project.ProjectBuildingException:
Some problems were encountered while processing the POMs:
[FATAL] Non-resolvable parent POM: Could not find artifact org.apache.servicemix.bundles:bundles-pom:pom:9-SNAPSHOT
and 'parent.relativePath' points at wrong local POM @ line 24, column 13
[FATAL] Non-resolvable parent POM: Could not find artifact org.apache.servicemix.bundles:bundles-pom:pom:9-SNAPSHOT
and 'parent.relativePath' points at wrong local POM @ line 24, column 13
[FATAL] Non-resolvable parent POM: Failure to find org.apache.servicemix.bundles:bundles-pom:pom:9-SNAPSHOT
in https://maven.atlassian.com/content/groups/public/ was cached in the local repository,
resolution will not be reattempted until the update interval of atlassian.m2 has elapsed or
updates are forced and 'parent.relativePath' points at wrong local POM @ line 24, column 13

	at org.apache.maven.project.DefaultProjectBuilder.build(DefaultProjectBuilder.java:363)
	at hudson.maven.MavenEmbedder.buildProjects(MavenEmbedder.java:361)
	at hudson.maven.MavenEmbedder.readProjects(MavenEmbedder.java:331)
	at hudson.maven.MavenModuleSetBuild$PomParser.invoke(MavenModuleSetBuild.java:1172)
	... 11 more

Mime
View raw message