servicemix-commits mailing list archives

Site index · List index
Message view « Date » · « Thread »
Top « Date » · « Thread »
From Apache Jenkins Server <jenk...@builds.apache.org>
Subject Build failed in Jenkins: ServiceMix-Bundles #453
Date Thu, 15 Nov 2012 16:34:24 GMT
See <https://builds.apache.org/job/ServiceMix-Bundles/453/changes>

Changes:

[jbonofre] [SMX4-1279] Create OSGi bundle for aws-java-sdk 1.3.25

------------------------------------------
[...truncated 4446 lines...]

[INFO] 
[INFO] --- maven-shade-plugin:1.4:shade (default) @ org.apache.servicemix.bundles.bcpg-jdk15on
---
[INFO] Replacing original artifact with shaded artifact.
[INFO] Replacing <https://builds.apache.org/job/ServiceMix-Bundles/ws/smx4-bundles/bcpg-jdk15on-1.47/target/org.apache.servicemix.bundles.bcpg-jdk15on-1.47_1-SNAPSHOT.jar>
with <https://builds.apache.org/job/ServiceMix-Bundles/ws/smx4-bundles/bcpg-jdk15on-1.47/target/org.apache.servicemix.bundles.bcpg-jdk15on-1.47_1-SNAPSHOT-shaded.jar>
mojoSucceeded org.apache.maven.plugins:maven-shade-plugin:1.4(default)
Downloading: http://repo1.maven.org/maven2/org/codehaus/plexus/plexus-digest/1.0/plexus-digest-1.0.pom
mojoStarted org.apache.maven.plugins:maven-install-plugin:2.3(default-install)Downloaded:
http://repo1.maven.org/maven2/org/codehaus/plexus/plexus-digest/1.0/plexus-digest-1.0.pom
(2 KB at 103.4 KB/sec)
Downloading: http://repo1.maven.org/maven2/org/codehaus/plexus/plexus-components/1.1.7/plexus-components-1.1.7.pom
Downloaded: http://repo1.maven.org/maven2/org/codehaus/plexus/plexus-components/1.1.7/plexus-components-1.1.7.pom
(5 KB at 441.7 KB/sec)
Downloading: http://repo1.maven.org/maven2/org/codehaus/plexus/plexus-digest/1.0/plexus-digest-1.0.jar
Downloaded: http://repo1.maven.org/maven2/org/codehaus/plexus/plexus-digest/1.0/plexus-digest-1.0.jar
(12 KB at 965.0 KB/sec)

[INFO] 
[INFO] Installing <https://builds.apache.org/job/ServiceMix-Bundles/ws/smx4-bundles/bcpg-jdk15on-1.47/target/org.apache.servicemix.bundles.bcpg-jdk15on-1.47_1-SNAPSHOT.jar>
to <https://builds.apache.org/job/ServiceMix-Bundles/ws/.repository/org/apache/servicemix/bundles/org.apache.servicemix.bundles.bcpg-jdk15on/1.47_1-SNAPSHOT/org.apache.servicemix.bundles.bcpg-jdk15on-1.47_1-SNAPSHOT.jar>
[INFO] --- maven-install-plugin:2.3:install (default-install) @ org.apache.servicemix.bundles.bcpg-jdk15on
---
[INFO] Installing <https://builds.apache.org/job/ServiceMix-Bundles/ws/smx4-bundles/bcpg-jdk15on-1.47/dependency-reduced-pom.xml>
to <https://builds.apache.org/job/ServiceMix-Bundles/ws/.repository/org/apache/servicemix/bundles/org.apache.servicemix.bundles.bcpg-jdk15on/1.47_1-SNAPSHOT/org.apache.servicemix.bundles.bcpg-jdk15on-1.47_1-SNAPSHOT.pom>
[INFO] Installing <https://builds.apache.org/job/ServiceMix-Bundles/ws/smx4-bundles/bcpg-jdk15on-1.47/target/org.apache.servicemix.bundles.bcpg-jdk15on-1.47_1-SNAPSHOT-src.zip>
to <https://builds.apache.org/job/ServiceMix-Bundles/ws/.repository/org/apache/servicemix/bundles/org.apache.servicemix.bundles.bcpg-jdk15on/1.47_1-SNAPSHOT/org.apache.servicemix.bundles.bcpg-jdk15on-1.47_1-SNAPSHOT-src.zip>
[INFO] Installing <https://builds.apache.org/job/ServiceMix-Bundles/ws/smx4-bundles/bcpg-jdk15on-1.47/target/org.apache.servicemix.bundles.bcpg-jdk15on-1.47_1-SNAPSHOT-src.tar.gz>
to <https://builds.apache.org/job/ServiceMix-Bundles/ws/.repository/org/apache/servicemix/bundles/org.apache.servicemix.bundles.bcpg-jdk15on/1.47_1-SNAPSHOT/org.apache.servicemix.bundles.bcpg-jdk15on-1.47_1-SNAPSHOT-src.tar.gz>
[INFO] Installing <https://builds.apache.org/job/ServiceMix-Bundles/ws/smx4-bundles/bcpg-jdk15on-1.47/target/org.apache.servicemix.bundles.bcpg-jdk15on-1.47_1-SNAPSHOT-sources.jar>
to <https://builds.apache.org/job/ServiceMix-Bundles/ws/.repository/org/apache/servicemix/bundles/org.apache.servicemix.bundles.bcpg-jdk15on/1.47_1-SNAPSHOT/org.apache.servicemix.bundles.bcpg-jdk15on-1.47_1-SNAPSHOT-sources.jar>
mojoSucceeded org.apache.maven.plugins:maven-install-plugin:2.3(default-install)
mojoStarted org.apache.felix:maven-bundle-plugin:2.3.7(default-install)[INFO] Writing OBR
metadata
[INFO] Installing org/apache/servicemix/bundles/org.apache.servicemix.bundles.bcpg-jdk15on/1.47_1-SNAPSHOT/org.apache.servicemix.bundles.bcpg-jdk15on-1.47_1-SNAPSHOT.jar
[INFO] Installing org/apache/servicemix/bundles/org.apache.servicemix.bundles.bcpg-jdk15on/1.47_1-SNAPSHOT/org.apache.servicemix.bundles.bcpg-jdk15on-1.47_1-SNAPSHOT-sources.jar
[INFO] Writing OBR metadata

[INFO] 
[INFO] --- maven-bundle-plugin:2.3.7:install (default-install) @ org.apache.servicemix.bundles.bcpg-jdk15on
---
mojoSucceeded org.apache.felix:maven-bundle-plugin:2.3.7(default-install)
projectSucceeded org.apache.servicemix.bundles:org.apache.servicemix.bundles.bcpg-jdk15on:1.47_1-SNAPSHOT
projectStarted org.apache.servicemix.bundles:org.apache.servicemix.bundles.bcprov-jdk15on:1.47_1-SNAPSHOT
[INFO] Downloading: http://repo1.maven.org/maven2/org/apache/maven/plugins/maven-jarsigner-plugin/1.2/maven-jarsigner-plugin-1.2.pom
                                                                        
[INFO] ------------------------------------------------------------------------
[INFO] Building Apache ServiceMix :: Bundles :: bcprov-jdk15on 1.47_1-SNAPSHOT
[INFO] ------------------------------------------------------------------------
Downloaded: http://repo1.maven.org/maven2/org/apache/maven/plugins/maven-jarsigner-plugin/1.2/maven-jarsigner-plugin-1.2.pom
(6 KB at 40.6 KB/sec)
Downloading: http://repo1.maven.org/maven2/org/apache/maven/plugins/maven-plugins/14/maven-plugins-14.pom
Downloaded: http://repo1.maven.org/maven2/org/apache/maven/plugins/maven-plugins/14/maven-plugins-14.pom
(13 KB at 127.5 KB/sec)
Downloading: http://repo1.maven.org/maven2/org/apache/maven/plugins/maven-jarsigner-plugin/1.2/maven-jarsigner-plugin-1.2.jar
Downloaded: http://repo1.maven.org/maven2/org/apache/maven/plugins/maven-jarsigner-plugin/1.2/maven-jarsigner-plugin-1.2.jar
(28 KB at 215.0 KB/sec)
Downloading: http://repo1.maven.org/maven2/org/apache/maven/plugins/maven-antrun-plugin/1.7/maven-antrun-plugin-1.7.pom
Downloaded: http://repo1.maven.org/maven2/org/apache/maven/plugins/maven-antrun-plugin/1.7/maven-antrun-plugin-1.7.pom
(5 KB at 138.9 KB/sec)
Downloading: http://repo1.maven.org/maven2/org/apache/maven/plugins/maven-antrun-plugin/1.7/maven-antrun-plugin-1.7.jar
Downloaded: http://repo1.maven.org/maven2/org/apache/maven/plugins/maven-antrun-plugin/1.7/maven-antrun-plugin-1.7.jar
(31 KB at 907.7 KB/sec)
Downloading: http://repo1.maven.org/maven2/org/bouncycastle/bcprov-jdk15on/1.47/bcprov-jdk15on-1.47-sources.jar
Downloaded: http://repo1.maven.org/maven2/org/bouncycastle/bcprov-jdk15on/1.47/bcprov-jdk15on-1.47-sources.jar
(1539 KB at 9865.1 KB/sec)
mojoStarted org.apache.maven.plugins:maven-clean-plugin:2.3(default-clean)
[INFO] 
[INFO] --- maven-clean-plugin:2.3:clean (default-clean) @ org.apache.servicemix.bundles.bcprov-jdk15on
---
mojoSucceeded org.apache.maven.plugins:maven-clean-plugin:2.3(default-clean)
mojoStarted org.apache.maven.plugins:maven-antrun-plugin:1.7(default)Downloading: http://repo1.maven.org/maven2/org/apache/maven/maven-plugin-api/2.0.11/maven-plugin-api-2.0.11.pom
Downloaded: http://repo1.maven.org/maven2/org/apache/maven/maven-plugin-api/2.0.11/maven-plugin-api-2.0.11.pom
(2 KB at 39.7 KB/sec)
Downloading: http://repo1.maven.org/maven2/org/apache/maven/maven/2.0.11/maven-2.0.11.pom
Downloaded: http://repo1.maven.org/maven2/org/apache/maven/maven/2.0.11/maven-2.0.11.pom (22
KB at 3046.3 KB/sec)
Downloading: http://repo1.maven.org/maven2/org/apache/maven/maven-parent/12/maven-parent-12.pom

[INFO] 
[INFO] --- maven-antrun-plugin:1.7:run (default) @ org.apache.servicemix.bundles.bcprov-jdk15on
---
Downloaded: http://repo1.maven.org/maven2/org/apache/maven/maven-parent/12/maven-parent-12.pom
(22 KB at 544.4 KB/sec)
Downloading: http://repo1.maven.org/maven2/org/apache/maven/maven-project/2.0.11/maven-project-2.0.11.pom
Downloaded: http://repo1.maven.org/maven2/org/apache/maven/maven-project/2.0.11/maven-project-2.0.11.pom
(3 KB at 387.4 KB/sec)
Downloading: http://repo1.maven.org/maven2/org/apache/maven/maven-settings/2.0.11/maven-settings-2.0.11.pom
Downloaded: http://repo1.maven.org/maven2/org/apache/maven/maven-settings/2.0.11/maven-settings-2.0.11.pom
(3 KB at 56.1 KB/sec)
Downloading: http://repo1.maven.org/maven2/org/apache/maven/maven-model/2.0.11/maven-model-2.0.11.pom
Downloaded: http://repo1.maven.org/maven2/org/apache/maven/maven-model/2.0.11/maven-model-2.0.11.pom
(4 KB at 528.0 KB/sec)
Downloading: http://repo1.maven.org/maven2/org/codehaus/plexus/plexus-interpolation/1.1/plexus-interpolation-1.1.pom
Downloaded: http://repo1.maven.org/maven2/org/codehaus/plexus/plexus-interpolation/1.1/plexus-interpolation-1.1.pom
(2 KB at 32.6 KB/sec)
Downloading: http://repo1.maven.org/maven2/org/apache/maven/maven-profile/2.0.11/maven-profile-2.0.11.pom
Downloaded: http://repo1.maven.org/maven2/org/apache/maven/maven-profile/2.0.11/maven-profile-2.0.11.pom
(2 KB at 221.7 KB/sec)
Downloading: http://repo1.maven.org/maven2/org/apache/maven/maven-artifact-manager/2.0.11/maven-artifact-manager-2.0.11.pom
Downloaded: http://repo1.maven.org/maven2/org/apache/maven/maven-artifact-manager/2.0.11/maven-artifact-manager-2.0.11.pom
(3 KB at 428.2 KB/sec)
Downloading: http://repo1.maven.org/maven2/org/apache/maven/maven-repository-metadata/2.0.11/maven-repository-metadata-2.0.11.pom
Downloaded: http://repo1.maven.org/maven2/org/apache/maven/maven-repository-metadata/2.0.11/maven-repository-metadata-2.0.11.pom
(3 KB at 52.5 KB/sec)
Downloading: http://repo1.maven.org/maven2/org/apache/maven/maven-artifact/2.0.11/maven-artifact-2.0.11.pom
Downloaded: http://repo1.maven.org/maven2/org/apache/maven/maven-artifact/2.0.11/maven-artifact-2.0.11.pom
(2 KB at 309.6 KB/sec)
Downloading: http://repo1.maven.org/maven2/org/apache/maven/maven-plugin-registry/2.0.11/maven-plugin-registry-2.0.11.pom
Downloaded: http://repo1.maven.org/maven2/org/apache/maven/maven-plugin-registry/2.0.11/maven-plugin-registry-2.0.11.pom
(2 KB at 22.4 KB/sec)
Downloading: http://repo1.maven.org/maven2/org/apache/ant/ant/1.8.2/ant-1.8.2.pom
Downloaded: http://repo1.maven.org/maven2/org/apache/ant/ant/1.8.2/ant-1.8.2.pom (10 KB at
292.3 KB/sec)
Downloading: http://repo1.maven.org/maven2/org/apache/ant/ant-parent/1.8.2/ant-parent-1.8.2.pom
Downloaded: http://repo1.maven.org/maven2/org/apache/ant/ant-parent/1.8.2/ant-parent-1.8.2.pom
(5 KB at 286.1 KB/sec)
Downloading: http://repo1.maven.org/maven2/org/apache/ant/ant-launcher/1.8.2/ant-launcher-1.8.2.pom
Downloaded: http://repo1.maven.org/maven2/org/apache/ant/ant-launcher/1.8.2/ant-launcher-1.8.2.pom
(3 KB at 236.2 KB/sec)
Downloading: http://repo1.maven.org/maven2/org/codehaus/plexus/plexus-interpolation/1.1/plexus-interpolation-1.1.jar
Downloading: http://repo1.maven.org/maven2/org/apache/ant/ant/1.8.2/ant-1.8.2.jar
Downloading: http://repo1.maven.org/maven2/org/apache/ant/ant-launcher/1.8.2/ant-launcher-1.8.2.jar
Downloaded: http://repo1.maven.org/maven2/org/apache/ant/ant-launcher/1.8.2/ant-launcher-1.8.2.jar
(13 KB at 1337.0 KB/sec)
Downloaded: http://repo1.maven.org/maven2/org/codehaus/plexus/plexus-interpolation/1.1/plexus-interpolation-1.1.jar
(35 KB at 2665.3 KB/sec)
Downloaded: http://repo1.maven.org/maven2/org/apache/ant/ant/1.8.2/ant-1.8.2.jar (1889 KB
at 24210.5 KB/sec)
[INFO] Executing tasks

main:
     [echo] This bundle requires jar signing. In order to properly jar sign this bundle, you
     [echo]                                     will need the following:
     [echo]                                     1. Create a keystore using the keytool that
ships with your jdk.
     [echo]                                     keytool -genkeypair -alias [alias] -keyalg
RSA -keystore [path].
     [echo]                                     2. Add the required keystore properties [keystore,alias,keypass,storepass]
inside
     [echo]                                     your maven profile [settings.xml]
[INFO] Executed tasks
mojoSucceeded org.apache.maven.plugins:maven-antrun-plugin:1.7(default)
mojoStarted org.apache.maven.plugins:maven-dependency-plugin:2.3(copy-legal)[INFO] Configured
Artifact: org.apache.servicemix.legal:legal:1.0:xml
[INFO] Copying legal-1.0.xml to <https://builds.apache.org/job/ServiceMix-Bundles/ws/smx4-bundles/bcprov-jdk15on-1.47/target/legal/legal.xml>

[INFO] 
[INFO] --- maven-dependency-plugin:2.3:copy (copy-legal) @ org.apache.servicemix.bundles.bcprov-jdk15on
---
mojoSucceeded org.apache.maven.plugins:maven-dependency-plugin:2.3(copy-legal)
mojoStarted org.apache.maven.plugins:maven-remote-resources-plugin:1.3(default)
[INFO] 
[INFO] --- maven-remote-resources-plugin:1.3:process (default) @ org.apache.servicemix.bundles.bcprov-jdk15on
---
mojoSucceeded org.apache.maven.plugins:maven-remote-resources-plugin:1.3(default)
mojoStarted org.apache.maven.plugins:maven-resources-plugin:2.4(default-resources)[INFO] Using
'UTF-8' encoding to copy filtered resources.
[INFO] Copying 1 resource
[INFO] Copying 3 resources

[INFO] 
[INFO] --- maven-resources-plugin:2.4:resources (default-resources) @ org.apache.servicemix.bundles.bcprov-jdk15on
---
mojoSucceeded org.apache.maven.plugins:maven-resources-plugin:2.4(default-resources)
mojoStarted org.apache.maven.plugins:maven-compiler-plugin:2.3.2(default-compile)[INFO] No
sources to compile

[INFO] 
[INFO] --- maven-compiler-plugin:2.3.2:compile (default-compile) @ org.apache.servicemix.bundles.bcprov-jdk15on
---
mojoSucceeded org.apache.maven.plugins:maven-compiler-plugin:2.3.2(default-compile)
mojoStarted org.apache.maven.plugins:maven-resources-plugin:2.4(default-testResources)[INFO]
Using 'UTF-8' encoding to copy filtered resources.
[INFO] skip non existing resourceDirectory <https://builds.apache.org/job/ServiceMix-Bundles/ws/smx4-bundles/bcprov-jdk15on-1.47/src/test/resources>
[INFO] Copying 3 resources

[INFO] 
[INFO] --- maven-resources-plugin:2.4:testResources (default-testResources) @ org.apache.servicemix.bundles.bcprov-jdk15on
---
mojoSucceeded org.apache.maven.plugins:maven-resources-plugin:2.4(default-testResources)
mojoStarted org.apache.maven.plugins:maven-compiler-plugin:2.3.2(default-testCompile)[INFO]
No sources to compile

[INFO] 
[INFO] --- maven-compiler-plugin:2.3.2:testCompile (default-testCompile) @ org.apache.servicemix.bundles.bcprov-jdk15on
---
mojoSucceeded org.apache.maven.plugins:maven-compiler-plugin:2.3.2(default-testCompile)
mojoStarted org.apache.maven.plugins:maven-surefire-plugin:2.9(default-test)[INFO] Tests are
skipped.

[INFO] 
[INFO] --- maven-surefire-plugin:2.9:test (default-test) @ org.apache.servicemix.bundles.bcprov-jdk15on
---
mojoSucceeded org.apache.maven.plugins:maven-surefire-plugin:2.9(default-test)
mojoStarted org.apache.felix:maven-bundle-plugin:2.3.7(default-bundle)
[INFO] 
[INFO] --- maven-bundle-plugin:2.3.7:bundle (default-bundle) @ org.apache.servicemix.bundles.bcprov-jdk15on
---
[WARNING] Bundle org.apache.servicemix.bundles:org.apache.servicemix.bundles.bcprov-jdk15on:bundle:1.47_1-SNAPSHOT
: Did not find matching referal for junit*
mojoSucceeded org.apache.felix:maven-bundle-plugin:2.3.7(default-bundle)
mojoStarted org.apache.maven.plugins:maven-assembly-plugin:2.3(make-src-assembly)[INFO] Building
zip: <https://builds.apache.org/job/ServiceMix-Bundles/ws/smx4-bundles/bcprov-jdk15on-1.47/target/org.apache.servicemix.bundles.bcprov-jdk15on-1.47_1-SNAPSHOT-src.zip>

[INFO] 
[INFO] --- maven-assembly-plugin:2.3:single (make-src-assembly) @ org.apache.servicemix.bundles.bcprov-jdk15on
---
[INFO] Building tar: <https://builds.apache.org/job/ServiceMix-Bundles/ws/smx4-bundles/bcprov-jdk15on-1.47/target/org.apache.servicemix.bundles.bcprov-jdk15on-1.47_1-SNAPSHOT-src.tar.gz>
[WARNING] Entry: org.apache.servicemix.bundles.bcprov-jdk15on-1.47_1-SNAPSHOT/src/main/resources/OSGI-INF/bundle.info
longer than 100 characters.
[WARNING] Resulting tar file can only be processed successfully by GNU compatible tar commands
mojoSucceeded org.apache.maven.plugins:maven-assembly-plugin:2.3(make-src-assembly)
mojoStarted org.apache.maven.plugins:maven-shade-plugin:1.4(sources)[INFO] Excluding org.bouncycastle:bcprov-jdk15on:jar:1.47
from the shaded jar.
[INFO] Including org.bouncycastle:bcprov-jdk15on:jar:sources:1.47 in the shaded jar.

[INFO] 
[INFO] --- maven-shade-plugin:1.4:shade (sources) @ org.apache.servicemix.bundles.bcprov-jdk15on
---
[INFO] Attaching shaded artifact.
mojoSucceeded org.apache.maven.plugins:maven-shade-plugin:1.4(sources)
mojoStarted org.apache.maven.plugins:maven-shade-plugin:1.4(default)[INFO] Including org.bouncycastle:bcprov-jdk15on:jar:1.47
in the shaded jar.
[INFO] Including org.bouncycastle:bcprov-jdk15on:jar:sources:1.47 in the shaded jar.

[INFO] 
[INFO] --- maven-shade-plugin:1.4:shade (default) @ org.apache.servicemix.bundles.bcprov-jdk15on
---
[INFO] Replacing original artifact with shaded artifact.
[INFO] Replacing <https://builds.apache.org/job/ServiceMix-Bundles/ws/smx4-bundles/bcprov-jdk15on-1.47/target/org.apache.servicemix.bundles.bcprov-jdk15on-1.47_1-SNAPSHOT.jar>
with <https://builds.apache.org/job/ServiceMix-Bundles/ws/smx4-bundles/bcprov-jdk15on-1.47/target/org.apache.servicemix.bundles.bcprov-jdk15on-1.47_1-SNAPSHOT-shaded.jar>
mojoSucceeded org.apache.maven.plugins:maven-shade-plugin:1.4(default)
mojoStarted org.apache.maven.plugins:maven-jarsigner-plugin:1.2(package)
[INFO] 
[INFO] --- maven-jarsigner-plugin:1.2:sign (package) @ org.apache.servicemix.bundles.bcprov-jdk15on
---
mojoFailed org.apache.maven.plugins:maven-jarsigner-plugin:1.2(package)
projectFailed org.apache.servicemix.bundles:org.apache.servicemix.bundles.bcprov-jdk15on:1.47_1-SNAPSHOT
sessionEnded
[INFO] ------------------------------------------------------------------------
[INFO] Reactor Summary:
[INFO] 
[INFO] Apache ServiceMix :: Bundles :: bcpg-jdk15on ...... SUCCESS [50.244s]
[INFO] Apache ServiceMix :: Bundles :: bcprov-jdk15on .... FAILURE [8.696s]
[INFO] Apache ServiceMix :: Bundles :: jaxb-impl ......... SKIPPED
[INFO] Apache ServiceMix :: Bundles :: jaxb-xjc .......... SKIPPED
[INFO] Apache ServiceMix :: Bundles :: xmlbeans .......... SKIPPED
[INFO] Apache ServiceMix :: Bundles :: aws-java-sdk ...... SKIPPED
[INFO] Apache ServiceMix :: Bundles :: aws-java-sdk ...... SKIPPED
[INFO] Apache ServiceMix :: Bundles ...................... SKIPPED
[INFO] ------------------------------------------------------------------------
[INFO] BUILD FAILURE
[INFO] ------------------------------------------------------------------------
[INFO] Total time: 1:04.008s
[INFO] Finished at: Thu Nov 15 16:33:32 UTC 2012
[INFO] Final Memory: 16M/74M
[INFO] ------------------------------------------------------------------------
Projects to build: [MavenProject: org.apache.servicemix.bundles:org.apache.servicemix.bundles.bcpg-jdk15on:1.47_1-SNAPSHOT
@ <https://builds.apache.org/job/ServiceMix-Bundles/ws/smx4-bundles/bcpg-jdk15on-1.47/dependency-reduced-pom.xml,>
MavenProject: org.apache.servicemix.bundles:org.apache.servicemix.bundles.bcprov-jdk15on:1.47_1-SNAPSHOT
@ <https://builds.apache.org/job/ServiceMix-Bundles/ws/smx4-bundles/bcprov-jdk15on-1.47/dependency-reduced-pom.xml,>
MavenProject: org.apache.servicemix.bundles:org.apache.servicemix.bundles.jaxb-impl:2.2.6_1-SNAPSHOT
@ <https://builds.apache.org/job/ServiceMix-Bundles/ws/smx4-bundles/jaxb-impl-2.2.6/pom.xml,>
MavenProject: org.apache.servicemix.bundles:org.apache.servicemix.bundles.jaxb-xjc:2.2.6_1-SNAPSHOT
@ <https://builds.apache.org/job/ServiceMix-Bundles/ws/smx4-bundles/jaxb-xjc-2.2.6/pom.xml,>
MavenProject: org.apache.servicemix.bundles:org.apache.servicemix.bundles.xmlbeans:2.6.0_1-SNAPSHOT
@ <https://builds.apache.org/job/ServiceMix-Bundles/ws/smx4-bundles/xmlbeans-2.6.0/pom.xml,>
MavenProject: org.apache.servicemix.bundles:org.apache.servicemix.bundles.aws-java-sdk:1.3.22_1-SNAPSHOT
@ <https://builds.apache.org/job/ServiceMix-Bundles/ws/smx4-bundles/aws-java-sdk-1.3.22/pom.xml,>
MavenProject: org.apache.servicemix.bundles:org.apache.servicemix.bundles.aws-java-sdk:1.3.25_1-SNAPSHOT
@ <https://builds.apache.org/job/ServiceMix-Bundles/ws/smx4-bundles/aws-java-sdk-1.3.25/pom.xml,>
MavenProject: org.apache.servicemix.bundles:org.apache.servicemix.bundles.pom:1-SNAPSHOT @
<https://builds.apache.org/job/ServiceMix-Bundles/ws/smx4-bundles/pom.xml]>
[JENKINS] Archiving <https://builds.apache.org/job/ServiceMix-Bundles/ws/smx4-bundles/bcpg-jdk15on-1.47/dependency-reduced-pom.xml>
to /home/hudson/hudson/jobs/ServiceMix-Bundles/modules/org.apache.servicemix.bundles$org.apache.servicemix.bundles.bcpg-jdk15on/builds/2012-11-15_16-32-10/archive/org.apache.servicemix.bundles/org.apache.servicemix.bundles.bcpg-jdk15on/1.47_1-SNAPSHOT/org.apache.servicemix.bundles.bcpg-jdk15on-1.47_1-SNAPSHOT.pom
[JENKINS] Archiving <https://builds.apache.org/job/ServiceMix-Bundles/ws/smx4-bundles/bcpg-jdk15on-1.47/target/org.apache.servicemix.bundles.bcpg-jdk15on-1.47_1-SNAPSHOT.jar>
to /home/hudson/hudson/jobs/ServiceMix-Bundles/modules/org.apache.servicemix.bundles$org.apache.servicemix.bundles.bcpg-jdk15on/builds/2012-11-15_16-32-10/archive/org.apache.servicemix.bundles/org.apache.servicemix.bundles.bcpg-jdk15on/1.47_1-SNAPSHOT/org.apache.servicemix.bundles.bcpg-jdk15on-1.47_1-SNAPSHOT.jar
[JENKINS] Archiving <https://builds.apache.org/job/ServiceMix-Bundles/ws/smx4-bundles/bcpg-jdk15on-1.47/target/org.apache.servicemix.bundles.bcpg-jdk15on-1.47_1-SNAPSHOT-src.zip>
to /home/hudson/hudson/jobs/ServiceMix-Bundles/modules/org.apache.servicemix.bundles$org.apache.servicemix.bundles.bcpg-jdk15on/builds/2012-11-15_16-32-10/archive/org.apache.servicemix.bundles/org.apache.servicemix.bundles.bcpg-jdk15on/1.47_1-SNAPSHOT/org.apache.servicemix.bundles.bcpg-jdk15on-1.47_1-SNAPSHOT-src.zip
[JENKINS] Archiving <https://builds.apache.org/job/ServiceMix-Bundles/ws/smx4-bundles/bcpg-jdk15on-1.47/target/org.apache.servicemix.bundles.bcpg-jdk15on-1.47_1-SNAPSHOT-src.tar.gz>
to /home/hudson/hudson/jobs/ServiceMix-Bundles/modules/org.apache.servicemix.bundles$org.apache.servicemix.bundles.bcpg-jdk15on/builds/2012-11-15_16-32-10/archive/org.apache.servicemix.bundles/org.apache.servicemix.bundles.bcpg-jdk15on/1.47_1-SNAPSHOT/org.apache.servicemix.bundles.bcpg-jdk15on-1.47_1-SNAPSHOT-src.tar.gz
[JENKINS] Archiving <https://builds.apache.org/job/ServiceMix-Bundles/ws/smx4-bundles/bcpg-jdk15on-1.47/target/org.apache.servicemix.bundles.bcpg-jdk15on-1.47_1-SNAPSHOT-sources.jar>
to /home/hudson/hudson/jobs/ServiceMix-Bundles/modules/org.apache.servicemix.bundles$org.apache.servicemix.bundles.bcpg-jdk15on/builds/2012-11-15_16-32-10/archive/org.apache.servicemix.bundles/org.apache.servicemix.bundles.bcpg-jdk15on/1.47_1-SNAPSHOT/org.apache.servicemix.bundles.bcpg-jdk15on-1.47_1-SNAPSHOT-sources.jar
[JENKINS] Archiving <https://builds.apache.org/job/ServiceMix-Bundles/ws/smx4-bundles/jaxb-impl-2.2.6/pom.xml>
to /home/hudson/hudson/jobs/ServiceMix-Bundles/modules/org.apache.servicemix.bundles$org.apache.servicemix.bundles.jaxb-impl/builds/2012-11-15_16-32-10/archive/org.apache.servicemix.bundles/org.apache.servicemix.bundles.jaxb-impl/2.2.6_1-SNAPSHOT/org.apache.servicemix.bundles.jaxb-impl-2.2.6_1-SNAPSHOT.pom
[JENKINS] Archiving <https://builds.apache.org/job/ServiceMix-Bundles/ws/smx4-bundles/bcprov-jdk15on-1.47/dependency-reduced-pom.xml>
to /home/hudson/hudson/jobs/ServiceMix-Bundles/modules/org.apache.servicemix.bundles$org.apache.servicemix.bundles.bcprov-jdk15on/builds/2012-11-15_16-32-10/archive/org.apache.servicemix.bundles/org.apache.servicemix.bundles.bcprov-jdk15on/1.47_1-SNAPSHOT/org.apache.servicemix.bundles.bcprov-jdk15on-1.47_1-SNAPSHOT.pom
[JENKINS] Archiving <https://builds.apache.org/job/ServiceMix-Bundles/ws/smx4-bundles/bcprov-jdk15on-1.47/target/org.apache.servicemix.bundles.bcprov-jdk15on-1.47_1-SNAPSHOT.jar>
to /home/hudson/hudson/jobs/ServiceMix-Bundles/modules/org.apache.servicemix.bundles$org.apache.servicemix.bundles.bcprov-jdk15on/builds/2012-11-15_16-32-10/archive/org.apache.servicemix.bundles/org.apache.servicemix.bundles.bcprov-jdk15on/1.47_1-SNAPSHOT/org.apache.servicemix.bundles.bcprov-jdk15on-1.47_1-SNAPSHOT.jar
[JENKINS] Archiving <https://builds.apache.org/job/ServiceMix-Bundles/ws/smx4-bundles/bcprov-jdk15on-1.47/target/org.apache.servicemix.bundles.bcprov-jdk15on-1.47_1-SNAPSHOT-src.zip>
to /home/hudson/hudson/jobs/ServiceMix-Bundles/modules/org.apache.servicemix.bundles$org.apache.servicemix.bundles.bcprov-jdk15on/builds/2012-11-15_16-32-10/archive/org.apache.servicemix.bundles/org.apache.servicemix.bundles.bcprov-jdk15on/1.47_1-SNAPSHOT/org.apache.servicemix.bundles.bcprov-jdk15on-1.47_1-SNAPSHOT-src.zip
[JENKINS] Archiving <https://builds.apache.org/job/ServiceMix-Bundles/ws/smx4-bundles/bcprov-jdk15on-1.47/target/org.apache.servicemix.bundles.bcprov-jdk15on-1.47_1-SNAPSHOT-src.tar.gz>
to /home/hudson/hudson/jobs/ServiceMix-Bundles/modules/org.apache.servicemix.bundles$org.apache.servicemix.bundles.bcprov-jdk15on/builds/2012-11-15_16-32-10/archive/org.apache.servicemix.bundles/org.apache.servicemix.bundles.bcprov-jdk15on/1.47_1-SNAPSHOT/org.apache.servicemix.bundles.bcprov-jdk15on-1.47_1-SNAPSHOT-src.tar.gz
[JENKINS] Archiving <https://builds.apache.org/job/ServiceMix-Bundles/ws/smx4-bundles/bcprov-jdk15on-1.47/target/org.apache.servicemix.bundles.bcprov-jdk15on-1.47_1-SNAPSHOT-sources.jar>
to /home/hudson/hudson/jobs/ServiceMix-Bundles/modules/org.apache.servicemix.bundles$org.apache.servicemix.bundles.bcprov-jdk15on/builds/2012-11-15_16-32-10/archive/org.apache.servicemix.bundles/org.apache.servicemix.bundles.bcprov-jdk15on/1.47_1-SNAPSHOT/org.apache.servicemix.bundles.bcprov-jdk15on-1.47_1-SNAPSHOT-sources.jar
[JENKINS] Archiving <https://builds.apache.org/job/ServiceMix-Bundles/ws/smx4-bundles/pom.xml>
to /home/hudson/hudson/jobs/ServiceMix-Bundles/modules/org.apache.servicemix.bundles$org.apache.servicemix.bundles.pom/builds/2012-11-15_16-32-10/archive/org.apache.servicemix.bundles/org.apache.servicemix.bundles.pom/1-SNAPSHOT/org.apache.servicemix.bundles.pom-1-SNAPSHOT.pom
[JENKINS] Archiving <https://builds.apache.org/job/ServiceMix-Bundles/ws/smx4-bundles/jaxb-xjc-2.2.6/pom.xml>
to /home/hudson/hudson/jobs/ServiceMix-Bundles/modules/org.apache.servicemix.bundles$org.apache.servicemix.bundles.jaxb-xjc/builds/2012-11-15_16-32-10/archive/org.apache.servicemix.bundles/org.apache.servicemix.bundles.jaxb-xjc/2.2.6_1-SNAPSHOT/org.apache.servicemix.bundles.jaxb-xjc-2.2.6_1-SNAPSHOT.pom
[JENKINS] Archiving <https://builds.apache.org/job/ServiceMix-Bundles/ws/smx4-bundles/aws-java-sdk-1.3.25/pom.xml>
to /home/hudson/hudson/jobs/ServiceMix-Bundles/modules/org.apache.servicemix.bundles$org.apache.servicemix.bundles.aws-java-sdk/builds/2012-11-15_16-32-10/archive/org.apache.servicemix.bundles/org.apache.servicemix.bundles.aws-java-sdk/1.3.25_1-SNAPSHOT/org.apache.servicemix.bundles.aws-java-sdk-1.3.25_1-SNAPSHOT.pom
[JENKINS] Archiving <https://builds.apache.org/job/ServiceMix-Bundles/ws/smx4-bundles/xmlbeans-2.6.0/pom.xml>
to /home/hudson/hudson/jobs/ServiceMix-Bundles/modules/org.apache.servicemix.bundles$org.apache.servicemix.bundles.xmlbeans/builds/2012-11-15_16-32-10/archive/org.apache.servicemix.bundles/org.apache.servicemix.bundles.xmlbeans/2.6.0_1-SNAPSHOT/org.apache.servicemix.bundles.xmlbeans-2.6.0_1-SNAPSHOT.pom
Waiting for Jenkins to finish collecting data
mavenExecutionResult exceptions not empty
message : Failed to execute goal org.apache.maven.plugins:maven-jarsigner-plugin:1.2:sign
(package) on project org.apache.servicemix.bundles.bcprov-jdk15on: The parameters 'alias'
for goal org.apache.maven.plugins:maven-jarsigner-plugin:1.2:sign are missing or invalid
cause : The parameters 'alias' for goal org.apache.maven.plugins:maven-jarsigner-plugin:1.2:sign
are missing or invalid
Stack trace : 
org.apache.maven.lifecycle.LifecycleExecutionException: Failed to execute goal org.apache.maven.plugins:maven-jarsigner-plugin:1.2:sign
(package) on project org.apache.servicemix.bundles.bcprov-jdk15on: The parameters 'alias'
for goal org.apache.maven.plugins:maven-jarsigner-plugin:1.2:sign are missing or invalid
	at org.apache.maven.lifecycle.internal.MojoExecutor.execute(MojoExecutor.java:221)
	at org.apache.maven.lifecycle.internal.MojoExecutor.execute(MojoExecutor.java:153)
	at org.apache.maven.lifecycle.internal.MojoExecutor.execute(MojoExecutor.java:145)
	at org.apache.maven.lifecycle.internal.LifecycleModuleBuilder.buildProject(LifecycleModuleBuilder.java:84)
	at org.apache.maven.lifecycle.internal.LifecycleModuleBuilder.buildProject(LifecycleModuleBuilder.java:59)
	at org.apache.maven.lifecycle.internal.LifecycleStarter.singleThreadedBuild(LifecycleStarter.java:183)
	at org.apache.maven.lifecycle.internal.LifecycleStarter.execute(LifecycleStarter.java:161)
	at org.apache.maven.DefaultMaven.doExecute(DefaultMaven.java:319)
	at org.apache.maven.DefaultMaven.execute(DefaultMaven.java:156)
	at org.jvnet.hudson.maven3.launcher.Maven3Launcher.main(Maven3Launcher.java:79)
	at sun.reflect.NativeMethodAccessorImpl.invoke0(Native Method)
	at sun.reflect.NativeMethodAccessorImpl.invoke(NativeMethodAccessorImpl.java:39)
	at sun.reflect.DelegatingMethodAccessorImpl.invoke(DelegatingMethodAccessorImpl.java:25)
	at java.lang.reflect.Method.invoke(Method.java:597)
	at org.codehaus.plexus.classworlds.launcher.Launcher.launchStandard(Launcher.java:329)
	at org.codehaus.plexus.classworlds.launcher.Launcher.launch(Launcher.java:239)
	at org.jvnet.hudson.maven3.agent.Maven3Main.launch(Maven3Main.java:158)
	at hudson.maven.Maven3Builder.call(Maven3Builder.java:98)
	at hudson.maven.Maven3Builder.call(Maven3Builder.java:64)
	at hudson.remoting.UserRequest.perform(UserRequest.java:118)
	at hudson.remoting.UserRequest.perform(UserRequest.java:48)
	at hudson.remoting.Request$2.run(Request.java:326)
	at hudson.remoting.InterceptingExecutorService$1.call(InterceptingExecutorService.java:72)
	at java.util.concurrent.FutureTask$Sync.innerRun(FutureTask.java:303)
	at java.util.concurrent.FutureTask.run(FutureTask.java:138)
	at java.util.concurrent.ThreadPoolExecutor$Worker.runTask(ThreadPoolExecutor.java:886)
	at java.util.concurrent.ThreadPoolExecutor$Worker.run(ThreadPoolExecutor.java:908)
	at java.lang.Thread.run(Thread.java:662)
Caused by: org.apache.maven.plugin.PluginParameterException: The parameters 'alias' for goal
org.apache.maven.plugins:maven-jarsigner-plugin:1.2:sign are missing or invalid
	at org.apache.maven.plugin.internal.DefaultMavenPluginManager.populatePluginFields(DefaultMavenPluginManager.java:576)
	at org.apache.maven.plugin.internal.DefaultMavenPluginManager.getConfiguredMojo(DefaultMavenPluginManager.java:529)
	at org.apache.maven.plugin.DefaultBuildPluginManager.executeMojo(DefaultBuildPluginManager.java:92)
	at org.apache.maven.lifecycle.internal.MojoExecutor.execute(MojoExecutor.java:209)
	... 27 more
channel stopped

Mime
View raw message