servicemix-commits mailing list archives

Site index · List index
Message view « Date » · « Thread »
Top « Date » · « Thread »
From Apache Jenkins Server <jenk...@builds.apache.org>
Subject Build failed in Jenkins: ServiceMix-Bundles #456
Date Mon, 26 Nov 2012 17:53:51 GMT
See <https://builds.apache.org/job/ServiceMix-Bundles/456/changes>

Changes:

[jbonofre] Update the master pom to include modified bundles in the next release

------------------------------------------
Started by an SCM change
Building remotely on ubuntu1 in workspace <https://builds.apache.org/job/ServiceMix-Bundles/ws/>
Updating http://svn.apache.org/repos/asf/servicemix/smx4/bundles/trunk
A         xmlrpc-client-3.1.3
A         xmlrpc-client-3.1.3/src
A         xmlrpc-client-3.1.3/src/main
A         xmlrpc-client-3.1.3/src/main/resources
A         xmlrpc-client-3.1.3/src/main/resources/OSGI-INF
A         xmlrpc-client-3.1.3/src/main/resources/OSGI-INF/bundle.info
A         xmlrpc-client-3.1.3/pom.xml
U         pom.xml
At revision 1413747
Parsing POMs
ERROR: Failed to parse POMs
hudson.util.IOException2: remote file operation failed: <https://builds.apache.org/job/ServiceMix-Bundles/ws/smx4-bundles>
at hudson.remoting.Channel@4005c0f9:ubuntu1
	at hudson.FilePath.act(FilePath.java:838)
	at hudson.FilePath.act(FilePath.java:824)
	at hudson.maven.MavenModuleSetBuild$MavenModuleSetBuildExecution.parsePoms(MavenModuleSetBuild.java:910)
	at hudson.maven.MavenModuleSetBuild$MavenModuleSetBuildExecution.doRun(MavenModuleSetBuild.java:654)
	at hudson.model.AbstractBuild$AbstractBuildExecution.run(AbstractBuild.java:499)
	at hudson.model.Run.execute(Run.java:1502)
	at hudson.maven.MavenModuleSetBuild.run(MavenModuleSetBuild.java:477)
	at hudson.model.ResourceController.execute(ResourceController.java:88)
	at hudson.model.Executor.run(Executor.java:236)
Caused by: hudson.remoting.ProxyException: hudson.maven.MavenModuleSetBuild$MavenExecutionException:
org.apache.maven.project.ProjectBuildingException: Some problems were encountered while processing
the POMs:
[FATAL] Non-resolvable parent POM: Could not find artifact org.apache.servicemix.bundles:bundles-pom:pom:9-SNAPSHOT
and 'parent.relativePath' points at wrong local POM @ line 24, column 13
[FATAL] Non-resolvable parent POM: Could not find artifact org.apache.servicemix.bundles:bundles-pom:pom:9-SNAPSHOT
and 'parent.relativePath' points at wrong local POM @ line 24, column 13

	at hudson.maven.MavenModuleSetBuild$PomParser.invoke(MavenModuleSetBuild.java:1277)
	at hudson.maven.MavenModuleSetBuild$PomParser.invoke(MavenModuleSetBuild.java:1045)
	at hudson.FilePath$FileCallableWrapper.call(FilePath.java:2200)
	at hudson.remoting.UserRequest.perform(UserRequest.java:118)
	at hudson.remoting.UserRequest.perform(UserRequest.java:48)
	at hudson.remoting.Request$2.run(Request.java:326)
	at hudson.remoting.InterceptingExecutorService$1.call(InterceptingExecutorService.java:72)
	at java.util.concurrent.FutureTask$Sync.innerRun(FutureTask.java:334)
	at java.util.concurrent.FutureTask.run(FutureTask.java:166)
	at java.util.concurrent.ThreadPoolExecutor.runWorker(ThreadPoolExecutor.java:1110)
	at java.util.concurrent.ThreadPoolExecutor$Worker.run(ThreadPoolExecutor.java:603)
	at java.lang.Thread.run(Thread.java:679)
Caused by: hudson.remoting.ProxyException: org.apache.maven.project.ProjectBuildingException:
Some problems were encountered while processing the POMs:
[FATAL] Non-resolvable parent POM: Could not find artifact org.apache.servicemix.bundles:bundles-pom:pom:9-SNAPSHOT
and 'parent.relativePath' points at wrong local POM @ line 24, column 13
[FATAL] Non-resolvable parent POM: Could not find artifact org.apache.servicemix.bundles:bundles-pom:pom:9-SNAPSHOT
and 'parent.relativePath' points at wrong local POM @ line 24, column 13

	at org.apache.maven.project.DefaultProjectBuilder.build(DefaultProjectBuilder.java:363)
	at hudson.maven.MavenEmbedder.buildProjects(MavenEmbedder.java:361)
	at hudson.maven.MavenEmbedder.readProjects(MavenEmbedder.java:331)
	at hudson.maven.MavenModuleSetBuild$PomParser.invoke(MavenModuleSetBuild.java:1227)
	... 11 more

Mime
View raw message