servicemix-commits mailing list archives

Site index · List index
Message view « Date » · « Thread »
Top « Date » · « Thread »
From Apache Jenkins Server <jenk...@builds.apache.org>
Subject Build failed in Jenkins: ServiceMix-Bundles #458
Date Wed, 28 Nov 2012 02:50:44 GMT
See <https://builds.apache.org/job/ServiceMix-Bundles/458/changes>

Changes:

[jbonofre] [SMX4-1270] Fix optional resolution in import of dbunit 2.4.8 OSGi bundle

[jbonofre] [SMX4-1295] Create OSGi bundle for dbunit 2.4.9

------------------------------------------
Started by an SCM change
Building remotely on ubuntu1 in workspace <https://builds.apache.org/job/ServiceMix-Bundles/ws/>
Updating http://svn.apache.org/repos/asf/servicemix/smx4/bundles/trunk
U         avro-1.7.1/pom.xml
A         avro-1.7.2
A         avro-1.7.2/src
A         avro-1.7.2/src/main
A         avro-1.7.2/src/main/java
A         avro-1.7.2/src/main/java/org
A         avro-1.7.2/src/main/java/org/apache
A         avro-1.7.2/src/main/java/org/apache/avro
A         avro-1.7.2/src/main/java/org/apache/avro/reflect
A         avro-1.7.2/src/main/java/org/apache/avro/reflect/ReflectData.java
A         avro-1.7.2/src/main/java/org/apache/avro/specific
A         avro-1.7.2/src/main/java/org/apache/avro/specific/SpecificData.java
A         avro-1.7.2/src/main/java/org/apache/avro/util
A         avro-1.7.2/src/main/java/org/apache/avro/util/ClassLoadingUtils.java
A         avro-1.7.2/src/main/resources
A         avro-1.7.2/src/main/resources/OSGI-INF
A         avro-1.7.2/src/main/resources/OSGI-INF/bundle.info
A         avro-1.7.2/pom.xml
U         aws-java-sdk-1.3.25/pom.xml
A         aws-java-sdk-1.3.26
A         aws-java-sdk-1.3.26/src
A         aws-java-sdk-1.3.26/src/main
A         aws-java-sdk-1.3.26/src/main/resources
A         aws-java-sdk-1.3.26/src/main/resources/OSGI-INF
A         aws-java-sdk-1.3.26/src/main/resources/OSGI-INF/bundle.info
A         aws-java-sdk-1.3.26/pom.xml
U         velocity-1.7/pom.xml
A         aspectj-1.7.1
A         aspectj-1.7.1/src
A         aspectj-1.7.1/src/main
A         aspectj-1.7.1/src/main/resources
A         aspectj-1.7.1/src/main/resources/OSGI-INF
A         aspectj-1.7.1/src/main/resources/OSGI-INF/bundle.info
A         aspectj-1.7.1/pom.xml
U         batik-1.7/pom.xml
U         axiom-api-1.2.13/pom.xml
U         atlassian-xmlrpc-0.11/pom.xml
U         dbunit-2.4.8/pom.xml
A         dbunit-2.4.9
A         dbunit-2.4.9/src
A         dbunit-2.4.9/src/main
A         dbunit-2.4.9/src/main/resources
A         dbunit-2.4.9/src/main/resources/OSGI-INF
A         dbunit-2.4.9/src/main/resources/OSGI-INF/bundle.info
A         dbunit-2.4.9/pom.xml
U         pom.xml
U         avro-ipc-1.7.1/pom.xml
A         avro-ipc-1.7.2
A         avro-ipc-1.7.2/src
A         avro-ipc-1.7.2/src/main
A         avro-ipc-1.7.2/src/main/resources
A         avro-ipc-1.7.2/src/main/resources/OSGI-INF
A         avro-ipc-1.7.2/src/main/resources/OSGI-INF/bundle.info
A         avro-ipc-1.7.2/pom.xml
U         axiom-impl-1.2.13/pom.xml
A         jsch-0.1.49
A         jsch-0.1.49/src
A         jsch-0.1.49/src/main
A         jsch-0.1.49/src/main/resources
A         jsch-0.1.49/src/main/resources/OSGI-INF
A         jsch-0.1.49/src/main/resources/OSGI-INF/bundle.info
A         jsch-0.1.49/pom.xml
At revision 1414513
Parsing POMs
Failed to transfer Could not find metadata org.apache.servicemix.bundles:bundles-pom:9-SNAPSHOT/maven-metadata.xml
in atlassian.m2 (https://maven.atlassian.com/content/groups/public/)
Failed to transfer Could not find artifact org.apache.servicemix.bundles:bundles-pom:pom:9-SNAPSHOT
in atlassian.m2 (https://maven.atlassian.com/content/groups/public/)
ERROR: Failed to parse POMs
hudson.util.IOException2: remote file operation failed: <https://builds.apache.org/job/ServiceMix-Bundles/ws/smx4-bundles>
at hudson.remoting.Channel@4005c0f9:ubuntu1
	at hudson.FilePath.act(FilePath.java:838)
	at hudson.FilePath.act(FilePath.java:824)
	at hudson.maven.MavenModuleSetBuild$MavenModuleSetBuildExecution.parsePoms(MavenModuleSetBuild.java:910)
	at hudson.maven.MavenModuleSetBuild$MavenModuleSetBuildExecution.doRun(MavenModuleSetBuild.java:654)
	at hudson.model.AbstractBuild$AbstractBuildExecution.run(AbstractBuild.java:499)
	at hudson.model.Run.execute(Run.java:1502)
	at hudson.maven.MavenModuleSetBuild.run(MavenModuleSetBuild.java:477)
	at hudson.model.ResourceController.execute(ResourceController.java:88)
	at hudson.model.Executor.run(Executor.java:236)
Caused by: hudson.remoting.ProxyException: hudson.maven.MavenModuleSetBuild$MavenExecutionException:
org.apache.maven.project.ProjectBuildingException: Some problems were encountered while processing
the POMs:
[FATAL] Non-resolvable parent POM: Could not find artifact org.apache.servicemix.bundles:bundles-pom:pom:9-SNAPSHOT
and 'parent.relativePath' points at wrong local POM @ line 24, column 13
[FATAL] Non-resolvable parent POM: Could not find artifact org.apache.servicemix.bundles:bundles-pom:pom:9-SNAPSHOT
and 'parent.relativePath' points at wrong local POM @ line 24, column 13
[FATAL] Non-resolvable parent POM: Could not find artifact org.apache.servicemix.bundles:bundles-pom:pom:9-SNAPSHOT
in atlassian.m2 (https://maven.atlassian.com/content/groups/public/) and 'parent.relativePath'
points at wrong local POM @ line 24, column 13

	at hudson.maven.MavenModuleSetBuild$PomParser.invoke(MavenModuleSetBuild.java:1277)
	at hudson.maven.MavenModuleSetBuild$PomParser.invoke(MavenModuleSetBuild.java:1045)
	at hudson.FilePath$FileCallableWrapper.call(FilePath.java:2200)
	at hudson.remoting.UserRequest.perform(UserRequest.java:118)
	at hudson.remoting.UserRequest.perform(UserRequest.java:48)
	at hudson.remoting.Request$2.run(Request.java:326)
	at hudson.remoting.InterceptingExecutorService$1.call(InterceptingExecutorService.java:72)
	at java.util.concurrent.FutureTask$Sync.innerRun(FutureTask.java:334)
	at java.util.concurrent.FutureTask.run(FutureTask.java:166)
	at java.util.concurrent.ThreadPoolExecutor.runWorker(ThreadPoolExecutor.java:1110)
	at java.util.concurrent.ThreadPoolExecutor$Worker.run(ThreadPoolExecutor.java:603)
	at java.lang.Thread.run(Thread.java:679)
Caused by: hudson.remoting.ProxyException: org.apache.maven.project.ProjectBuildingException:
Some problems were encountered while processing the POMs:
[FATAL] Non-resolvable parent POM: Could not find artifact org.apache.servicemix.bundles:bundles-pom:pom:9-SNAPSHOT
and 'parent.relativePath' points at wrong local POM @ line 24, column 13
[FATAL] Non-resolvable parent POM: Could not find artifact org.apache.servicemix.bundles:bundles-pom:pom:9-SNAPSHOT
and 'parent.relativePath' points at wrong local POM @ line 24, column 13
[FATAL] Non-resolvable parent POM: Could not find artifact org.apache.servicemix.bundles:bundles-pom:pom:9-SNAPSHOT
in atlassian.m2 (https://maven.atlassian.com/content/groups/public/) and 'parent.relativePath'
points at wrong local POM @ line 24, column 13

	at org.apache.maven.project.DefaultProjectBuilder.build(DefaultProjectBuilder.java:363)
	at hudson.maven.MavenEmbedder.buildProjects(MavenEmbedder.java:361)
	at hudson.maven.MavenEmbedder.readProjects(MavenEmbedder.java:331)
	at hudson.maven.MavenModuleSetBuild$PomParser.invoke(MavenModuleSetBuild.java:1227)
	... 11 more

Mime
View raw message