servicemix-commits mailing list archives

Site index · List index
Message view « Date » · « Thread »
Top « Date » · « Thread »
From Apache Jenkins Server <jenk...@builds.apache.org>
Subject Build failed in Jenkins: ServiceMix-Bundles #592
Date Tue, 31 Dec 2013 08:54:48 GMT
See <https://builds.apache.org/job/ServiceMix-Bundles/592/changes>

Changes:

[jbonofre] [SMX4-1620] Create OSGi bundle for hibernate-validator 5.0.2.Final

[jbonofre] Upgrade maven plugins version

------------------------------------------
[...truncated 1882 lines...]
Downloaded: http://repo1.maven.org/maven2/org/apache/maven/plugins/maven-jarsigner-plugin/1.2/maven-jarsigner-plugin-1.2.jar
(28 KB at 3931.1 KB/sec)
Downloading: http://repo1.maven.org/maven2/org/apache/maven/plugins/maven-antrun-plugin/1.7/maven-antrun-plugin-1.7.pom
Downloaded: http://repo1.maven.org/maven2/org/apache/maven/plugins/maven-antrun-plugin/1.7/maven-antrun-plugin-1.7.pom
(5 KB at 1006.8 KB/sec)
Downloading: http://repo1.maven.org/maven2/org/apache/maven/plugins/maven-antrun-plugin/1.7/maven-antrun-plugin-1.7.jar
Downloaded: http://repo1.maven.org/maven2/org/apache/maven/plugins/maven-antrun-plugin/1.7/maven-antrun-plugin-1.7.jar
(31 KB at 5143.7 KB/sec)
Downloading: http://repo1.maven.org/maven2/org/bouncycastle/bcprov-jdk15on/1.50/bcprov-jdk15on-1.50-sources.jar
Downloaded: http://repo1.maven.org/maven2/org/bouncycastle/bcprov-jdk15on/1.50/bcprov-jdk15on-1.50-sources.jar
(2187 KB at 34163.4 KB/sec)
[INFO] 
[INFO] --- maven-clean-plugin:2.3:clean (default-clean) @ org.apache.servicemix.bundles.bcprov-jdk15on
---
[INFO] 
[INFO] --- maven-antrun-plugin:1.7:run (default) @ org.apache.servicemix.bundles.bcprov-jdk15on
---
Downloading: http://repo1.maven.org/maven2/org/apache/maven/maven-plugin-api/2.0.11/maven-plugin-api-2.0.11.pom
Downloaded: http://repo1.maven.org/maven2/org/apache/maven/maven-plugin-api/2.0.11/maven-plugin-api-2.0.11.pom
(2 KB at 357.2 KB/sec)
Downloading: http://repo1.maven.org/maven2/org/apache/maven/maven/2.0.11/maven-2.0.11.pom
Downloaded: http://repo1.maven.org/maven2/org/apache/maven/maven/2.0.11/maven-2.0.11.pom (22
KB at 5331.1 KB/sec)
Downloading: http://repo1.maven.org/maven2/org/apache/maven/maven-parent/12/maven-parent-12.pom
Downloaded: http://repo1.maven.org/maven2/org/apache/maven/maven-parent/12/maven-parent-12.pom
(22 KB at 5307.9 KB/sec)
Downloading: http://repo1.maven.org/maven2/org/apache/maven/maven-project/2.0.11/maven-project-2.0.11.pom
Downloaded: http://repo1.maven.org/maven2/org/apache/maven/maven-project/2.0.11/maven-project-2.0.11.pom
(3 KB at 542.4 KB/sec)
Downloading: http://repo1.maven.org/maven2/org/apache/maven/maven-settings/2.0.11/maven-settings-2.0.11.pom
Downloaded: http://repo1.maven.org/maven2/org/apache/maven/maven-settings/2.0.11/maven-settings-2.0.11.pom
(3 KB at 426.4 KB/sec)
Downloading: http://repo1.maven.org/maven2/org/apache/maven/maven-model/2.0.11/maven-model-2.0.11.pom
Downloaded: http://repo1.maven.org/maven2/org/apache/maven/maven-model/2.0.11/maven-model-2.0.11.pom
(4 KB at 792.0 KB/sec)
Downloading: http://repo1.maven.org/maven2/org/codehaus/plexus/plexus-interpolation/1.1/plexus-interpolation-1.1.pom
Downloaded: http://repo1.maven.org/maven2/org/codehaus/plexus/plexus-interpolation/1.1/plexus-interpolation-1.1.pom
(2 KB at 467.8 KB/sec)
Downloading: http://repo1.maven.org/maven2/org/apache/maven/maven-profile/2.0.11/maven-profile-2.0.11.pom
Downloaded: http://repo1.maven.org/maven2/org/apache/maven/maven-profile/2.0.11/maven-profile-2.0.11.pom
(2 KB at 498.8 KB/sec)
Downloading: http://repo1.maven.org/maven2/org/apache/maven/maven-artifact-manager/2.0.11/maven-artifact-manager-2.0.11.pom
Downloaded: http://repo1.maven.org/maven2/org/apache/maven/maven-artifact-manager/2.0.11/maven-artifact-manager-2.0.11.pom
(3 KB at 856.4 KB/sec)
Downloading: http://repo1.maven.org/maven2/org/apache/maven/maven-repository-metadata/2.0.11/maven-repository-metadata-2.0.11.pom
Downloaded: http://repo1.maven.org/maven2/org/apache/maven/maven-repository-metadata/2.0.11/maven-repository-metadata-2.0.11.pom
(3 KB at 551.3 KB/sec)
Downloading: http://repo1.maven.org/maven2/org/apache/maven/maven-artifact/2.0.11/maven-artifact-2.0.11.pom
Downloaded: http://repo1.maven.org/maven2/org/apache/maven/maven-artifact/2.0.11/maven-artifact-2.0.11.pom
(2 KB at 387.0 KB/sec)
Downloading: http://repo1.maven.org/maven2/org/apache/maven/maven-plugin-registry/2.0.11/maven-plugin-registry-2.0.11.pom
Downloaded: http://repo1.maven.org/maven2/org/apache/maven/maven-plugin-registry/2.0.11/maven-plugin-registry-2.0.11.pom
(2 KB at 471.4 KB/sec)
Downloading: http://repo1.maven.org/maven2/org/apache/ant/ant/1.8.2/ant-1.8.2.pom
Downloaded: http://repo1.maven.org/maven2/org/apache/ant/ant/1.8.2/ant-1.8.2.pom (10 KB at
2411.1 KB/sec)
Downloading: http://repo1.maven.org/maven2/org/apache/ant/ant-parent/1.8.2/ant-parent-1.8.2.pom
Downloaded: http://repo1.maven.org/maven2/org/apache/ant/ant-parent/1.8.2/ant-parent-1.8.2.pom
(5 KB at 1144.5 KB/sec)
Downloading: http://repo1.maven.org/maven2/org/apache/ant/ant-launcher/1.8.2/ant-launcher-1.8.2.pom
Downloaded: http://repo1.maven.org/maven2/org/apache/ant/ant-launcher/1.8.2/ant-launcher-1.8.2.pom
(3 KB at 590.6 KB/sec)
Downloading: http://repo1.maven.org/maven2/org/codehaus/plexus/plexus-interpolation/1.1/plexus-interpolation-1.1.jar
Downloading: http://repo1.maven.org/maven2/org/codehaus/plexus/plexus-utils/2.0.5/plexus-utils-2.0.5.jar
Downloading: http://repo1.maven.org/maven2/org/apache/ant/ant/1.8.2/ant-1.8.2.jar
Downloading: http://repo1.maven.org/maven2/org/apache/ant/ant-launcher/1.8.2/ant-launcher-1.8.2.jar
Downloaded: http://repo1.maven.org/maven2/org/codehaus/plexus/plexus-interpolation/1.1/plexus-interpolation-1.1.jar
(35 KB at 8662.4 KB/sec)
Downloaded: http://repo1.maven.org/maven2/org/apache/ant/ant-launcher/1.8.2/ant-launcher-1.8.2.jar
(13 KB at 1719.0 KB/sec)
Downloaded: http://repo1.maven.org/maven2/org/codehaus/plexus/plexus-utils/2.0.5/plexus-utils-2.0.5.jar
(218 KB at 12820.0 KB/sec)
Downloaded: http://repo1.maven.org/maven2/org/apache/ant/ant/1.8.2/ant-1.8.2.jar (1889 KB
at 39342.1 KB/sec)
[INFO] Executing tasks

main:
     [echo] This bundle requires jar signing. In order to properly jar sign this bundle, you
     [echo]                                     will need the following:
     [echo]                                     1. Create a keystore using the keytool that
ships with your jdk.
     [echo]                                     keytool -genkeypair -alias [alias] -keyalg
RSA -keystore [path].
     [echo]                                     2. Add the required keystore properties [keystore,alias,keypass,storepass]
inside
     [echo]                                     your maven profile [settings.xml]
[INFO] Executed tasks
[INFO] 
[INFO] --- maven-dependency-plugin:2.8:copy (copy-legal) @ org.apache.servicemix.bundles.bcprov-jdk15on
---
[INFO] Configured Artifact: org.apache.servicemix.legal:legal:1.0:xml
[INFO] Copying legal-1.0.xml to <https://builds.apache.org/job/ServiceMix-Bundles/ws/smx4-bundles/bcprov-jdk15on-1.50/target/legal/legal.xml>
[INFO] 
[INFO] --- maven-remote-resources-plugin:1.5:process (default) @ org.apache.servicemix.bundles.bcprov-jdk15on
---
[INFO] 
[INFO] --- maven-resources-plugin:2.4:resources (default-resources) @ org.apache.servicemix.bundles.bcprov-jdk15on
---
[INFO] Using 'UTF-8' encoding to copy filtered resources.
[INFO] Copying 1 resource
[INFO] Copying 3 resources
[INFO] 
[INFO] --- maven-compiler-plugin:3.1:compile (default-compile) @ org.apache.servicemix.bundles.bcprov-jdk15on
---
[INFO] No sources to compile
[INFO] 
[INFO] --- maven-resources-plugin:2.4:testResources (default-testResources) @ org.apache.servicemix.bundles.bcprov-jdk15on
---
[INFO] Using 'UTF-8' encoding to copy filtered resources.
[INFO] skip non existing resourceDirectory <https://builds.apache.org/job/ServiceMix-Bundles/ws/smx4-bundles/bcprov-jdk15on-1.50/src/test/resources>
[INFO] Copying 3 resources
[INFO] 
[INFO] --- maven-compiler-plugin:3.1:testCompile (default-testCompile) @ org.apache.servicemix.bundles.bcprov-jdk15on
---
[INFO] No sources to compile
[INFO] 
[INFO] --- maven-surefire-plugin:2.16:test (default-test) @ org.apache.servicemix.bundles.bcprov-jdk15on
---
[INFO] Tests are skipped.
[INFO] 
[INFO] --- maven-bundle-plugin:2.3.7:bundle (default-bundle) @ org.apache.servicemix.bundles.bcprov-jdk15on
---
[INFO] 
[INFO] --- maven-assembly-plugin:2.4:single (make-src-assembly) @ org.apache.servicemix.bundles.bcprov-jdk15on
---
[INFO] Building zip: <https://builds.apache.org/job/ServiceMix-Bundles/ws/smx4-bundles/bcprov-jdk15on-1.50/target/org.apache.servicemix.bundles.bcprov-jdk15on-1.50_1-SNAPSHOT-src.zip>
[INFO] Building tar: <https://builds.apache.org/job/ServiceMix-Bundles/ws/smx4-bundles/bcprov-jdk15on-1.50/target/org.apache.servicemix.bundles.bcprov-jdk15on-1.50_1-SNAPSHOT-src.tar.gz>
[WARNING] Entry: org.apache.servicemix.bundles.bcprov-jdk15on-1.50_1-SNAPSHOT/src/main/resources/OSGI-INF/bundle.info
longer than 100 characters.
[WARNING] Resulting tar file can only be processed successfully by GNU compatible tar commands
[INFO] 
[INFO] --- maven-shade-plugin:1.7.1:shade (sources) @ org.apache.servicemix.bundles.bcprov-jdk15on
---
[INFO] Excluding org.bouncycastle:bcprov-jdk15on:jar:1.50 from the shaded jar.
[INFO] Including org.bouncycastle:bcprov-jdk15on:jar:sources:1.50 in the shaded jar.
[INFO] Attaching shaded artifact.
[INFO] 
[INFO] --- maven-shade-plugin:1.7.1:shade (default) @ org.apache.servicemix.bundles.bcprov-jdk15on
---
[INFO] Including org.bouncycastle:bcprov-jdk15on:jar:1.50 in the shaded jar.
[INFO] Including org.bouncycastle:bcprov-jdk15on:jar:sources:1.50 in the shaded jar.
[INFO] Replacing original artifact with shaded artifact.
[INFO] Replacing <https://builds.apache.org/job/ServiceMix-Bundles/ws/smx4-bundles/bcprov-jdk15on-1.50/target/org.apache.servicemix.bundles.bcprov-jdk15on-1.50_1-SNAPSHOT.jar>
with <https://builds.apache.org/job/ServiceMix-Bundles/ws/smx4-bundles/bcprov-jdk15on-1.50/target/org.apache.servicemix.bundles.bcprov-jdk15on-1.50_1-SNAPSHOT-shaded.jar>
[INFO] 
[INFO] --- maven-jarsigner-plugin:1.2:sign (package) @ org.apache.servicemix.bundles.bcprov-jdk15on
---
[INFO] ------------------------------------------------------------------------
[INFO] Reactor Summary:
[INFO] 
[INFO] Apache ServiceMix :: Bundles ...................... SUCCESS [32.115s]
[INFO] Apache ServiceMix :: Bundles :: elasticsearch ..... SUCCESS [48.550s]
[INFO] Apache ServiceMix :: Bundles :: xstream ........... SUCCESS [4.419s]
[INFO] Apache ServiceMix :: Bundles :: xstream ........... SUCCESS [3.268s]
[INFO] Apache ServiceMix :: Bundles :: xstream ........... SUCCESS [3.233s]
[INFO] Apache ServiceMix :: Bundles :: xstream ........... SUCCESS [2.639s]
[INFO] Apache ServiceMix :: Bundles :: compiler .......... SUCCESS [3.762s]
[INFO] Apache ServiceMix :: Bundles :: rjc ............... SUCCESS [4.389s]
[INFO] Apache ServiceMix :: Bundles :: saaj-impl ......... SUCCESS [5.388s]
[INFO] Apache ServiceMix :: Bundles :: Saxon-HE .......... SUCCESS [9.274s]
[INFO] Apache ServiceMix :: Bundles :: bcpg-jdk15on ...... SUCCESS [7.137s]
[INFO] Apache ServiceMix :: Bundles :: bcprov-jdk15on .... FAILURE [7.687s]
[INFO] Apache ServiceMix :: Bundles :: jaxen ............. SKIPPED
[INFO] Apache ServiceMix :: Bundles :: cglib ............. SKIPPED
[INFO] Apache ServiceMix :: Bundles :: json4s ............ SKIPPED
[INFO] Apache ServiceMix :: Bundles :: postgresql ........ SKIPPED
[INFO] Apache ServiceMix :: Bundles :: facebook4j-core ... SKIPPED
[INFO] Apache ServiceMix :: Bundles :: hbase ............. SKIPPED
[INFO] Apache ServiceMix :: Bundles :: JavaEWAH .......... SKIPPED
[INFO] Apache ServiceMix :: Bundles :: aws-java-sdk ...... SKIPPED
[INFO] Apache ServiceMix :: Bundles :: jackson-module-scala_2.10  SKIPPED
[INFO] Apache ServiceMix :: Bundles :: netty ............. SKIPPED
[INFO] Apache ServiceMix :: Bundles :: hibernate-validator  SKIPPED
[INFO] Apache ServiceMix :: Bundles ...................... SKIPPED
[INFO] ------------------------------------------------------------------------
[INFO] BUILD FAILURE
[INFO] ------------------------------------------------------------------------
[INFO] Total time: 4:15.140s
[INFO] Finished at: Tue Dec 31 08:52:26 UTC 2013
[INFO] Final Memory: 23M/250M
[INFO] ------------------------------------------------------------------------
Waiting for Jenkins to finish collecting data
[ERROR] Failed to execute goal org.apache.maven.plugins:maven-jarsigner-plugin:1.2:sign (package)
on project org.apache.servicemix.bundles.bcprov-jdk15on: The parameters 'alias' for goal org.apache.maven.plugins:maven-jarsigner-plugin:1.2:sign
are missing or invalid -> [Help 1]
org.apache.maven.lifecycle.LifecycleExecutionException: Failed to execute goal org.apache.maven.plugins:maven-jarsigner-plugin:1.2:sign
(package) on project org.apache.servicemix.bundles.bcprov-jdk15on: The parameters 'alias'
for goal org.apache.maven.plugins:maven-jarsigner-plugin:1.2:sign are missing or invalid
	at org.apache.maven.lifecycle.internal.MojoExecutor.execute(MojoExecutor.java:221)
	at org.apache.maven.lifecycle.internal.MojoExecutor.execute(MojoExecutor.java:153)
	at org.apache.maven.lifecycle.internal.MojoExecutor.execute(MojoExecutor.java:145)
	at org.apache.maven.lifecycle.internal.LifecycleModuleBuilder.buildProject(LifecycleModuleBuilder.java:84)
	at org.apache.maven.lifecycle.internal.LifecycleModuleBuilder.buildProject(LifecycleModuleBuilder.java:59)
	at org.apache.maven.lifecycle.internal.LifecycleStarter.singleThreadedBuild(LifecycleStarter.java:183)
	at org.apache.maven.lifecycle.internal.LifecycleStarter.execute(LifecycleStarter.java:161)
	at org.apache.maven.DefaultMaven.doExecute(DefaultMaven.java:319)
	at org.apache.maven.DefaultMaven.execute(DefaultMaven.java:156)
	at org.jvnet.hudson.maven3.launcher.Maven3Launcher.main(Maven3Launcher.java:117)
	at sun.reflect.NativeMethodAccessorImpl.invoke0(Native Method)
	at sun.reflect.NativeMethodAccessorImpl.invoke(NativeMethodAccessorImpl.java:39)
	at sun.reflect.DelegatingMethodAccessorImpl.invoke(DelegatingMethodAccessorImpl.java:25)
	at java.lang.reflect.Method.invoke(Method.java:597)
	at org.codehaus.plexus.classworlds.launcher.Launcher.launchStandard(Launcher.java:329)
	at org.codehaus.plexus.classworlds.launcher.Launcher.launch(Launcher.java:239)
	at org.jvnet.hudson.maven3.agent.Maven3Main.launch(Maven3Main.java:178)
	at sun.reflect.NativeMethodAccessorImpl.invoke0(Native Method)
	at sun.reflect.NativeMethodAccessorImpl.invoke(NativeMethodAccessorImpl.java:39)
	at sun.reflect.DelegatingMethodAccessorImpl.invoke(DelegatingMethodAccessorImpl.java:25)
	at java.lang.reflect.Method.invoke(Method.java:597)
	at hudson.maven.Maven3Builder.call(Maven3Builder.java:134)
	at hudson.maven.Maven3Builder.call(Maven3Builder.java:69)
	at hudson.remoting.UserRequest.perform(UserRequest.java:118)
	at hudson.remoting.UserRequest.perform(UserRequest.java:48)
	at hudson.remoting.Request$2.run(Request.java:328)
	at hudson.remoting.InterceptingExecutorService$1.call(InterceptingExecutorService.java:72)
	at java.util.concurrent.FutureTask$Sync.innerRun(FutureTask.java:303)
	at java.util.concurrent.FutureTask.run(FutureTask.java:138)
	at java.util.concurrent.ThreadPoolExecutor$Worker.runTask(ThreadPoolExecutor.java:895)
	at java.util.concurrent.ThreadPoolExecutor$Worker.run(ThreadPoolExecutor.java:918)
	at java.lang.Thread.run(Thread.java:662)
Caused by: org.apache.maven.plugin.PluginParameterException: The parameters 'alias' for goal
org.apache.maven.plugins:maven-jarsigner-plugin:1.2:sign are missing or invalid
	at org.apache.maven.plugin.internal.DefaultMavenPluginManager.populatePluginFields(DefaultMavenPluginManager.java:576)
	at org.apache.maven.plugin.internal.DefaultMavenPluginManager.getConfiguredMojo(DefaultMavenPluginManager.java:529)
	at org.apache.maven.plugin.DefaultBuildPluginManager.executeMojo(DefaultBuildPluginManager.java:92)
	at org.apache.maven.lifecycle.internal.MojoExecutor.execute(MojoExecutor.java:209)
	... 31 more
[ERROR] 
[ERROR] Re-run Maven using the -X switch to enable full debug logging.
[ERROR] 
[ERROR] For more information about the errors and possible solutions, please read the following
articles:
[ERROR] [Help 1] http://cwiki.apache.org/confluence/display/MAVEN/PluginParameterException
[ERROR] 
[ERROR] After correcting the problems, you can resume the build with the command
[ERROR]   mvn <goals> -rf :org.apache.servicemix.bundles.bcprov-jdk15on
[JENKINS] Archiving <https://builds.apache.org/job/ServiceMix-Bundles/ws/smx4-bundles/cglib-3.1/pom.xml>
to org.apache.servicemix.bundles/org.apache.servicemix.bundles.cglib/3.1_1-SNAPSHOT/org.apache.servicemix.bundles.cglib-3.1_1-SNAPSHOT.pom
[JENKINS] Archiving <https://builds.apache.org/job/ServiceMix-Bundles/ws/smx4-bundles/jackson-module-scala-2.3.0/pom.xml>
to org.apache.servicemix.bundles/org.apache.servicemix.bundles.jackson-module-scala/2.3.0_1-SNAPSHOT/org.apache.servicemix.bundles.jackson-module-scala-2.3.0_1-SNAPSHOT.pom
[JENKINS] Archiving <https://builds.apache.org/job/ServiceMix-Bundles/ws/smx4-bundles/aws-java-sdk-1.6.10/pom.xml>
to org.apache.servicemix.bundles/org.apache.servicemix.bundles.aws-java-sdk/1.6.10_1-SNAPSHOT/org.apache.servicemix.bundles.aws-java-sdk-1.6.10_1-SNAPSHOT.pom
[JENKINS] Archiving <https://builds.apache.org/job/ServiceMix-Bundles/ws/smx4-bundles/hbase-0.96.1.1-hadoop2/pom.xml>
to org.apache.servicemix.bundles/org.apache.servicemix.bundles.hbase/0.96.1.1-hadoop2_1-SNAPSHOT/org.apache.servicemix.bundles.hbase-0.96.1.1-hadoop2_1-SNAPSHOT.pom
[JENKINS] Archiving <https://builds.apache.org/job/ServiceMix-Bundles/ws/smx4-bundles/saxon-9.5.1-3/pom.xml>
to org.apache.servicemix.bundles/org.apache.servicemix.bundles.saxon/9.5.1-3_1-SNAPSHOT/org.apache.servicemix.bundles.saxon-9.5.1-3_1-SNAPSHOT.pom
[JENKINS] Archiving <https://builds.apache.org/job/ServiceMix-Bundles/ws/smx4-bundles/saxon-9.5.1-3/target/org.apache.servicemix.bundles.saxon-9.5.1-3_1-SNAPSHOT.jar>
to org.apache.servicemix.bundles/org.apache.servicemix.bundles.saxon/9.5.1-3_1-SNAPSHOT/org.apache.servicemix.bundles.saxon-9.5.1-3_1-SNAPSHOT.jar
[JENKINS] Archiving <https://builds.apache.org/job/ServiceMix-Bundles/ws/smx4-bundles/saxon-9.5.1-3/target/org.apache.servicemix.bundles.saxon-9.5.1-3_1-SNAPSHOT-src.zip>
to org.apache.servicemix.bundles/org.apache.servicemix.bundles.saxon/9.5.1-3_1-SNAPSHOT/org.apache.servicemix.bundles.saxon-9.5.1-3_1-SNAPSHOT-src.zip
[JENKINS] Archiving <https://builds.apache.org/job/ServiceMix-Bundles/ws/smx4-bundles/saxon-9.5.1-3/target/org.apache.servicemix.bundles.saxon-9.5.1-3_1-SNAPSHOT-src.tar.gz>
to org.apache.servicemix.bundles/org.apache.servicemix.bundles.saxon/9.5.1-3_1-SNAPSHOT/org.apache.servicemix.bundles.saxon-9.5.1-3_1-SNAPSHOT-src.tar.gz
[JENKINS] Archiving <https://builds.apache.org/job/ServiceMix-Bundles/ws/smx4-bundles/saxon-9.5.1-3/target/org.apache.servicemix.bundles.saxon-9.5.1-3_1-SNAPSHOT-sources.jar>
to org.apache.servicemix.bundles/org.apache.servicemix.bundles.saxon/9.5.1-3_1-SNAPSHOT/org.apache.servicemix.bundles.saxon-9.5.1-3_1-SNAPSHOT-sources.jar
[JENKINS] Archiving <https://builds.apache.org/job/ServiceMix-Bundles/ws/smx4-bundles/json4s-3.2.6/pom.xml>
to org.apache.servicemix.bundles/org.apache.servicemix.bundles.json4s/3.2.6_1-SNAPSHOT/org.apache.servicemix.bundles.json4s-3.2.6_1-SNAPSHOT.pom
[JENKINS] Archiving <https://builds.apache.org/job/ServiceMix-Bundles/ws/smx4-bundles/mustache-compiler-0.8.14/dependency-reduced-pom.xml>
to org.apache.servicemix.bundles/org.apache.servicemix.bundles.mustache-compiler/0.8.14_1-SNAPSHOT/org.apache.servicemix.bundles.mustache-compiler-0.8.14_1-SNAPSHOT.pom
[JENKINS] Archiving <https://builds.apache.org/job/ServiceMix-Bundles/ws/smx4-bundles/mustache-compiler-0.8.14/target/org.apache.servicemix.bundles.mustache-compiler-0.8.14_1-SNAPSHOT.jar>
to org.apache.servicemix.bundles/org.apache.servicemix.bundles.mustache-compiler/0.8.14_1-SNAPSHOT/org.apache.servicemix.bundles.mustache-compiler-0.8.14_1-SNAPSHOT.jar
[JENKINS] Archiving <https://builds.apache.org/job/ServiceMix-Bundles/ws/smx4-bundles/mustache-compiler-0.8.14/target/org.apache.servicemix.bundles.mustache-compiler-0.8.14_1-SNAPSHOT-src.zip>
to org.apache.servicemix.bundles/org.apache.servicemix.bundles.mustache-compiler/0.8.14_1-SNAPSHOT/org.apache.servicemix.bundles.mustache-compiler-0.8.14_1-SNAPSHOT-src.zip
[JENKINS] Archiving <https://builds.apache.org/job/ServiceMix-Bundles/ws/smx4-bundles/mustache-compiler-0.8.14/target/org.apache.servicemix.bundles.mustache-compiler-0.8.14_1-SNAPSHOT-src.tar.gz>
to org.apache.servicemix.bundles/org.apache.servicemix.bundles.mustache-compiler/0.8.14_1-SNAPSHOT/org.apache.servicemix.bundles.mustache-compiler-0.8.14_1-SNAPSHOT-src.tar.gz
[JENKINS] Archiving <https://builds.apache.org/job/ServiceMix-Bundles/ws/smx4-bundles/mustache-compiler-0.8.14/target/org.apache.servicemix.bundles.mustache-compiler-0.8.14_1-SNAPSHOT-sources.jar>
to org.apache.servicemix.bundles/org.apache.servicemix.bundles.mustache-compiler/0.8.14_1-SNAPSHOT/org.apache.servicemix.bundles.mustache-compiler-0.8.14_1-SNAPSHOT-sources.jar
[JENKINS] Archiving <https://builds.apache.org/job/ServiceMix-Bundles/ws/smx4-bundles/jaxen-1.1.6/pom.xml>
to org.apache.servicemix.bundles/org.apache.servicemix.bundles.jaxen/1.1.6_1-SNAPSHOT/org.apache.servicemix.bundles.jaxen-1.1.6_1-SNAPSHOT.pom
[JENKINS] Archiving <https://builds.apache.org/job/ServiceMix-Bundles/ws/smx4-bundles/javaewah-0.7.9/pom.xml>
to org.apache.servicemix.bundles/org.apache.servicemix.bundles.javaewah/0.7.9_1-SNAPSHOT/org.apache.servicemix.bundles.javaewah-0.7.9_1-SNAPSHOT.pom
[JENKINS] Archiving <https://builds.apache.org/job/ServiceMix-Bundles/ws/smx4-bundles/pom.xml>
to org.apache.servicemix.bundles/org.apache.servicemix.bundles.pom/1-SNAPSHOT/org.apache.servicemix.bundles.pom-1-SNAPSHOT.pom
[JENKINS] Archiving <https://builds.apache.org/job/ServiceMix-Bundles/ws/smx4-bundles/saaj-impl-1.3.23/dependency-reduced-pom.xml>
to org.apache.servicemix.bundles/org.apache.servicemix.bundles.saaj-impl/1.3.23_1-SNAPSHOT/org.apache.servicemix.bundles.saaj-impl-1.3.23_1-SNAPSHOT.pom
[JENKINS] Archiving <https://builds.apache.org/job/ServiceMix-Bundles/ws/smx4-bundles/saaj-impl-1.3.23/target/org.apache.servicemix.bundles.saaj-impl-1.3.23_1-SNAPSHOT.jar>
to org.apache.servicemix.bundles/org.apache.servicemix.bundles.saaj-impl/1.3.23_1-SNAPSHOT/org.apache.servicemix.bundles.saaj-impl-1.3.23_1-SNAPSHOT.jar
[JENKINS] Archiving <https://builds.apache.org/job/ServiceMix-Bundles/ws/smx4-bundles/saaj-impl-1.3.23/target/org.apache.servicemix.bundles.saaj-impl-1.3.23_1-SNAPSHOT-src.zip>
to org.apache.servicemix.bundles/org.apache.servicemix.bundles.saaj-impl/1.3.23_1-SNAPSHOT/org.apache.servicemix.bundles.saaj-impl-1.3.23_1-SNAPSHOT-src.zip
[JENKINS] Archiving <https://builds.apache.org/job/ServiceMix-Bundles/ws/smx4-bundles/saaj-impl-1.3.23/target/org.apache.servicemix.bundles.saaj-impl-1.3.23_1-SNAPSHOT-src.tar.gz>
to org.apache.servicemix.bundles/org.apache.servicemix.bundles.saaj-impl/1.3.23_1-SNAPSHOT/org.apache.servicemix.bundles.saaj-impl-1.3.23_1-SNAPSHOT-src.tar.gz
[JENKINS] Archiving <https://builds.apache.org/job/ServiceMix-Bundles/ws/smx4-bundles/saaj-impl-1.3.23/target/org.apache.servicemix.bundles.saaj-impl-1.3.23_1-SNAPSHOT-sources.jar>
to org.apache.servicemix.bundles/org.apache.servicemix.bundles.saaj-impl/1.3.23_1-SNAPSHOT/org.apache.servicemix.bundles.saaj-impl-1.3.23_1-SNAPSHOT-sources.jar
[JENKINS] Archiving <https://builds.apache.org/job/ServiceMix-Bundles/ws/smx4-bundles/postgresql-9.3-1100-jdbc41/pom.xml>
to org.apache.servicemix.bundles/org.apache.servicemix.bundles.postgresql/9.3-1100-jdbc41_1-SNAPSHOT/org.apache.servicemix.bundles.postgresql-9.3-1100-jdbc41_1-SNAPSHOT.pom
[JENKINS] Archiving <https://builds.apache.org/job/ServiceMix-Bundles/ws/smx4-bundles/elasticsearch-0.90.5/dependency-reduced-pom.xml>
to org.apache.servicemix.bundles/org.apache.servicemix.bundles.elasticsearch/0.90.5_2-SNAPSHOT/org.apache.servicemix.bundles.elasticsearch-0.90.5_2-SNAPSHOT.pom
[JENKINS] Archiving <https://builds.apache.org/job/ServiceMix-Bundles/ws/smx4-bundles/elasticsearch-0.90.5/target/org.apache.servicemix.bundles.elasticsearch-0.90.5_2-SNAPSHOT.jar>
to org.apache.servicemix.bundles/org.apache.servicemix.bundles.elasticsearch/0.90.5_2-SNAPSHOT/org.apache.servicemix.bundles.elasticsearch-0.90.5_2-SNAPSHOT.jar
[JENKINS] Archiving <https://builds.apache.org/job/ServiceMix-Bundles/ws/smx4-bundles/elasticsearch-0.90.5/target/org.apache.servicemix.bundles.elasticsearch-0.90.5_2-SNAPSHOT-src.zip>
to org.apache.servicemix.bundles/org.apache.servicemix.bundles.elasticsearch/0.90.5_2-SNAPSHOT/org.apache.servicemix.bundles.elasticsearch-0.90.5_2-SNAPSHOT-src.zip
[JENKINS] Archiving <https://builds.apache.org/job/ServiceMix-Bundles/ws/smx4-bundles/elasticsearch-0.90.5/target/org.apache.servicemix.bundles.elasticsearch-0.90.5_2-SNAPSHOT-src.tar.gz>
to org.apache.servicemix.bundles/org.apache.servicemix.bundles.elasticsearch/0.90.5_2-SNAPSHOT/org.apache.servicemix.bundles.elasticsearch-0.90.5_2-SNAPSHOT-src.tar.gz
[JENKINS] Archiving <https://builds.apache.org/job/ServiceMix-Bundles/ws/smx4-bundles/elasticsearch-0.90.5/target/org.apache.servicemix.bundles.elasticsearch-0.90.5_2-SNAPSHOT-sources.jar>
to org.apache.servicemix.bundles/org.apache.servicemix.bundles.elasticsearch/0.90.5_2-SNAPSHOT/org.apache.servicemix.bundles.elasticsearch-0.90.5_2-SNAPSHOT-sources.jar
[JENKINS] Archiving <https://builds.apache.org/job/ServiceMix-Bundles/ws/smx4-bundles/bcpg-jdk15on-1.50/dependency-reduced-pom.xml>
to org.apache.servicemix.bundles/org.apache.servicemix.bundles.bcpg-jdk15on/1.50_1-SNAPSHOT/org.apache.servicemix.bundles.bcpg-jdk15on-1.50_1-SNAPSHOT.pom
[JENKINS] Archiving <https://builds.apache.org/job/ServiceMix-Bundles/ws/smx4-bundles/bcpg-jdk15on-1.50/target/org.apache.servicemix.bundles.bcpg-jdk15on-1.50_1-SNAPSHOT.jar>
to org.apache.servicemix.bundles/org.apache.servicemix.bundles.bcpg-jdk15on/1.50_1-SNAPSHOT/org.apache.servicemix.bundles.bcpg-jdk15on-1.50_1-SNAPSHOT.jar
[JENKINS] Archiving <https://builds.apache.org/job/ServiceMix-Bundles/ws/smx4-bundles/bcpg-jdk15on-1.50/target/org.apache.servicemix.bundles.bcpg-jdk15on-1.50_1-SNAPSHOT-src.zip>
to org.apache.servicemix.bundles/org.apache.servicemix.bundles.bcpg-jdk15on/1.50_1-SNAPSHOT/org.apache.servicemix.bundles.bcpg-jdk15on-1.50_1-SNAPSHOT-src.zip
[JENKINS] Archiving <https://builds.apache.org/job/ServiceMix-Bundles/ws/smx4-bundles/bcpg-jdk15on-1.50/target/org.apache.servicemix.bundles.bcpg-jdk15on-1.50_1-SNAPSHOT-src.tar.gz>
to org.apache.servicemix.bundles/org.apache.servicemix.bundles.bcpg-jdk15on/1.50_1-SNAPSHOT/org.apache.servicemix.bundles.bcpg-jdk15on-1.50_1-SNAPSHOT-src.tar.gz
[JENKINS] Archiving <https://builds.apache.org/job/ServiceMix-Bundles/ws/smx4-bundles/bcpg-jdk15on-1.50/target/org.apache.servicemix.bundles.bcpg-jdk15on-1.50_1-SNAPSHOT-sources.jar>
to org.apache.servicemix.bundles/org.apache.servicemix.bundles.bcpg-jdk15on/1.50_1-SNAPSHOT/org.apache.servicemix.bundles.bcpg-jdk15on-1.50_1-SNAPSHOT-sources.jar
[JENKINS] Archiving <https://builds.apache.org/job/ServiceMix-Bundles/ws/smx4-bundles/hibernate-validator-5.0.2.Final/pom.xml>
to org.apache.servicemix.bundles/org.apache.servicemix.bundles.hibernate-validator/5.0.2.Final_1-SNAPSHOT/org.apache.servicemix.bundles.hibernate-validator-5.0.2.Final_1-SNAPSHOT.pom
[JENKINS] Archiving <https://builds.apache.org/job/ServiceMix-Bundles/ws/smx4-bundles/bundles-pom/pom.xml>
to org.apache.servicemix.bundles/bundles-pom/11-SNAPSHOT/bundles-pom-11-SNAPSHOT.pom
[JENKINS] Archiving <https://builds.apache.org/job/ServiceMix-Bundles/ws/smx4-bundles/bundles-pom/target/bundles-pom-11-SNAPSHOT-src.zip>
to org.apache.servicemix.bundles/bundles-pom/11-SNAPSHOT/bundles-pom-11-SNAPSHOT-src.zip
[JENKINS] Archiving <https://builds.apache.org/job/ServiceMix-Bundles/ws/smx4-bundles/bundles-pom/target/bundles-pom-11-SNAPSHOT-src.tar.gz>
to org.apache.servicemix.bundles/bundles-pom/11-SNAPSHOT/bundles-pom-11-SNAPSHOT-src.tar.gz
[JENKINS] Archiving <https://builds.apache.org/job/ServiceMix-Bundles/ws/smx4-bundles/netty-3.2.10.Final/pom.xml>
to org.apache.servicemix.bundles/org.apache.servicemix.bundles.netty/3.2.10.Final_1-SNAPSHOT/org.apache.servicemix.bundles.netty-3.2.10.Final_1-SNAPSHOT.pom
[JENKINS] Archiving <https://builds.apache.org/job/ServiceMix-Bundles/ws/smx4-bundles/xstream-1.4.6/dependency-reduced-pom.xml>
to org.apache.servicemix.bundles/org.apache.servicemix.bundles.xstream/1.4.6_1-SNAPSHOT/org.apache.servicemix.bundles.xstream-1.4.6_1-SNAPSHOT.pom
[JENKINS] Archiving <https://builds.apache.org/job/ServiceMix-Bundles/ws/smx4-bundles/xstream-1.4.6/target/org.apache.servicemix.bundles.xstream-1.4.6_1-SNAPSHOT.jar>
to org.apache.servicemix.bundles/org.apache.servicemix.bundles.xstream/1.4.6_1-SNAPSHOT/org.apache.servicemix.bundles.xstream-1.4.6_1-SNAPSHOT.jar
[JENKINS] Archiving <https://builds.apache.org/job/ServiceMix-Bundles/ws/smx4-bundles/xstream-1.4.6/target/org.apache.servicemix.bundles.xstream-1.4.6_1-SNAPSHOT-src.zip>
to org.apache.servicemix.bundles/org.apache.servicemix.bundles.xstream/1.4.6_1-SNAPSHOT/org.apache.servicemix.bundles.xstream-1.4.6_1-SNAPSHOT-src.zip
[JENKINS] Archiving <https://builds.apache.org/job/ServiceMix-Bundles/ws/smx4-bundles/xstream-1.4.6/target/org.apache.servicemix.bundles.xstream-1.4.6_1-SNAPSHOT-src.tar.gz>
to org.apache.servicemix.bundles/org.apache.servicemix.bundles.xstream/1.4.6_1-SNAPSHOT/org.apache.servicemix.bundles.xstream-1.4.6_1-SNAPSHOT-src.tar.gz
[JENKINS] Archiving <https://builds.apache.org/job/ServiceMix-Bundles/ws/smx4-bundles/xstream-1.4.6/target/org.apache.servicemix.bundles.xstream-1.4.6_1-SNAPSHOT-sources.jar>
to org.apache.servicemix.bundles/org.apache.servicemix.bundles.xstream/1.4.6_1-SNAPSHOT/org.apache.servicemix.bundles.xstream-1.4.6_1-SNAPSHOT-sources.jar
<https://builds.apache.org/job/ServiceMix-Bundles/ws/smx4-bundles/xstream-1.4.6/dependency-reduced-pom.xml>
is not inside <https://builds.apache.org/job/ServiceMix-Bundles/ws/smx4-bundles/xstream-1.4.3/;>
will archive in a separate pass
<https://builds.apache.org/job/ServiceMix-Bundles/ws/smx4-bundles/xstream-1.4.6/target/org.apache.servicemix.bundles.xstream-1.4.6_1-SNAPSHOT.jar>
is not inside <https://builds.apache.org/job/ServiceMix-Bundles/ws/smx4-bundles/xstream-1.4.3/;>
will archive in a separate pass
<https://builds.apache.org/job/ServiceMix-Bundles/ws/smx4-bundles/xstream-1.4.6/target/org.apache.servicemix.bundles.xstream-1.4.6_1-SNAPSHOT-src.zip>
is not inside <https://builds.apache.org/job/ServiceMix-Bundles/ws/smx4-bundles/xstream-1.4.3/;>
will archive in a separate pass
<https://builds.apache.org/job/ServiceMix-Bundles/ws/smx4-bundles/xstream-1.4.6/target/org.apache.servicemix.bundles.xstream-1.4.6_1-SNAPSHOT-src.tar.gz>
is not inside <https://builds.apache.org/job/ServiceMix-Bundles/ws/smx4-bundles/xstream-1.4.3/;>
will archive in a separate pass
<https://builds.apache.org/job/ServiceMix-Bundles/ws/smx4-bundles/xstream-1.4.6/target/org.apache.servicemix.bundles.xstream-1.4.6_1-SNAPSHOT-sources.jar>
is not inside <https://builds.apache.org/job/ServiceMix-Bundles/ws/smx4-bundles/xstream-1.4.3/;>
will archive in a separate pass
[JENKINS] Archiving <https://builds.apache.org/job/ServiceMix-Bundles/ws/smx4-bundles/rjc-0.7/dependency-reduced-pom.xml>
to org.apache.servicemix.bundles/org.apache.servicemix.bundles.rjc/0.7_1-SNAPSHOT/org.apache.servicemix.bundles.rjc-0.7_1-SNAPSHOT.pom
[JENKINS] Archiving <https://builds.apache.org/job/ServiceMix-Bundles/ws/smx4-bundles/rjc-0.7/target/org.apache.servicemix.bundles.rjc-0.7_1-SNAPSHOT.jar>
to org.apache.servicemix.bundles/org.apache.servicemix.bundles.rjc/0.7_1-SNAPSHOT/org.apache.servicemix.bundles.rjc-0.7_1-SNAPSHOT.jar
[JENKINS] Archiving <https://builds.apache.org/job/ServiceMix-Bundles/ws/smx4-bundles/rjc-0.7/target/org.apache.servicemix.bundles.rjc-0.7_1-SNAPSHOT-src.zip>
to org.apache.servicemix.bundles/org.apache.servicemix.bundles.rjc/0.7_1-SNAPSHOT/org.apache.servicemix.bundles.rjc-0.7_1-SNAPSHOT-src.zip
[JENKINS] Archiving <https://builds.apache.org/job/ServiceMix-Bundles/ws/smx4-bundles/rjc-0.7/target/org.apache.servicemix.bundles.rjc-0.7_1-SNAPSHOT-src.tar.gz>
to org.apache.servicemix.bundles/org.apache.servicemix.bundles.rjc/0.7_1-SNAPSHOT/org.apache.servicemix.bundles.rjc-0.7_1-SNAPSHOT-src.tar.gz
[JENKINS] Archiving <https://builds.apache.org/job/ServiceMix-Bundles/ws/smx4-bundles/rjc-0.7/target/org.apache.servicemix.bundles.rjc-0.7_1-SNAPSHOT-sources.jar>
to org.apache.servicemix.bundles/org.apache.servicemix.bundles.rjc/0.7_1-SNAPSHOT/org.apache.servicemix.bundles.rjc-0.7_1-SNAPSHOT-sources.jar
[JENKINS] Archiving <https://builds.apache.org/job/ServiceMix-Bundles/ws/smx4-bundles/bcprov-jdk15on-1.50/dependency-reduced-pom.xml>
to org.apache.servicemix.bundles/org.apache.servicemix.bundles.bcprov-jdk15on/1.50_1-SNAPSHOT/org.apache.servicemix.bundles.bcprov-jdk15on-1.50_1-SNAPSHOT.pom
[JENKINS] Archiving <https://builds.apache.org/job/ServiceMix-Bundles/ws/smx4-bundles/bcprov-jdk15on-1.50/target/org.apache.servicemix.bundles.bcprov-jdk15on-1.50_1-SNAPSHOT.jar>
to org.apache.servicemix.bundles/org.apache.servicemix.bundles.bcprov-jdk15on/1.50_1-SNAPSHOT/org.apache.servicemix.bundles.bcprov-jdk15on-1.50_1-SNAPSHOT.jar
[JENKINS] Archiving <https://builds.apache.org/job/ServiceMix-Bundles/ws/smx4-bundles/bcprov-jdk15on-1.50/target/org.apache.servicemix.bundles.bcprov-jdk15on-1.50_1-SNAPSHOT-src.zip>
to org.apache.servicemix.bundles/org.apache.servicemix.bundles.bcprov-jdk15on/1.50_1-SNAPSHOT/org.apache.servicemix.bundles.bcprov-jdk15on-1.50_1-SNAPSHOT-src.zip
[JENKINS] Archiving <https://builds.apache.org/job/ServiceMix-Bundles/ws/smx4-bundles/bcprov-jdk15on-1.50/target/org.apache.servicemix.bundles.bcprov-jdk15on-1.50_1-SNAPSHOT-src.tar.gz>
to org.apache.servicemix.bundles/org.apache.servicemix.bundles.bcprov-jdk15on/1.50_1-SNAPSHOT/org.apache.servicemix.bundles.bcprov-jdk15on-1.50_1-SNAPSHOT-src.tar.gz
[JENKINS] Archiving <https://builds.apache.org/job/ServiceMix-Bundles/ws/smx4-bundles/bcprov-jdk15on-1.50/target/org.apache.servicemix.bundles.bcprov-jdk15on-1.50_1-SNAPSHOT-sources.jar>
to org.apache.servicemix.bundles/org.apache.servicemix.bundles.bcprov-jdk15on/1.50_1-SNAPSHOT/org.apache.servicemix.bundles.bcprov-jdk15on-1.50_1-SNAPSHOT-sources.jar
[JENKINS] Archiving <https://builds.apache.org/job/ServiceMix-Bundles/ws/smx4-bundles/facebook4j-2.0.4/pom.xml>
to org.apache.servicemix.bundles/org.apache.servicemix.bundles.facebook4j/2.0.4_1-SNAPSHOT/org.apache.servicemix.bundles.facebook4j-2.0.4_1-SNAPSHOT.pom
channel stopped

Mime
View raw message