servicemix-commits mailing list archives

Site index · List index
Message view « Date » · « Thread »
Top « Date » · « Thread »
From Apache Jenkins Server <jenk...@builds.apache.org>
Subject Build failed in Jenkins: ServiceMix-Bundles #727
Date Mon, 10 Nov 2014 16:32:40 GMT
See <https://builds.apache.org/job/ServiceMix-Bundles/727/changes>

Changes:

[jbonofre] [SMX4-1898] Create OSGi bundle for elasticsearch 1.4.0

[jbonofre] [SMX4-1899] Create OSGi bundle for freemarker 2.3.21

[jbonofre] [SMX4-1900] Upgrade to bundles-pom 11

[jbonofre] [SMX4-1900] Create OSGi bundle for geocoder-java 0.16

------------------------------------------
Started by an SCM change
Building remotely on ubuntu3 (Ubuntu ubuntu legacy-ubuntu) in workspace <https://builds.apache.org/job/ServiceMix-Bundles/ws/>
Updating http://svn.apache.org/repos/asf/servicemix/smx4/bundles/trunk at revision '2014-11-10T16:30:13.649
+0000'
A         aws-java-sdk-1.9.3
A         aws-java-sdk-1.9.3/pom.xml
A         aws-java-sdk-1.9.3/src
A         aws-java-sdk-1.9.3/src/main
A         aws-java-sdk-1.9.3/src/main/resources
A         aws-java-sdk-1.9.3/src/main/resources/OSGI-INF
A         aws-java-sdk-1.9.3/src/main/resources/OSGI-INF/bundle.info
A         geocoder-java-0.16
A         geocoder-java-0.16/src
A         geocoder-java-0.16/src/main
A         geocoder-java-0.16/src/main/resources
A         geocoder-java-0.16/src/main/resources/OSGI-INF
A         geocoder-java-0.16/src/main/resources/OSGI-INF/bundle.info
A         geocoder-java-0.16/pom.xml
A         freemarker-2.3.21
A         freemarker-2.3.21/src
A         freemarker-2.3.21/src/main
A         freemarker-2.3.21/src/main/resources
A         freemarker-2.3.21/src/main/resources/OSGI-INF
A         freemarker-2.3.21/src/main/resources/OSGI-INF/bundle.info
A         freemarker-2.3.21/pom.xml
U         pom.xml
A         jsch-agentproxy-jsch-0.0.8
A         jsch-agentproxy-jsch-0.0.8/src
A         jsch-agentproxy-jsch-0.0.8/src/main
A         jsch-agentproxy-jsch-0.0.8/src/main/resources
A         jsch-agentproxy-jsch-0.0.8/src/main/resources/OSGI-INF
A         jsch-agentproxy-jsch-0.0.8/src/main/resources/OSGI-INF/bundle.info
A         jsch-agentproxy-jsch-0.0.8/pom.xml
A         gae-1.9.15
A         gae-1.9.15/pom.xml
A         gae-1.9.15/src
A         gae-1.9.15/src/main
A         gae-1.9.15/src/main/resources
A         gae-1.9.15/src/main/resources/OSGI-INF
A         gae-1.9.15/src/main/resources/OSGI-INF/bundle.info
A         elasticsearch-1.4.0
A         elasticsearch-1.4.0/src
A         elasticsearch-1.4.0/src/main
A         elasticsearch-1.4.0/src/main/resources
A         elasticsearch-1.4.0/src/main/resources/OSGI-INF
A         elasticsearch-1.4.0/src/main/resources/OSGI-INF/bundle.info
A         elasticsearch-1.4.0/pom.xml
At revision 1637915
Parsing POMs
ERROR: Failed to parse POMs
java.io.IOException: remote file operation failed: <https://builds.apache.org/job/ServiceMix-Bundles/ws/smx4-bundles>
at hudson.remoting.Channel@3c8be564:ubuntu3
	at hudson.FilePath.act(FilePath.java:916)
	at hudson.FilePath.act(FilePath.java:893)
	at hudson.maven.MavenModuleSetBuild$MavenModuleSetBuildExecution.parsePoms(MavenModuleSetBuild.java:953)
	at hudson.maven.MavenModuleSetBuild$MavenModuleSetBuildExecution.doRun(MavenModuleSetBuild.java:681)
	at hudson.model.AbstractBuild$AbstractBuildExecution.run(AbstractBuild.java:529)
	at hudson.model.Run.execute(Run.java:1706)
	at hudson.maven.MavenModuleSetBuild.run(MavenModuleSetBuild.java:529)
	at hudson.model.ResourceController.execute(ResourceController.java:88)
	at hudson.model.Executor.run(Executor.java:232)
Caused by: hudson.remoting.ProxyException: hudson.maven.MavenModuleSetBuild$MavenExecutionException:
org.apache.maven.project.ProjectBuildingException: Some problems were encountered while processing
the POMs:
[FATAL] Non-parseable POM <https://builds.apache.org/job/ServiceMix-Bundles/ws/smx4-bundles/pom.xml>:
end tag name </momdule> must match start tag name <module> from line 327 (position:
TEXT seen ...<module>freemarker-2.3.21</momdule>... @327:44)  @ line 327, column
44

	at hudson.maven.MavenModuleSetBuild$PomParser.invoke(MavenModuleSetBuild.java:1357)
	at hudson.maven.MavenModuleSetBuild$PomParser.invoke(MavenModuleSetBuild.java:1091)
	at hudson.FilePath$FileCallableWrapper.call(FilePath.java:2474)
	at hudson.remoting.UserRequest.perform(UserRequest.java:118)
	at hudson.remoting.UserRequest.perform(UserRequest.java:48)
	at hudson.remoting.Request$2.run(Request.java:328)
	at hudson.remoting.InterceptingExecutorService$1.call(InterceptingExecutorService.java:72)
	at java.util.concurrent.FutureTask.run(FutureTask.java:262)
	at java.util.concurrent.ThreadPoolExecutor.runWorker(ThreadPoolExecutor.java:1145)
	at java.util.concurrent.ThreadPoolExecutor$Worker.run(ThreadPoolExecutor.java:615)
	at java.lang.Thread.run(Thread.java:745)
Caused by: hudson.remoting.ProxyException: org.apache.maven.project.ProjectBuildingException:
Some problems were encountered while processing the POMs:
[FATAL] Non-parseable POM <https://builds.apache.org/job/ServiceMix-Bundles/ws/smx4-bundles/pom.xml>:
end tag name </momdule> must match start tag name <module> from line 327 (position:
TEXT seen ...<module>freemarker-2.3.21</momdule>... @327:44)  @ line 327, column
44

	at org.apache.maven.project.DefaultProjectBuilder.build(DefaultProjectBuilder.java:364)
	at hudson.maven.MavenEmbedder.buildProjects(MavenEmbedder.java:361)
	at hudson.maven.MavenEmbedder.readProjects(MavenEmbedder.java:331)
	at hudson.maven.MavenModuleSetBuild$PomParser.invoke(MavenModuleSetBuild.java:1294)
	... 10 more

Mime
View raw message