servicemix-commits mailing list archives

Site index · List index
Message view « Date » · « Thread »
Top « Date » · « Thread »
From Apache Jenkins Server <jenk...@builds.apache.org>
Subject Build failed in Jenkins: ServiceMix-Bundles #722
Date Tue, 04 Nov 2014 08:32:02 GMT
See <https://builds.apache.org/job/ServiceMix-Bundles/722/changes>

Changes:

[ffang] [SMX4-1884]correct joda version range for opensaml 2.6.x bundle

------------------------------------------
Started by an SCM change
Building remotely on ubuntu-5 (docker Ubuntu ubuntu5 ubuntu) in workspace <https://builds.apache.org/job/ServiceMix-Bundles/ws/>
Updating http://svn.apache.org/repos/asf/servicemix/smx4/bundles/trunk at revision '2014-11-04T08:30:12.408
+0000'
A         jaxb-impl-2.2.11
A         jaxb-impl-2.2.11/src
A         jaxb-impl-2.2.11/src/main
A         jaxb-impl-2.2.11/src/main/resources
A         jaxb-impl-2.2.11/src/main/resources/OSGI-INF
A         jaxb-impl-2.2.11/src/main/resources/OSGI-INF/bundle.info
A         jaxb-impl-2.2.11/pom.xml
A         jaxb-xjc-2.2.11
A         jaxb-xjc-2.2.11/src
A         jaxb-xjc-2.2.11/src/main
A         jaxb-xjc-2.2.11/src/main/resources
A         jaxb-xjc-2.2.11/src/main/resources/OSGI-INF
A         jaxb-xjc-2.2.11/src/main/resources/OSGI-INF/bundle.info
A         jaxb-xjc-2.2.11/pom.xml
U         spring-webmvc-4.0.3.RELEASE/pom.xml
U         spring-webmvc-3.2.10.RELEASE/pom.xml
U         spring-webmvc-3.2.11.RELEASE/pom.xml
U         spring-webmvc-4.0.5.RELEASE/pom.xml
U         opensaml-2.5.1/pom.xml
U         opensaml-2.5.3/pom.xml
U         spring-webmvc-4.0.6.RELEASE/pom.xml
U         spring-webmvc-4.0.7.RELEASE/pom.xml
U         spring-ldap-1.3.1.RELEASE/pom.xml
U         pom.xml
U         spring-webmvc-3.2.7.RELEASE/pom.xml
U         spring-ldap-1.3.2.RELEASE/pom.xml
U         spring-webmvc-4.0.1.RELEASE/pom.xml
U         spring-webmvc-3.2.8.RELEASE/pom.xml
U         opensaml-2.6.0/pom.xml
UU        opensaml-2.6.1/pom.xml
U         opensaml-2.6.2/pom.xml
U         spring-webmvc-4.0.2.RELEASE/pom.xml
U         spring-webmvc-3.2.9.RELEASE/pom.xml
At revision 1636517
Parsing POMs
Downloaded artifact http://repo.maven.apache.org/maven2/org/apache/servicemix/bundles/bundles-pom/10/bundles-pom-10.pom
Modules changed, recalculating dependency graph
maven3-agent.jar already up to date
maven3-interceptor.jar already up to date
maven3-interceptor-commons.jar already up to date
[smx4-bundles] $ /home/jenkins/tools/java/latest1.6/bin/java -da -dsa -XX:MaxPermSize=192m
-Xmx512M -cp /home/jenkins/jenkins-slave/maven3-agent.jar:/home/jenkins/jenkins-slave/tools/hudson.tasks.Maven_MavenInstallation/Maven_3.0.3/boot/plexus-classworlds-2.4.jar
org.jvnet.hudson.maven3.agent.Maven3Main /home/jenkins/jenkins-slave/tools/hudson.tasks.Maven_MavenInstallation/Maven_3.0.3
/home/jenkins/jenkins-slave/slave.jar /home/jenkins/jenkins-slave/maven3-interceptor.jar /home/jenkins/jenkins-slave/maven3-interceptor-commons.jar
34600
<===[JENKINS REMOTING CAPACITY]===>   channel started
Executing Maven:  -B -f <https://builds.apache.org/job/ServiceMix-Bundles/ws/smx4-bundles/pom.xml>
-Dmaven.repo.local=<https://builds.apache.org/job/ServiceMix-Bundles/ws/.repository>
-B -e clean install
[INFO] Error stacktraces are turned on.
[INFO] Scanning for projects...
[ERROR] The build could not read 1 project -> [Help 1]
org.apache.maven.project.ProjectBuildingException: Some problems were encountered while processing
the POMs:
[ERROR] 'modules.module[19]' specifies duplicate child module spring-webmvc-4.0.1.RELEASE
@ line 64, column 17
[ERROR] 'modules.module[20]' specifies duplicate child module opensaml-2.6.0 @ line 65, column
17
[ERROR] 'modules.module[21]' specifies duplicate child module opensaml-2.6.1 @ line 66, column
17
[ERROR] 'modules.module[22]' specifies duplicate child module opensaml-2.6.2 @ line 67, column
17

	at org.apache.maven.project.DefaultProjectBuilder.build(DefaultProjectBuilder.java:339)
	at org.apache.maven.DefaultMaven.collectProjects(DefaultMaven.java:632)
	at org.apache.maven.DefaultMaven.getProjectsForMavenReactor(DefaultMaven.java:581)
	at org.apache.maven.DefaultMaven.doExecute(DefaultMaven.java:233)
	at org.apache.maven.DefaultMaven.execute(DefaultMaven.java:156)
	at org.jvnet.hudson.maven3.launcher.Maven3Launcher.main(Maven3Launcher.java:117)
	at sun.reflect.NativeMethodAccessorImpl.invoke0(Native Method)
	at sun.reflect.NativeMethodAccessorImpl.invoke(NativeMethodAccessorImpl.java:39)
	at sun.reflect.DelegatingMethodAccessorImpl.invoke(DelegatingMethodAccessorImpl.java:25)
	at java.lang.reflect.Method.invoke(Method.java:597)
	at org.codehaus.plexus.classworlds.launcher.Launcher.launchStandard(Launcher.java:329)
	at org.codehaus.plexus.classworlds.launcher.Launcher.launch(Launcher.java:239)
	at org.jvnet.hudson.maven3.agent.Maven3Main.launch(Maven3Main.java:178)
	at sun.reflect.NativeMethodAccessorImpl.invoke0(Native Method)
	at sun.reflect.NativeMethodAccessorImpl.invoke(NativeMethodAccessorImpl.java:39)
	at sun.reflect.DelegatingMethodAccessorImpl.invoke(DelegatingMethodAccessorImpl.java:25)
	at java.lang.reflect.Method.invoke(Method.java:597)
	at hudson.maven.Maven3Builder.call(Maven3Builder.java:134)
	at hudson.maven.Maven3Builder.call(Maven3Builder.java:69)
	at hudson.remoting.UserRequest.perform(UserRequest.java:118)
	at hudson.remoting.UserRequest.perform(UserRequest.java:48)
	at hudson.remoting.Request$2.run(Request.java:328)
	at hudson.remoting.InterceptingExecutorService$1.call(InterceptingExecutorService.java:72)
	at java.util.concurrent.FutureTask$Sync.innerRun(FutureTask.java:303)
	at java.util.concurrent.FutureTask.run(FutureTask.java:138)
	at java.util.concurrent.ThreadPoolExecutor$Worker.runTask(ThreadPoolExecutor.java:895)
	at java.util.concurrent.ThreadPoolExecutor$Worker.run(ThreadPoolExecutor.java:918)
	at java.lang.Thread.run(Thread.java:662)
[ERROR]   
[ERROR]   The project org.apache.servicemix.bundles:org.apache.servicemix.bundles.pom:1-SNAPSHOT
(<https://builds.apache.org/job/ServiceMix-Bundles/ws/smx4-bundles/pom.xml)> has 4 errors
[ERROR]     'modules.module[19]' specifies duplicate child module spring-webmvc-4.0.1.RELEASE
@ line 64, column 17
[ERROR]     'modules.module[20]' specifies duplicate child module opensaml-2.6.0 @ line 65,
column 17
[ERROR]     'modules.module[21]' specifies duplicate child module opensaml-2.6.1 @ line 66,
column 17
[ERROR]     'modules.module[22]' specifies duplicate child module opensaml-2.6.2 @ line 67,
column 17
[ERROR] 
[ERROR] Re-run Maven using the -X switch to enable full debug logging.
[ERROR] 
[ERROR] For more information about the errors and possible solutions, please read the following
articles:
[ERROR] [Help 1] http://cwiki.apache.org/confluence/display/MAVEN/ProjectBuildingException
channel stopped

Mime
View raw message