servicemix-commits mailing list archives

Site index · List index
Message view « Date » · « Thread »
Top « Date » · « Thread »
From Apache Jenkins Server <jenk...@builds.apache.org>
Subject Build failed in Jenkins: ServiceMix-Bundles #823
Date Thu, 04 Jun 2015 08:31:32 GMT
See <https://builds.apache.org/job/ServiceMix-Bundles/823/changes>

Changes:

[jbonofre] [SM-2567] Create OSGi bundle for spring-ldap 2.0.3.RELEASE

[jbonofre] [SM-2569] Create OSGi bundle for GAE 1.9.21

[jbonofre] [SM-2570] Create OSGi bundle for jt400 8.5

[jbonofre] [SM-2571] Create OSGi bundle for docker-java 1.3.0

[jbonofre] [SM-2573] Create OSGi bundle for reflections 0.9.10

[jbonofre] [SM-2577] Create OSGi bundle for dbunit 2.5.1

------------------------------------------
Started by an SCM change
Building remotely on H11 (Ubuntu ubuntu) in workspace <https://builds.apache.org/job/ServiceMix-Bundles/ws/>
Cloning the remote Git repository
Cloning repository https://git-wip-us.apache.org/repos/asf/servicemix-bundles.git
 > git init <https://builds.apache.org/job/ServiceMix-Bundles/ws/> # timeout=10
Fetching upstream changes from https://git-wip-us.apache.org/repos/asf/servicemix-bundles.git
 > git --version # timeout=10
 > git fetch --tags --progress https://git-wip-us.apache.org/repos/asf/servicemix-bundles.git
+refs/heads/*:refs/remotes/origin/*
 > git config remote.origin.url https://git-wip-us.apache.org/repos/asf/servicemix-bundles.git
# timeout=10
 > git config remote.origin.fetch +refs/heads/*:refs/remotes/origin/* # timeout=10
 > git config remote.origin.url https://git-wip-us.apache.org/repos/asf/servicemix-bundles.git
# timeout=10
Fetching upstream changes from https://git-wip-us.apache.org/repos/asf/servicemix-bundles.git
 > git fetch --tags --progress https://git-wip-us.apache.org/repos/asf/servicemix-bundles.git
+refs/heads/*:refs/remotes/origin/*
 > git rev-parse refs/remotes/origin/master^{commit} # timeout=10
 > git rev-parse refs/remotes/origin/origin/master^{commit} # timeout=10
Checking out Revision d5736869066fc4ef0e16681ff5937d8e9bee03e3 (refs/remotes/origin/master)
 > git config core.sparsecheckout # timeout=10
 > git checkout -f d5736869066fc4ef0e16681ff5937d8e9bee03e3
 > git rev-list 1492246f2d8dbd7d131a9df67f46356aa6525df7 # timeout=10
Parsing POMs
Downloaded artifact http://repo.maven.apache.org/maven2/org/apache/servicemix/servicemix-pom/5/servicemix-pom-5.pom
Downloaded artifact http://repo.maven.apache.org/maven2/org/apache/apache/7/apache-7.pom
Downloaded artifact http://repo.maven.apache.org/maven2/org/apache/servicemix/bundles/bundles-pom/11/bundles-pom-11.pom
Downloaded artifact http://repo.maven.apache.org/maven2/org/apache/servicemix/bundles/bundles-pom/12/bundles-pom-12.pom
Discovered a new module org.apache.servicemix.bundles:org.apache.servicemix.bundles.jt400
Apache ServiceMix :: Bundles :: jt400
Discovered a new module org.apache.servicemix.bundles:org.apache.servicemix.bundles.dbunit
Apache ServiceMix :: Bundles :: dbunit
Modules changed, recalculating dependency graph
maven3-agent.jar already up to date
maven3-interceptor.jar already up to date
maven3-interceptor-commons.jar already up to date
[ServiceMix-Bundles] $ /home/jenkins/tools/java/latest1.6/bin/java -da -dsa -XX:MaxPermSize=192m
-Xmx512M -cp /home/jenkins/jenkins-slave/maven3-agent.jar:/home/jenkins/jenkins-slave/tools/hudson.tasks.Maven_MavenInstallation/Maven_3.0.3/boot/plexus-classworlds-2.4.jar
org.jvnet.hudson.maven3.agent.Maven3Main /home/jenkins/jenkins-slave/tools/hudson.tasks.Maven_MavenInstallation/Maven_3.0.3
/home/jenkins/jenkins-slave/slave.jar /home/jenkins/jenkins-slave/maven3-interceptor.jar /home/jenkins/jenkins-slave/maven3-interceptor-commons.jar
49677
<===[JENKINS REMOTING CAPACITY]===>   channel started
Executing Maven:  -B -f <https://builds.apache.org/job/ServiceMix-Bundles/ws/pom.xml>
-Dmaven.repo.local=<https://builds.apache.org/job/ServiceMix-Bundles/ws/.repository>
-B -e clean install
[INFO] Error stacktraces are turned on.
[INFO] Scanning for projects...
[ERROR] The build could not read 1 project -> [Help 1]
org.apache.maven.project.ProjectBuildingException: Some problems were encountered while processing
the POMs:
[ERROR] 'modules.module[52]' specifies duplicate child module poi-3.11 @ line 98, column 17
[ERROR] 'modules.module[53]' specifies duplicate child module swagger-core_2.11-1.3.12 @ line
99, column 17

	at org.apache.maven.project.DefaultProjectBuilder.build(DefaultProjectBuilder.java:339)
	at org.apache.maven.DefaultMaven.collectProjects(DefaultMaven.java:632)
	at org.apache.maven.DefaultMaven.getProjectsForMavenReactor(DefaultMaven.java:581)
	at org.apache.maven.DefaultMaven.doExecute(DefaultMaven.java:233)
	at org.apache.maven.DefaultMaven.execute(DefaultMaven.java:156)
	at org.jvnet.hudson.maven3.launcher.Maven3Launcher.main(Maven3Launcher.java:117)
	at sun.reflect.NativeMethodAccessorImpl.invoke0(Native Method)
	at sun.reflect.NativeMethodAccessorImpl.invoke(NativeMethodAccessorImpl.java:39)
	at sun.reflect.DelegatingMethodAccessorImpl.invoke(DelegatingMethodAccessorImpl.java:25)
	at java.lang.reflect.Method.invoke(Method.java:597)
	at org.codehaus.plexus.classworlds.launcher.Launcher.launchStandard(Launcher.java:329)
	at org.codehaus.plexus.classworlds.launcher.Launcher.launch(Launcher.java:239)
	at org.jvnet.hudson.maven3.agent.Maven3Main.launch(Maven3Main.java:178)
	at sun.reflect.NativeMethodAccessorImpl.invoke0(Native Method)
	at sun.reflect.NativeMethodAccessorImpl.invoke(NativeMethodAccessorImpl.java:39)
	at sun.reflect.DelegatingMethodAccessorImpl.invoke(DelegatingMethodAccessorImpl.java:25)
	at java.lang.reflect.Method.invoke(Method.java:597)
	at hudson.maven.Maven3Builder.call(Maven3Builder.java:136)
	at hudson.maven.Maven3Builder.call(Maven3Builder.java:71)
	at hudson.remoting.UserRequest.perform(UserRequest.java:118)
	at hudson.remoting.UserRequest.perform(UserRequest.java:48)
	at hudson.remoting.Request$2.run(Request.java:328)
	at hudson.remoting.InterceptingExecutorService$1.call(InterceptingExecutorService.java:72)
	at java.util.concurrent.FutureTask$Sync.innerRun(FutureTask.java:303)
	at java.util.concurrent.FutureTask.run(FutureTask.java:138)
	at java.util.concurrent.ThreadPoolExecutor$Worker.runTask(ThreadPoolExecutor.java:895)
	at java.util.concurrent.ThreadPoolExecutor$Worker.run(ThreadPoolExecutor.java:918)
	at java.lang.Thread.run(Thread.java:662)
[ERROR]   
[ERROR]   The project org.apache.servicemix.bundles:org.apache.servicemix.bundles.pom:1-SNAPSHOT
(<https://builds.apache.org/job/ServiceMix-Bundles/ws/pom.xml)> has 2 errors
[ERROR]     'modules.module[52]' specifies duplicate child module poi-3.11 @ line 98, column
17
[ERROR]     'modules.module[53]' specifies duplicate child module swagger-core_2.11-1.3.12
@ line 99, column 17
[ERROR] 
[ERROR] Re-run Maven using the -X switch to enable full debug logging.
[ERROR] 
[ERROR] For more information about the errors and possible solutions, please read the following
articles:
[ERROR] [Help 1] http://cwiki.apache.org/confluence/display/MAVEN/ProjectBuildingException
channel stopped

Mime
View raw message