servicemix-commits mailing list archives

Site index · List index
Message view « Date » · « Thread »
Top « Date » · « Thread »
From Apache Jenkins Server <jenk...@builds.apache.org>
Subject Build failed in Jenkins: ServiceMix-Bundles #937
Date Tue, 03 Nov 2015 00:31:39 GMT
See <https://builds.apache.org/job/ServiceMix-Bundles/937/changes>

Changes:

[jbonofre] [maven-release-plugin] prepare release

[jbonofre] [maven-release-plugin] prepare for next development iteration

[jbonofre] [maven-release-plugin] prepare release

[jbonofre] [maven-release-plugin] prepare for next development iteration

[jbonofre] [maven-release-plugin] prepare release

[jbonofre] [maven-release-plugin] prepare for next development iteration

[jbonofre] [maven-release-plugin] prepare release

[jbonofre] [maven-release-plugin] prepare for next development iteration

[jbonofre] [maven-release-plugin] prepare release

[jbonofre] [maven-release-plugin] prepare for next development iteration

[jbonofre] Upgrade to bundles-pom 12

[jbonofre] [maven-release-plugin] prepare release

[jbonofre] [maven-release-plugin] prepare for next development iteration

[jbonofre] [maven-release-plugin] prepare release

[jbonofre] [maven-release-plugin] prepare for next development iteration

[jbonofre] [maven-release-plugin] prepare release

[jbonofre] [maven-release-plugin] prepare for next development iteration

------------------------------------------
Started by an SCM change
[EnvInject] - Loading node environment variables.
Building remotely on ubuntu3 (Ubuntu ubuntu legacy-ubuntu) in workspace <https://builds.apache.org/job/ServiceMix-Bundles/ws/>
 > git rev-parse --is-inside-work-tree # timeout=10
Fetching changes from the remote Git repository
 > git config remote.origin.url https://git-wip-us.apache.org/repos/asf/servicemix-bundles.git
# timeout=10
Fetching upstream changes from https://git-wip-us.apache.org/repos/asf/servicemix-bundles.git
 > git --version # timeout=10
 > git -c core.askpass=true fetch --tags --progress https://git-wip-us.apache.org/repos/asf/servicemix-bundles.git
+refs/heads/*:refs/remotes/origin/*
 > git rev-parse refs/remotes/origin/master^{commit} # timeout=10
 > git rev-parse refs/remotes/origin/origin/master^{commit} # timeout=10
Checking out Revision 7375a3f43233208f606dc7c7cae7944d3fb4f3f8 (refs/remotes/origin/master)
 > git config core.sparsecheckout # timeout=10
 > git checkout -f 7375a3f43233208f606dc7c7cae7944d3fb4f3f8
 > git rev-list 189adabbbdf2e6bdc2fd60c7b9120623781f610c # timeout=10
Parsing POMs
Modules changed, recalculating dependency graph
Established TCP socket on 57532
maven3-agent.jar already up to date
maven3-interceptor.jar already up to date
maven3-interceptor-commons.jar already up to date
[ServiceMix-Bundles] $ /home/jenkins/tools/java/latest1.6/bin/java -da -dsa -XX:MaxPermSize=192m
-Xmx512M -cp /home/jenkins/jenkins-slave/maven3-agent.jar:/home/jenkins/jenkins-slave/tools/hudson.tasks.Maven_MavenInstallation/Maven_3.0.3/boot/plexus-classworlds-2.4.jar
org.jvnet.hudson.maven3.agent.Maven3Main /home/jenkins/jenkins-slave/tools/hudson.tasks.Maven_MavenInstallation/Maven_3.0.3
/x1/jenkins/jenkins-slave/slave.jar /home/jenkins/jenkins-slave/maven3-interceptor.jar /home/jenkins/jenkins-slave/maven3-interceptor-commons.jar
57532
<===[JENKINS REMOTING CAPACITY]===>   channel started
Executing Maven:  -B -f <https://builds.apache.org/job/ServiceMix-Bundles/ws/pom.xml>
-Dmaven.repo.local=<https://builds.apache.org/job/ServiceMix-Bundles/ws/.repository>
-B -e clean install
[INFO] Error stacktraces are turned on.
[INFO] Scanning for projects...
[ERROR] The build could not read 1 project -> [Help 1]
org.apache.maven.project.ProjectBuildingException: Some problems were encountered while processing
the POMs:
[ERROR] 'modules.module[80]' specifies duplicate child module reflections-0.9.9 @ line 126,
column 17

	at org.apache.maven.project.DefaultProjectBuilder.build(DefaultProjectBuilder.java:339)
	at org.apache.maven.DefaultMaven.collectProjects(DefaultMaven.java:632)
	at org.apache.maven.DefaultMaven.getProjectsForMavenReactor(DefaultMaven.java:581)
	at org.apache.maven.DefaultMaven.doExecute(DefaultMaven.java:233)
	at org.apache.maven.DefaultMaven.execute(DefaultMaven.java:156)
	at org.jvnet.hudson.maven3.launcher.Maven3Launcher.main(Maven3Launcher.java:117)
	at sun.reflect.NativeMethodAccessorImpl.invoke0(Native Method)
	at sun.reflect.NativeMethodAccessorImpl.invoke(NativeMethodAccessorImpl.java:39)
	at sun.reflect.DelegatingMethodAccessorImpl.invoke(DelegatingMethodAccessorImpl.java:25)
	at java.lang.reflect.Method.invoke(Method.java:597)
	at org.codehaus.plexus.classworlds.launcher.Launcher.launchStandard(Launcher.java:329)
	at org.codehaus.plexus.classworlds.launcher.Launcher.launch(Launcher.java:239)
	at org.jvnet.hudson.maven3.agent.Maven3Main.launch(Maven3Main.java:181)
	at sun.reflect.NativeMethodAccessorImpl.invoke0(Native Method)
	at sun.reflect.NativeMethodAccessorImpl.invoke(NativeMethodAccessorImpl.java:39)
	at sun.reflect.DelegatingMethodAccessorImpl.invoke(DelegatingMethodAccessorImpl.java:25)
	at java.lang.reflect.Method.invoke(Method.java:597)
	at hudson.maven.Maven3Builder.call(Maven3Builder.java:136)
	at hudson.maven.Maven3Builder.call(Maven3Builder.java:71)
	at hudson.remoting.UserRequest.perform(UserRequest.java:121)
	at hudson.remoting.UserRequest.perform(UserRequest.java:49)
	at hudson.remoting.Request$2.run(Request.java:326)
	at hudson.remoting.InterceptingExecutorService$1.call(InterceptingExecutorService.java:68)
	at java.util.concurrent.FutureTask$Sync.innerRun(FutureTask.java:303)
	at java.util.concurrent.FutureTask.run(FutureTask.java:138)
	at java.util.concurrent.ThreadPoolExecutor$Worker.runTask(ThreadPoolExecutor.java:895)
	at java.util.concurrent.ThreadPoolExecutor$Worker.run(ThreadPoolExecutor.java:918)
	at java.lang.Thread.run(Thread.java:662)
[ERROR]   
[ERROR]   The project org.apache.servicemix.bundles:org.apache.servicemix.bundles.pom:1-SNAPSHOT
(<https://builds.apache.org/job/ServiceMix-Bundles/ws/pom.xml)> has 1 error
[ERROR]     'modules.module[80]' specifies duplicate child module reflections-0.9.9 @ line
126, column 17
[ERROR] 
[ERROR] Re-run Maven using the -X switch to enable full debug logging.
[ERROR] 
[ERROR] For more information about the errors and possible solutions, please read the following
articles:
[ERROR] [Help 1] http://cwiki.apache.org/confluence/display/MAVEN/ProjectBuildingException
channel stopped

Mime
View raw message