servicemix-commits mailing list archives

Site index · List index
Message view « Date » · « Thread »
Top « Date » · « Thread »
From Apache Jenkins Server <jenk...@builds.apache.org>
Subject Build failed in Jenkins: ServiceMix-Bundles #1084
Date Mon, 20 Feb 2017 00:30:19 GMT
See <https://builds.apache.org/job/ServiceMix-Bundles/1084/display/redirect?page=changes>

Changes:

[jbonofre] [SM-3246] Create OSGi bundles for lucene 6.4.1

[jbonofre] [SM-3247] Create OSGi bundle for ant 1.10.1

[jbonofre] [SM-3248] Create OSGi bundle for docker-java 3.0.7

[jbonofre] [SM-3249] Create OSGi bundle for aspectj 1.8.10

[jbonofre] [SM-3250] Create OSGi bundle for saxon 9.7.0-15

[jbonofre] [SM-3251] Create OSGi bundle for orbitz-consul-client 0.13.11

[jbonofre] [SM-3252] Create OSGi bundle for htmlunit 2.24

[jbonofre] [SM-3253] Create OSGi bundle for hbase 1.3.0

[jbonofre] [SM-3254] Create OSGi bundle for spatial4j 0.5

[jbonofre] [SM-3255] Create OSGi bundle for braintree-java 2.71.0

[jbonofre] [SM-3256] Create OSGi bundle for bcpg-jdk15on 1.56

[jbonofre] [SM-3257] Create OSGi bundle for libphonenumber 8.3.0

[jbonofre] [SM-3258] Create OSGi bundle for aws-java-sdk 1.11.92

[jbonofre] [SM-3259] Create OSGi bundle for spring-security-ldap 4.0.4.RELEASE

[jbonofre] [SM-3260] Create OSGi bundle for spring-data-commons 1.12.1.RELEASE

------------------------------------------
Started by an SCM change
[EnvInject] - Loading node environment variables.
Building remotely on ubuntu-5 (Ubuntu yahoo-not-h2 ubuntu ubuntu5 docker) in workspace <https://builds.apache.org/job/ServiceMix-Bundles/ws/>
 > git rev-parse --is-inside-work-tree # timeout=10
Fetching changes from the remote Git repository
 > git config remote.origin.url https://git-wip-us.apache.org/repos/asf/servicemix-bundles.git
# timeout=10
Fetching upstream changes from https://git-wip-us.apache.org/repos/asf/servicemix-bundles.git
 > git --version # timeout=10
 > git fetch --tags --progress https://git-wip-us.apache.org/repos/asf/servicemix-bundles.git
+refs/heads/*:refs/remotes/origin/*
 > git rev-parse refs/remotes/origin/master^{commit} # timeout=10
 > git rev-parse refs/remotes/origin/origin/master^{commit} # timeout=10
Checking out Revision b1b1c11d59fd03e69b0333db2cec835c0459d748 (refs/remotes/origin/master)
 > git config core.sparsecheckout # timeout=10
 > git checkout -f b1b1c11d59fd03e69b0333db2cec835c0459d748
 > git rev-list 88953b7f1b7207bd9f5ca8360a968d2d359c1f1e # timeout=10
Parsing POMs
ERROR: Failed to parse POMs
java.io.IOException: remote file operation failed: <https://builds.apache.org/job/ServiceMix-Bundles/ws/>
at hudson.remoting.Channel@79431e26:ubuntu-5: hudson.remoting.ProxyException: hudson.maven.MavenModuleSetBuild$MavenExecutionException:
org.apache.maven.project.ProjectBuildingException: Some problems were encountered while processing
the POMs:
[FATAL] Non-parseable POM <https://builds.apache.org/job/ServiceMix-Bundles/ws/pom.xml>:
end tag name </mmodule> must match start tag name <module> from line 103 (position:
TEXT seen ...<module>aws-java-sdk-1.11.92</mmodule>... @103:47)  @ line 103, column
47

	at hudson.FilePath.act(FilePath.java:992)
	at hudson.FilePath.act(FilePath.java:974)
	at hudson.maven.MavenModuleSetBuild$MavenModuleSetBuildExecution.parsePoms(MavenModuleSetBuild.java:980)
	at hudson.maven.MavenModuleSetBuild$MavenModuleSetBuildExecution.doRun(MavenModuleSetBuild.java:692)
	at hudson.model.AbstractBuild$AbstractBuildExecution.run(AbstractBuild.java:534)
	at hudson.model.Run.execute(Run.java:1728)
	at hudson.maven.MavenModuleSetBuild.run(MavenModuleSetBuild.java:544)
	at hudson.model.ResourceController.execute(ResourceController.java:98)
	at hudson.model.Executor.run(Executor.java:404)
Caused by: hudson.remoting.ProxyException: hudson.maven.MavenModuleSetBuild$MavenExecutionException:
org.apache.maven.project.ProjectBuildingException: Some problems were encountered while processing
the POMs:
[FATAL] Non-parseable POM <https://builds.apache.org/job/ServiceMix-Bundles/ws/pom.xml>:
end tag name </mmodule> must match start tag name <module> from line 103 (position:
TEXT seen ...<module>aws-java-sdk-1.11.92</mmodule>... @103:47)  @ line 103, column
47

	at hudson.maven.MavenModuleSetBuild$PomParser.invoke(MavenModuleSetBuild.java:1384)
	at hudson.maven.MavenModuleSetBuild$PomParser.invoke(MavenModuleSetBuild.java:1118)
	at hudson.FilePath$FileCallableWrapper.call(FilePath.java:2731)
	at hudson.remoting.UserRequest.perform(UserRequest.java:153)
	at hudson.remoting.UserRequest.perform(UserRequest.java:50)
	at hudson.remoting.Request$2.run(Request.java:336)
	at hudson.remoting.InterceptingExecutorService$1.call(InterceptingExecutorService.java:68)
	at java.util.concurrent.FutureTask.run(FutureTask.java:262)
	at java.util.concurrent.ThreadPoolExecutor.runWorker(ThreadPoolExecutor.java:1145)
	at java.util.concurrent.ThreadPoolExecutor$Worker.run(ThreadPoolExecutor.java:615)
	at java.lang.Thread.run(Thread.java:745)
	at ......remote call to ubuntu-5(Native Method)
	at hudson.remoting.Channel.attachCallSiteStackTrace(Channel.java:1537)
	at hudson.remoting.UserResponse.retrieve(UserRequest.java:253)
	at hudson.remoting.Channel.call(Channel.java:822)
	at hudson.FilePath.act(FilePath.java:985)
	... 8 more
Caused by: hudson.remoting.ProxyException: org.apache.maven.project.ProjectBuildingException:
Some problems were encountered while processing the POMs:
[FATAL] Non-parseable POM <https://builds.apache.org/job/ServiceMix-Bundles/ws/pom.xml>:
end tag name </mmodule> must match start tag name <module> from line 103 (position:
TEXT seen ...<module>aws-java-sdk-1.11.92</mmodule>... @103:47)  @ line 103, column
47

	at org.apache.maven.project.DefaultProjectBuilder.build(DefaultProjectBuilder.java:364)
	at hudson.maven.MavenEmbedder.buildProjects(MavenEmbedder.java:361)
	at hudson.maven.MavenEmbedder.readProjects(MavenEmbedder.java:331)
	at hudson.maven.MavenModuleSetBuild$PomParser.invoke(MavenModuleSetBuild.java:1321)
	at hudson.maven.MavenModuleSetBuild$PomParser.invoke(MavenModuleSetBuild.java:1118)
	at hudson.FilePath$FileCallableWrapper.call(FilePath.java:2731)
	at hudson.remoting.UserRequest.perform(UserRequest.java:153)
	at hudson.remoting.UserRequest.perform(UserRequest.java:50)
	at hudson.remoting.Request$2.run(Request.java:336)
	at hudson.remoting.InterceptingExecutorService$1.call(InterceptingExecutorService.java:68)
	at java.util.concurrent.FutureTask.run(FutureTask.java:262)
	at java.util.concurrent.ThreadPoolExecutor.runWorker(ThreadPoolExecutor.java:1145)
	at java.util.concurrent.ThreadPoolExecutor$Worker.run(ThreadPoolExecutor.java:615)
	at java.lang.Thread.run(Thread.java:745)

Mime
View raw message