servicemix-commits mailing list archives

Site index · List index
Message view « Date » · « Thread »
Top « Date » · « Thread »
From Apache Jenkins Server <jenk...@builds.apache.org>
Subject Build failed in Jenkins: ServiceMix-Bundles #2149
Date Wed, 31 Jan 2018 20:49:48 GMT
See <https://builds.apache.org/job/ServiceMix-Bundles/2149/display/redirect?page=changes>

Changes:

[jb] [SM-3620] Create OSGi bundle for solr-solrj 7.2.1

[jb] [SM-3621] Create OSGi bundle for postgresql 42.2.0.jre7

[jb] [SM-3622] Create OSGi bundle for braintree-java 2.74.1

------------------------------------------
Started by an SCM change
Started by an SCM change
Started by an SCM change
[EnvInject] - Loading node environment variables.
Building remotely on ubuntu-2 (ubuntu trusty) in workspace <https://builds.apache.org/job/ServiceMix-Bundles/ws/>
Cloning the remote Git repository
Cloning repository https://git-wip-us.apache.org/repos/asf/servicemix-bundles.git
 > git init <https://builds.apache.org/job/ServiceMix-Bundles/ws/> # timeout=10
Fetching upstream changes from https://git-wip-us.apache.org/repos/asf/servicemix-bundles.git
 > git --version # timeout=10
 > git fetch --tags --progress https://git-wip-us.apache.org/repos/asf/servicemix-bundles.git
+refs/heads/*:refs/remotes/origin/*
 > git config remote.origin.url https://git-wip-us.apache.org/repos/asf/servicemix-bundles.git
# timeout=10
 > git config --add remote.origin.fetch +refs/heads/*:refs/remotes/origin/* # timeout=10
 > git config remote.origin.url https://git-wip-us.apache.org/repos/asf/servicemix-bundles.git
# timeout=10
Fetching upstream changes from https://git-wip-us.apache.org/repos/asf/servicemix-bundles.git
 > git fetch --tags --progress https://git-wip-us.apache.org/repos/asf/servicemix-bundles.git
+refs/heads/*:refs/remotes/origin/*
 > git rev-parse refs/remotes/origin/master^{commit} # timeout=10
 > git rev-parse refs/remotes/origin/origin/master^{commit} # timeout=10
Checking out Revision 0b22fc7df537eefd47f8c6611f1f91f786ca6c9f (refs/remotes/origin/master)
 > git config core.sparsecheckout # timeout=10
 > git checkout -f 0b22fc7df537eefd47f8c6611f1f91f786ca6c9f
Commit message: "[SM-3622] Create OSGi bundle for braintree-java 2.74.1"
 > git rev-list 3d2fe83ad53e6f10ba45b73e32b61d36b60a4491 # timeout=10
Parsing POMs
Downloaded artifact http://repo.maven.apache.org/maven2/org/apache/servicemix/servicemix-pom/5/servicemix-pom-5.pom
Downloaded artifact http://repo.maven.apache.org/maven2/org/apache/apache/7/apache-7.pom
Failed to transfer Could not find artifact org.apache.servicemix.bundles:bundles-pom:pom:13
in snmp4j.repo (https://oosnmp.net/dist/release)
Downloaded artifact http://repo.maven.apache.org/maven2/org/apache/servicemix/bundles/bundles-pom/13/bundles-pom-13.pom
ERROR: Failed to parse POMs
java.io.IOException: remote file operation failed: <https://builds.apache.org/job/ServiceMix-Bundles/ws/>
at hudson.remoting.Channel@5f9ca3:ubuntu-2: hudson.remoting.ProxyException: hudson.maven.MavenModuleSetBuild$MavenExecutionException:
org.apache.maven.project.ProjectBuildingException: Some problems were encountered while processing
the POMs:
[ERROR] Child module <https://builds.apache.org/job/ServiceMix-Bundles/ws/braintree-java-2.74.0>
of <https://builds.apache.org/job/ServiceMix-Bundles/ws/pom.xml> does not exist @ 
[ERROR] Child module <https://builds.apache.org/job/ServiceMix-Bundles/ws/elasticsearch-6.1.1>
of <https://builds.apache.org/job/ServiceMix-Bundles/ws/pom.xml> does not exist @ 

	at hudson.FilePath.act(FilePath.java:993)
	at hudson.FilePath.act(FilePath.java:975)
	at hudson.maven.MavenModuleSetBuild$MavenModuleSetBuildExecution.parsePoms(MavenModuleSetBuild.java:986)
	at hudson.maven.MavenModuleSetBuild$MavenModuleSetBuildExecution.doRun(MavenModuleSetBuild.java:691)
	at hudson.model.AbstractBuild$AbstractBuildExecution.run(AbstractBuild.java:504)
	at hudson.model.Run.execute(Run.java:1724)
	at hudson.maven.MavenModuleSetBuild.run(MavenModuleSetBuild.java:543)
	at hudson.model.ResourceController.execute(ResourceController.java:97)
	at hudson.model.Executor.run(Executor.java:421)
Caused by: hudson.remoting.ProxyException: hudson.maven.MavenModuleSetBuild$MavenExecutionException:
org.apache.maven.project.ProjectBuildingException: Some problems were encountered while processing
the POMs:
[ERROR] Child module <https://builds.apache.org/job/ServiceMix-Bundles/ws/braintree-java-2.74.0>
of <https://builds.apache.org/job/ServiceMix-Bundles/ws/pom.xml> does not exist @ 
[ERROR] Child module <https://builds.apache.org/job/ServiceMix-Bundles/ws/elasticsearch-6.1.1>
of <https://builds.apache.org/job/ServiceMix-Bundles/ws/pom.xml> does not exist @ 

	at hudson.maven.MavenModuleSetBuild$PomParser.invoke(MavenModuleSetBuild.java:1391)
	at hudson.maven.MavenModuleSetBuild$PomParser.invoke(MavenModuleSetBuild.java:1125)
	at hudson.FilePath$FileCallableWrapper.call(FilePath.java:2760)
	at hudson.remoting.UserRequest.perform(UserRequest.java:207)
	at hudson.remoting.UserRequest.perform(UserRequest.java:53)
	at hudson.remoting.Request$2.run(Request.java:358)
	at hudson.remoting.InterceptingExecutorService$1.call(InterceptingExecutorService.java:72)
	at java.util.concurrent.FutureTask.run(FutureTask.java:266)
	at java.util.concurrent.ThreadPoolExecutor.runWorker(ThreadPoolExecutor.java:1142)
	at java.util.concurrent.ThreadPoolExecutor$Worker.run(ThreadPoolExecutor.java:617)
	at java.lang.Thread.run(Thread.java:748)
	Suppressed: hudson.remoting.Channel$CallSiteStackTrace: Remote call to ubuntu-2
		at hudson.remoting.Channel.attachCallSiteStackTrace(Channel.java:1693)
		at hudson.remoting.UserResponse.retrieve(UserRequest.java:310)
		at hudson.remoting.Channel.call(Channel.java:908)
		at hudson.FilePath.act(FilePath.java:986)
		at hudson.FilePath.act(FilePath.java:975)
		at hudson.maven.MavenModuleSetBuild$MavenModuleSetBuildExecution.parsePoms(MavenModuleSetBuild.java:986)
		at hudson.maven.MavenModuleSetBuild$MavenModuleSetBuildExecution.doRun(MavenModuleSetBuild.java:691)
		at hudson.model.AbstractBuild$AbstractBuildExecution.run(AbstractBuild.java:504)
		at hudson.model.Run.execute(Run.java:1724)
		at hudson.maven.MavenModuleSetBuild.run(MavenModuleSetBuild.java:543)
		at hudson.model.ResourceController.execute(ResourceController.java:97)
		at hudson.model.Executor.run(Executor.java:421)
Caused by: hudson.remoting.ProxyException: org.apache.maven.project.ProjectBuildingException:
Some problems were encountered while processing the POMs:
[ERROR] Child module <https://builds.apache.org/job/ServiceMix-Bundles/ws/braintree-java-2.74.0>
of <https://builds.apache.org/job/ServiceMix-Bundles/ws/pom.xml> does not exist @ 
[ERROR] Child module <https://builds.apache.org/job/ServiceMix-Bundles/ws/elasticsearch-6.1.1>
of <https://builds.apache.org/job/ServiceMix-Bundles/ws/pom.xml> does not exist @ 

	at org.apache.maven.project.DefaultProjectBuilder.build(DefaultProjectBuilder.java:364)
	at hudson.maven.MavenEmbedder.buildProjects(MavenEmbedder.java:361)
	at hudson.maven.MavenEmbedder.readProjects(MavenEmbedder.java:331)
	at hudson.maven.MavenModuleSetBuild$PomParser.invoke(MavenModuleSetBuild.java:1328)
	... 10 more

Mime
View raw message