shiro-commits mailing list archives

Site index · List index
Message view « Date » · « Thread »
Top « Date » · « Thread »
From Apache Jenkins Server <jenk...@builds.apache.org>
Subject Build failed in Jenkins: Shiro #328
Date Thu, 08 Dec 2011 22:55:31 GMT
See <https://builds.apache.org/job/Shiro/328/changes>

Changes:

[lhazlewood] SHIRO-279: added tests to bring the org.apache.shiro.crypto.hash.format package
to 100% class and line coverage.  Also added 'ProvidedHashFormat' enum to represent all out-of-the-box
HashFormat implementations.

------------------------------------------
[...truncated 9614 lines...]

[INFO] --- maven-install-plugin:2.3:install (default-install) @ samples-web ---
[INFO] Downloading: https://repository.apache.org/content/repositories/snapshots/org/apache/shiro/samples/samples-web/1.2.0-SNAPSHOT/maven-metadata.xml

[INFO] --- maven-deploy-plugin:2.5:deploy (default-deploy) @ samples-web ---
Downloaded: https://repository.apache.org/content/repositories/snapshots/org/apache/shiro/samples/samples-web/1.2.0-SNAPSHOT/maven-metadata.xml
(2 KB at 0.7 KB/sec)
Uploading: https://repository.apache.org/content/repositories/snapshots/org/apache/shiro/samples/samples-web/1.2.0-SNAPSHOT/samples-web-1.2.0-20111207.210802-42.war
Uploaded: https://repository.apache.org/content/repositories/snapshots/org/apache/shiro/samples/samples-web/1.2.0-SNAPSHOT/samples-web-1.2.0-20111207.210802-42.war
(1119 KB at 1113.4 KB/sec)
Uploading: https://repository.apache.org/content/repositories/snapshots/org/apache/shiro/samples/samples-web/1.2.0-SNAPSHOT/samples-web-1.2.0-20111207.210802-42.pom
Uploaded: https://repository.apache.org/content/repositories/snapshots/org/apache/shiro/samples/samples-web/1.2.0-SNAPSHOT/samples-web-1.2.0-20111207.210802-42.pom
(5 KB at 23.5 KB/sec)
Downloading: https://repository.apache.org/content/repositories/snapshots/org/apache/shiro/samples/samples-web/maven-metadata.xml
Downloaded: https://repository.apache.org/content/repositories/snapshots/org/apache/shiro/samples/samples-web/maven-metadata.xml
(475 B at 0.5 KB/sec)
Uploading: https://repository.apache.org/content/repositories/snapshots/org/apache/shiro/samples/samples-web/1.2.0-SNAPSHOT/maven-metadata.xml
Uploaded: https://repository.apache.org/content/repositories/snapshots/org/apache/shiro/samples/samples-web/1.2.0-SNAPSHOT/maven-metadata.xml
(2 KB at 7.1 KB/sec)
Uploading: https://repository.apache.org/content/repositories/snapshots/org/apache/shiro/samples/samples-web/maven-metadata.xml
Uploaded: https://repository.apache.org/content/repositories/snapshots/org/apache/shiro/samples/samples-web/maven-metadata.xml
(475 B at 1.8 KB/sec)
Uploading: https://repository.apache.org/content/repositories/snapshots/org/apache/shiro/samples/samples-web/1.2.0-SNAPSHOT/samples-web-1.2.0-20111207.210802-42-javadoc.jar
Uploaded: https://repository.apache.org/content/repositories/snapshots/org/apache/shiro/samples/samples-web/1.2.0-SNAPSHOT/samples-web-1.2.0-20111207.210802-42-javadoc.jar
(6 KB at 28.5 KB/sec)
Uploading: https://repository.apache.org/content/repositories/snapshots/org/apache/shiro/samples/samples-web/1.2.0-SNAPSHOT/maven-metadata.xml
Uploaded: https://repository.apache.org/content/repositories/snapshots/org/apache/shiro/samples/samples-web/1.2.0-SNAPSHOT/maven-metadata.xml
(2 KB at 6.1 KB/sec)
Uploading: https://repository.apache.org/content/repositories/snapshots/org/apache/shiro/samples/samples-web/1.2.0-SNAPSHOT/samples-web-1.2.0-20111207.210802-42-sources.jar
Uploaded: https://repository.apache.org/content/repositories/snapshots/org/apache/shiro/samples/samples-web/1.2.0-SNAPSHOT/samples-web-1.2.0-20111207.210802-42-sources.jar
(7 KB at 20.8 KB/sec)
Uploading: https://repository.apache.org/content/repositories/snapshots/org/apache/shiro/samples/samples-web/1.2.0-SNAPSHOT/maven-metadata.xml
Uploaded: https://repository.apache.org/content/repositories/snapshots/org/apache/shiro/samples/samples-web/1.2.0-SNAPSHOT/maven-metadata.xml
(2 KB at 6.8 KB/sec)
[JENKINS] Archiving <https://builds.apache.org/job/Shiro/ws/trunk/samples/web/target/samples-web-1.2.0-SNAPSHOT.war>
to /home/hudson/hudson/jobs/Shiro/modules/org.apache.shiro.samples$samples-web/builds/2011-12-07_21-00-28/archive/org.apache.shiro.samples/samples-web/1.2.0-20111207.210802-42/samples-web-1.2.0-20111207.210802-42.war
[JENKINS] Archiving <https://builds.apache.org/job/Shiro/ws/trunk/samples/web/target/samples-web-1.2.0-SNAPSHOT-javadoc.jar>
to /home/hudson/hudson/jobs/Shiro/modules/org.apache.shiro.samples$samples-web/builds/2011-12-07_21-00-28/archive/org.apache.shiro.samples/samples-web/1.2.0-20111207.210802-42/samples-web-1.2.0-20111207.210802-42-javadoc.jar
[JENKINS] Archiving <https://builds.apache.org/job/Shiro/ws/trunk/samples/web/target/samples-web-1.2.0-SNAPSHOT-sources.jar>
to /home/hudson/hudson/jobs/Shiro/modules/org.apache.shiro.samples$samples-web/builds/2011-12-07_21-00-28/archive/org.apache.shiro.samples/samples-web/1.2.0-20111207.210802-42/samples-web-1.2.0-20111207.210802-42-sources.jar
[INFO]                                                                         
[INFO] ------------------------------------------------------------------------
[INFO] Building Apache Shiro :: Samples :: Spring Client 1.2.0-SNAPSHOT
[INFO] ------------------------------------------------------------------------
[INFO] [INFO] Checking for local modifications: skipped.
[INFO] Updating project files from SCM: skipped.
[INFO] Executing: /bin/sh -c cd <https://builds.apache.org/job/Shiro/ws/trunk/samples/spring-client>
&& svn --non-interactive info
[INFO] Working directory: <https://builds.apache.org/job/Shiro/ws/trunk/samples/spring-client>
[INFO] Storing buildNumber: 1211629 at timestamp: 1323292100795
[INFO] Executing: /bin/sh -c cd <https://builds.apache.org/job/Shiro/ws/trunk/samples/spring-client>
&& svn --non-interactive info
[INFO] Working directory: <https://builds.apache.org/job/Shiro/ws/trunk/samples/spring-client>
[INFO] Storing buildScmBranch: trunk

[INFO] --- buildnumber-maven-plugin:1.0-beta-4:create (default) @ samples-spring-client ---
[INFO] 
[INFO] --- maven-remote-resources-plugin:1.1:process (default) @ samples-spring-client ---
[INFO] [INFO] Using 'UTF-8' encoding to copy filtered resources.
[INFO] Copying 2 resources
[INFO] Copying 3 resources

[INFO] --- maven-resources-plugin:2.4:resources (default-resources) @ samples-spring-client
---
[INFO] [INFO] Compiling 3 source files to <https://builds.apache.org/job/Shiro/ws/trunk/samples/spring-client/target/classes>

[INFO] --- maven-compiler-plugin:2.0.2:compile (default-compile) @ samples-spring-client ---
2011-12-07 21:08:22,079 DEBUG [org.mortbay.log]: EOF
[INFO] [INFO] No sources found to compile

[INFO] --- gmaven-plugin:1.3:compile (default) @ samples-spring-client ---
[INFO] [INFO] Using 'UTF-8' encoding to copy filtered resources.
[INFO] skip non existing resourceDirectory <https://builds.apache.org/job/Shiro/ws/trunk/samples/spring-client/src/test/resources>
[INFO] Copying 3 resources

[INFO] --- maven-resources-plugin:2.4:testResources (default-testResources) @ samples-spring-client
---
[INFO] [INFO] No sources to compile

[INFO] --- maven-compiler-plugin:2.0.2:testCompile (default-testCompile) @ samples-spring-client
---
[INFO] [INFO] No sources found to compile

[INFO] --- gmaven-plugin:1.3:testCompile (default) @ samples-spring-client ---
[INFO] [INFO] Surefire report directory: <https://builds.apache.org/job/Shiro/ws/trunk/samples/spring-client/target/surefire-reports>

[INFO] --- maven-surefire-plugin:2.4.3:test (default-test) @ samples-spring-client ---

-------------------------------------------------------
 T E S T S
-------------------------------------------------------
There are no tests to run.

Results :

Tests run: 0, Failures: 0, Errors: 0, Skipped: 0

[JENKINS] Recording test results
[INFO] 
[INFO] --- maven-jar-plugin:2.3.1:jar (default-jar) @ samples-spring-client ---
[INFO] Building jar: <https://builds.apache.org/job/Shiro/ws/trunk/samples/spring-client/target/samples-spring-client-1.2.0-SNAPSHOT.jar>
[INFO] 
[INFO] --- maven-javadoc-plugin:2.7:jar (attach-api-docs) @ samples-spring-client ---
[ERROR] Error fetching link: <https://builds.apache.org/job/Shiro/ws/trunk/samples/web/target/apidocs/package-list.>
Ignored it.
[ERROR] Error fetching link: <https://builds.apache.org/job/Shiro/ws/trunk/samples/spring/target/apidocs/package-list.>
Ignored it.
[ERROR] Error fetching link: <https://builds.apache.org/job/Shiro/ws/trunk/samples/spring-hibernate/target/apidocs/package-list.>
Ignored it.
[ERROR] Error fetching link: <https://builds.apache.org/job/Shiro/ws/trunk/tools/hasher/target/apidocs/package-list.>
Ignored it.
[ERROR] Error fetching link: <https://builds.apache.org/job/Shiro/ws/trunk/all/target/apidocs/package-list.>
Ignored it.
[INFO] 
Loading source files for package org.apache.shiro.samples.spring.ui...
Loading source files for package org.apache.shiro.samples.spring...
Constructing Javadoc information...
Standard Doclet version 1.6.0_27
Building tree for all the packages and classes...
Generating <https://builds.apache.org/job/Shiro/ws/trunk/samples/spring-client/target/apidocs/org/apache/shiro/samples/spring/ui//WebStartDriver.html...>
Generating <https://builds.apache.org/job/Shiro/ws/trunk/samples/spring-client/target/apidocs/org/apache/shiro/samples/spring/ui//WebStartView.html...>
Generating <https://builds.apache.org/job/Shiro/ws/trunk/samples/spring-client/target/apidocs/org/apache/shiro/samples/spring//SampleManager.html...>
Generating <https://builds.apache.org/job/Shiro/ws/trunk/samples/spring-client/target/apidocs/overview-frame.html...>
Generating <https://builds.apache.org/job/Shiro/ws/trunk/samples/spring-client/target/apidocs/org/apache/shiro/samples/spring//package-frame.html...>
Generating <https://builds.apache.org/job/Shiro/ws/trunk/samples/spring-client/target/apidocs/org/apache/shiro/samples/spring//package-summary.html...>
Generating <https://builds.apache.org/job/Shiro/ws/trunk/samples/spring-client/target/apidocs/org/apache/shiro/samples/spring//package-tree.html...>
Generating <https://builds.apache.org/job/Shiro/ws/trunk/samples/spring-client/target/apidocs/org/apache/shiro/samples/spring/ui//package-frame.html...>
Generating <https://builds.apache.org/job/Shiro/ws/trunk/samples/spring-client/target/apidocs/org/apache/shiro/samples/spring/ui//package-summary.html...>
Generating <https://builds.apache.org/job/Shiro/ws/trunk/samples/spring-client/target/apidocs/org/apache/shiro/samples/spring/ui//package-tree.html...>
Generating <https://builds.apache.org/job/Shiro/ws/trunk/samples/spring-client/target/apidocs/constant-values.html...>
Generating <https://builds.apache.org/job/Shiro/ws/trunk/samples/spring-client/target/apidocs/org/apache/shiro/samples/spring/ui//class-use/WebStartDriver.html...>
Generating <https://builds.apache.org/job/Shiro/ws/trunk/samples/spring-client/target/apidocs/org/apache/shiro/samples/spring/ui//class-use/WebStartView.html...>
Generating <https://builds.apache.org/job/Shiro/ws/trunk/samples/spring-client/target/apidocs/org/apache/shiro/samples/spring//class-use/SampleManager.html...>
Generating <https://builds.apache.org/job/Shiro/ws/trunk/samples/spring-client/target/apidocs/org/apache/shiro/samples/spring//package-use.html...>
Generating <https://builds.apache.org/job/Shiro/ws/trunk/samples/spring-client/target/apidocs/org/apache/shiro/samples/spring/ui//package-use.html...>
Building index for all the packages and classes...
Generating <https://builds.apache.org/job/Shiro/ws/trunk/samples/spring-client/target/apidocs/overview-tree.html...>
Generating <https://builds.apache.org/job/Shiro/ws/trunk/samples/spring-client/target/apidocs/index-all.html...>
Generating <https://builds.apache.org/job/Shiro/ws/trunk/samples/spring-client/target/apidocs/deprecated-list.html...>
Building index for all classes...
Generating <https://builds.apache.org/job/Shiro/ws/trunk/samples/spring-client/target/apidocs/allclasses-frame.html...>
Generating <https://builds.apache.org/job/Shiro/ws/trunk/samples/spring-client/target/apidocs/allclasses-noframe.html...>
Generating <https://builds.apache.org/job/Shiro/ws/trunk/samples/spring-client/target/apidocs/index.html...>
Generating <https://builds.apache.org/job/Shiro/ws/trunk/samples/spring-client/target/apidocs/overview-summary.html...>
Generating <https://builds.apache.org/job/Shiro/ws/trunk/samples/spring-client/target/apidocs/help-doc.html...>
Generating <https://builds.apache.org/job/Shiro/ws/trunk/samples/spring-client/target/apidocs/stylesheet.css...>
[INFO] Building jar: <https://builds.apache.org/job/Shiro/ws/trunk/samples/spring-client/target/samples-spring-client-1.2.0-SNAPSHOT-javadoc.jar>
[INFO] Checking for local modifications: skipped.
[INFO] Updating project files from SCM: skipped.
[INFO] [INFO] Executing: /bin/sh -c cd <https://builds.apache.org/job/Shiro/ws/trunk/samples/spring-client>
&& svn --non-interactive info
[INFO] Working directory: <https://builds.apache.org/job/Shiro/ws/trunk/samples/spring-client>
[INFO] Storing buildNumber: 1211629 at timestamp: 1323292106181
[INFO] Executing: /bin/sh -c cd <https://builds.apache.org/job/Shiro/ws/trunk/samples/spring-client>
&& svn --non-interactive info
[INFO] Working directory: <https://builds.apache.org/job/Shiro/ws/trunk/samples/spring-client>
[INFO] Storing buildScmBranch: trunk

[INFO] --- buildnumber-maven-plugin:1.0-beta-4:create (default) @ samples-spring-client ---
[JENKINS] Archiving <https://builds.apache.org/job/Shiro/ws/trunk/samples/spring-client/pom.xml>
to /home/hudson/hudson/jobs/Shiro/modules/org.apache.shiro.samples$samples-spring-client/builds/2011-12-07_21-00-28/archive/org.apache.shiro.samples/samples-spring-client/1.2.0-SNAPSHOT/samples-spring-client-1.2.0-SNAPSHOT.pom
[JENKINS] Archiving <https://builds.apache.org/job/Shiro/ws/trunk/samples/spring-client/target/samples-spring-client-1.2.0-SNAPSHOT.jar>
to /home/hudson/hudson/jobs/Shiro/modules/org.apache.shiro.samples$samples-spring-client/builds/2011-12-07_21-00-28/archive/org.apache.shiro.samples/samples-spring-client/1.2.0-SNAPSHOT/samples-spring-client-1.2.0-SNAPSHOT.jar
[JENKINS] Archiving <https://builds.apache.org/job/Shiro/ws/trunk/samples/spring-client/target/samples-spring-client-1.2.0-SNAPSHOT-javadoc.jar>
to /home/hudson/hudson/jobs/Shiro/modules/org.apache.shiro.samples$samples-spring-client/builds/2011-12-07_21-00-28/archive/org.apache.shiro.samples/samples-spring-client/1.2.0-SNAPSHOT/samples-spring-client-1.2.0-SNAPSHOT-javadoc.jar
ignoring exception during new ExecutedMojo null
[INFO] [INFO] Building jar: <https://builds.apache.org/job/Shiro/ws/trunk/samples/spring-client/target/samples-spring-client-1.2.0-SNAPSHOT-sources.jar>

[INFO] --- maven-source-plugin:2.0.4:jar (attach-sources) @ samples-spring-client ---
[INFO] 
[INFO] --- webstart-maven-plugin:1.0-alpha-2:jnlp-inline (default) @ samples-spring-client
---
Packing with Pack200
Source File :<https://builds.apache.org/job/Shiro/ws/trunk/samples/spring-client/target/jnlp/unprocessed_shiro-web-1.2.0-SNAPSHOT.jar>
Dest.  File :<https://builds.apache.org/job/Shiro/ws/trunk/samples/spring-client/target/jnlp/unprocessed_shiro-web-1.2.0-SNAPSHOT.jar.pack>
Packing with Pack200
Source File :<https://builds.apache.org/job/Shiro/ws/trunk/samples/spring-client/target/jnlp/unprocessed_slf4j-log4j12-1.6.1.jar>
Dest.  File :<https://builds.apache.org/job/Shiro/ws/trunk/samples/spring-client/target/jnlp/unprocessed_slf4j-log4j12-1.6.1.jar.pack>
Packing with Pack200
Source File :<https://builds.apache.org/job/Shiro/ws/trunk/samples/spring-client/target/jnlp/unprocessed_samples-spring-client-1.2.0-SNAPSHOT.jar>
Dest.  File :<https://builds.apache.org/job/Shiro/ws/trunk/samples/spring-client/target/jnlp/unprocessed_samples-spring-client-1.2.0-SNAPSHOT.jar.pack>
Packing with Pack200
Source File :<https://builds.apache.org/job/Shiro/ws/trunk/samples/spring-client/target/jnlp/unprocessed_spring-beans-3.0.5.RELEASE.jar>
Dest.  File :<https://builds.apache.org/job/Shiro/ws/trunk/samples/spring-client/target/jnlp/unprocessed_spring-beans-3.0.5.RELEASE.jar.pack>
Packing with Pack200
Source File :<https://builds.apache.org/job/Shiro/ws/trunk/samples/spring-client/target/jnlp/unprocessed_spring-asm-3.0.5.RELEASE.jar>
Dest.  File :<https://builds.apache.org/job/Shiro/ws/trunk/samples/spring-client/target/jnlp/unprocessed_spring-asm-3.0.5.RELEASE.jar.pack>
Packing with Pack200
Source File :<https://builds.apache.org/job/Shiro/ws/trunk/samples/spring-client/target/jnlp/unprocessed_spring-webmvc-3.0.5.RELEASE.jar>
Dest.  File :<https://builds.apache.org/job/Shiro/ws/trunk/samples/spring-client/target/jnlp/unprocessed_spring-webmvc-3.0.5.RELEASE.jar.pack>
Packing with Pack200
Source File :<https://builds.apache.org/job/Shiro/ws/trunk/samples/spring-client/target/jnlp/unprocessed_aopalliance-1.0.jar>
Dest.  File :<https://builds.apache.org/job/Shiro/ws/trunk/samples/spring-client/target/jnlp/unprocessed_aopalliance-1.0.jar.pack>
Packing with Pack200
Source File :<https://builds.apache.org/job/Shiro/ws/trunk/samples/spring-client/target/jnlp/unprocessed_shiro-core-1.2.0-SNAPSHOT.jar>
Dest.  File :<https://builds.apache.org/job/Shiro/ws/trunk/samples/spring-client/target/jnlp/unprocessed_shiro-core-1.2.0-SNAPSHOT.jar.pack>
Packing with Pack200
Source File :<https://builds.apache.org/job/Shiro/ws/trunk/samples/spring-client/target/jnlp/unprocessed_log4j-1.2.16.jar>
Dest.  File :<https://builds.apache.org/job/Shiro/ws/trunk/samples/spring-client/target/jnlp/unprocessed_log4j-1.2.16.jar.pack>
Packing with Pack200
Source File :<https://builds.apache.org/job/Shiro/ws/trunk/samples/spring-client/target/jnlp/unprocessed_spring-web-3.0.5.RELEASE.jar>
Dest.  File :<https://builds.apache.org/job/Shiro/ws/trunk/samples/spring-client/target/jnlp/unprocessed_spring-web-3.0.5.RELEASE.jar.pack>
Packing with Pack200
Source File :<https://builds.apache.org/job/Shiro/ws/trunk/samples/spring-client/target/jnlp/unprocessed_slf4j-api-1.6.1.jar>
Dest.  File :<https://builds.apache.org/job/Shiro/ws/trunk/samples/spring-client/target/jnlp/unprocessed_slf4j-api-1.6.1.jar.pack>
Packing with Pack200
Source File :<https://builds.apache.org/job/Shiro/ws/trunk/samples/spring-client/target/jnlp/unprocessed_spring-aop-3.0.5.RELEASE.jar>
Dest.  File :<https://builds.apache.org/job/Shiro/ws/trunk/samples/spring-client/target/jnlp/unprocessed_spring-aop-3.0.5.RELEASE.jar.pack>
Packing with Pack200
Source File :<https://builds.apache.org/job/Shiro/ws/trunk/samples/spring-client/target/jnlp/unprocessed_jcl-over-slf4j-1.6.1.jar>
Dest.  File :<https://builds.apache.org/job/Shiro/ws/trunk/samples/spring-client/target/jnlp/unprocessed_jcl-over-slf4j-1.6.1.jar.pack>
Packing with Pack200
Source File :<https://builds.apache.org/job/Shiro/ws/trunk/samples/spring-client/target/jnlp/unprocessed_spring-expression-3.0.5.RELEASE.jar>
Dest.  File :<https://builds.apache.org/job/Shiro/ws/trunk/samples/spring-client/target/jnlp/unprocessed_spring-expression-3.0.5.RELEASE.jar.pack>
Build timed out (after 23 minutes). Marking the build as aborted.
ERROR: Processing failed due to a bug in the code. Please report this to jenkinsci-users@googlegroups.com
hudson.remoting.RequestAbortedException: hudson.remoting.RequestAbortedException: hudson.remoting.Channel$OrderlyShutdown
	at hudson.remoting.Request.call(Request.java:149)
	at hudson.remoting.Channel.call(Channel.java:681)
	at hudson.remoting.RemoteInvocationHandler.invoke(RemoteInvocationHandler.java:158)
	at $Proxy24.join(Unknown Source)
	at hudson.Launcher$RemoteLauncher$ProcImpl.join(Launcher.java:850)
	at hudson.slaves.Channels$1.close(Channels.java:94)
	at hudson.maven.ProcessCache$MavenProcess.discard(ProcessCache.java:145)
	at hudson.maven.MavenModuleSetBuild$RunnerImpl.doRun(MavenModuleSetBuild.java:759)
	at hudson.model.AbstractBuild$AbstractRunner.run(AbstractBuild.java:459)
	at hudson.model.Run.run(Run.java:1376)
	at hudson.maven.MavenModuleSetBuild.run(MavenModuleSetBuild.java:474)
	at hudson.model.ResourceController.execute(ResourceController.java:88)
	at hudson.model.Executor.run(Executor.java:230)
Caused by: hudson.remoting.RequestAbortedException: hudson.remoting.Channel$OrderlyShutdown
	at hudson.remoting.Request.abort(Request.java:273)
	at hudson.remoting.Channel.terminate(Channel.java:732)
	at hudson.remoting.Channel$CloseCommand.execute(Channel.java:826)
	at hudson.remoting.Channel$ReaderThread.run(Channel.java:1106)
Caused by: hudson.remoting.Channel$OrderlyShutdown
	... 2 more
Caused by: Command close created at
	at hudson.remoting.Command.<init>(Command.java:62)
	at hudson.remoting.Command.<init>(Command.java:47)
	at hudson.remoting.Channel$CloseCommand.<init>(Channel.java:822)
	at hudson.remoting.Channel$CloseCommand.<init>(Channel.java:822)
	at hudson.remoting.Channel.close(Channel.java:867)
	at hudson.remoting.Channel$CloseCommand.execute(Channel.java:825)
	... 1 more
project=hudson.maven.MavenModuleSet@2987460a[Shiro]
project.getModules()=[hudson.maven.MavenModule@48834a71[Shiro/org.apache.shiro:shiro-all][Shiro/org.apache.shiro:shiro-all][relativePath:all],
hudson.maven.MavenModule@4f93e477[Shiro/org.apache.shiro:shiro-aspectj][Shiro/org.apache.shiro:shiro-aspectj][relativePath:support/aspectj],
hudson.maven.MavenModule@231587fb[Shiro/org.apache.shiro:shiro-core][Shiro/org.apache.shiro:shiro-core][relativePath:core],
hudson.maven.MavenModule@650a73bc[Shiro/org.apache.shiro:shiro-crowd][Shiro/org.apache.shiro:shiro-crowd][relativePath:support/crowd],
hudson.maven.MavenModule@6b40584c[Shiro/org.apache.shiro:shiro-ehcache][Shiro/org.apache.shiro:shiro-ehcache][relativePath:support/ehcache],
hudson.maven.MavenModule@47bc1051[Shiro/org.apache.shiro:shiro-features][Shiro/org.apache.shiro:shiro-features][relativePath:support/features],
hudson.maven.MavenModule@7b5ce015[Shiro/org.apache.shiro:shiro-groovy][Shiro/org.apache.shiro:shiro-groovy][relativePath:support/groovy],
hudson.maven.MavenModule@171183d8[Shiro/org.apache.shiro:shiro-guice][Shiro/org.apache.shiro:shiro-guice][relativePath:support/guice],
hudson.maven.MavenModule@6d6daf76[Shiro/org.apache.shiro:shiro-openid4j][Shiro/org.apache.shiro:shiro-openid4j][relativePath:support/openid4j],
hudson.maven.MavenModule@2f2b69ef[Shiro/org.apache.shiro:shiro-quartz][Shiro/org.apache.shiro:shiro-quartz][relativePath:support/quartz],
hudson.maven.MavenModule@24141978[Shiro/org.apache.shiro:shiro-root][Shiro/org.apache.shiro:shiro-root][relativePath:],
hudson.maven.MavenModule@20ba6b1b[Shiro/org.apache.shiro:shiro-spring][Shiro/org.apache.shiro:shiro-spring][relativePath:support/spring],
hudson.maven.MavenModule@3f2e5ae0[Shiro/org.apache.shiro:shiro-support][Shiro/org.apache.shiro:shiro-support][relativePath:support],
hudson.maven.MavenModule@4c98594d[Shiro/org.apache.shiro:shiro-web][Shiro/org.apache.shiro:shiro-web][relativePath:web],
hudson.maven.MavenModule@56d54467[Shiro/org.apache.shiro.samples:samples-aspectj][Shiro/org.apache.shiro.samples:samples-aspectj][relativePath:samples/aspectj],
hudson.maven.MavenModule@1d2533e4[Shiro/org.apache.shiro.samples:samples-quickstart][Shiro/org.apache.shiro.samples:samples-quickstart][relativePath:samples/quickstart],
hudson.maven.MavenModule@441b4cef[Shiro/org.apache.shiro.samples:samples-sprhib][Shiro/org.apache.shiro.samples:samples-sprhib][relativePath:samples/spring-hibernate],
hudson.maven.MavenModule@2767522b[Shiro/org.apache.shiro.samples:samples-spring][Shiro/org.apache.shiro.samples:samples-spring][relativePath:samples/spring],
hudson.maven.MavenModule@509ae0a1[Shiro/org.apache.shiro.samples:samples-spring-client][Shiro/org.apache.shiro.samples:samples-spring-client][relativePath:samples/spring-client],
hudson.maven.MavenModule@1c1cc63f[Shiro/org.apache.shiro.samples:samples-web][Shiro/org.apache.shiro.samples:samples-web][relativePath:samples/web],
hudson.maven.MavenModule@3eafdce[Shiro/org.apache.shiro.samples:shiro-samples][Shiro/org.apache.shiro.samples:shiro-samples][relativePath:samples],
hudson.maven.MavenModule@6722b643[Shiro/org.apache.shiro.tools:shiro-tools][Shiro/org.apache.shiro.tools:shiro-tools][relativePath:tools],
hudson.maven.MavenModule@10e47408[Shiro/org.apache.shiro.tools:shiro-tools-hasher][Shiro/org.apache.shiro.tools:shiro-tools-hasher][relativePath:tools/hasher]]
project.getRootModule()=hudson.maven.MavenModule@24141978[Shiro/org.apache.shiro:shiro-root][Shiro/org.apache.shiro:shiro-root][relativePath:]
FATAL: hudson.remoting.RequestAbortedException: hudson.remoting.Channel$OrderlyShutdown
hudson.remoting.RequestAbortedException: hudson.remoting.RequestAbortedException: hudson.remoting.Channel$OrderlyShutdown
	at hudson.remoting.Request.call(Request.java:149)
	at hudson.remoting.Channel.call(Channel.java:681)
	at hudson.remoting.RemoteInvocationHandler.invoke(RemoteInvocationHandler.java:158)
	at $Proxy24.join(Unknown Source)
	at hudson.Launcher$RemoteLauncher$ProcImpl.join(Launcher.java:850)
	at hudson.slaves.Channels$1.close(Channels.java:94)
	at hudson.maven.ProcessCache$MavenProcess.discard(ProcessCache.java:145)
	at hudson.maven.MavenModuleSetBuild$RunnerImpl.doRun(MavenModuleSetBuild.java:759)
	at hudson.model.AbstractBuild$AbstractRunner.run(AbstractBuild.java:459)
	at hudson.model.Run.run(Run.java:1376)
	at hudson.maven.MavenModuleSetBuild.run(MavenModuleSetBuild.java:474)
	at hudson.model.ResourceController.execute(ResourceController.java:88)
	at hudson.model.Executor.run(Executor.java:230)
Caused by: hudson.remoting.RequestAbortedException: hudson.remoting.Channel$OrderlyShutdown
	at hudson.remoting.Request.abort(Request.java:273)
	at hudson.remoting.Channel.terminate(Channel.java:732)
	at hudson.remoting.Channel$CloseCommand.execute(Channel.java:826)
	at hudson.remoting.Channel$ReaderThread.run(Channel.java:1106)
Caused by: hudson.remoting.Channel$OrderlyShutdown
	... 2 more
Caused by: Command close created at
	at hudson.remoting.Command.<init>(Command.java:62)
	at hudson.remoting.Command.<init>(Command.java:47)
	at hudson.remoting.Channel$CloseCommand.<init>(Channel.java:822)
	at hudson.remoting.Channel$CloseCommand.<init>(Channel.java:822)
	at hudson.remoting.Channel.close(Channel.java:867)
	at hudson.remoting.Channel$CloseCommand.execute(Channel.java:825)
	... 1 more


Mime
View raw message