shiro-commits mailing list archives

Site index · List index
Message view « Date » · « Thread »
Top « Date » · « Thread »
From Apache Jenkins Server <jenk...@builds.apache.org>
Subject Build failed in Jenkins: Shiro #372
Date Mon, 19 Nov 2012 01:38:22 GMT
See <https://builds.apache.org/job/Shiro/372/>

------------------------------------------
[...truncated 1276 lines...]
[trunk] $ /home/hudson/tools/java/latest1.6/bin/java -Xms128m -Xmx256m -XX:MaxPermSize=128m
-cp /home/hudson/hudson-slave/maven3-agent.jar:/home/hudson/tools/maven/latest/boot/plexus-classworlds-2.4.jar
org.jvnet.hudson.maven3.agent.Maven3Main /home/hudson/tools/maven/latest /home/hudson/hudson-slave/slave.jar
/home/hudson/hudson-slave/maven3-interceptor.jar 59397
<===[JENKINS REMOTING CAPACITY]===>channel started
   log4j:WARN No appenders could be found for logger (org.apache.commons.beanutils.converters.BooleanConverter).
log4j:WARN Please initialize the log4j system properly.
Executing Maven:  -B -f <https://builds.apache.org/job/Shiro/ws/trunk/pom.xml> -Dmaven.repo.local=/home/hudson/hudson-slave/maven-repositories/1
-Pdocs apache-rat:check deploy
[INFO] Scanning for projects...
[INFO] ------------------------------------------------------------------------
[INFO] Reactor Build Order:
[INFO] 
[INFO] Apache Shiro
[INFO] Apache Shiro :: Core
[INFO] Apache Shiro :: Web
[INFO] Apache Shiro :: Support :: AspectJ
[INFO] Apache Shiro :: Support :: EHCache
[INFO] Apache Shiro :: Support :: JSF
[INFO] Apache Shiro :: Support :: Quartz
[INFO] Apache Shiro :: Support :: Spring
[INFO] Apache Shiro :: Support :: Guice
[INFO] Apache Shiro :: Support :: OpenId4J
[INFO] Apache Shiro :: Support :: Karaf Features
[INFO] Apache Shiro :: Support :: CAS
[INFO] Apache Shiro :: Support
[INFO] Apache Shiro :: Samples
[INFO] Apache Shiro :: Samples :: AspectJ
[INFO] Apache Shiro :: Samples :: Quick Start
[INFO] Apache Shiro :: Samples :: Web
[INFO] Apache Shiro :: Samples :: Spring Client
[INFO] Apache Shiro :: Samples :: Spring
[INFO] Apache Shiro :: Samples :: Spring-Hibernate
[INFO] Apache Shiro :: Samples :: Guice Web
[INFO] Apache Shiro :: Samples :: Quick Start Guice
[INFO] Apache Shiro :: Tools
[INFO] Apache Shiro :: Tools :: Hasher
[INFO] Apache Shiro :: Jar Bundle
Projects to build: [MavenProject: org.apache.shiro:shiro-root:1.3.0-SNAPSHOT @ <https://builds.apache.org/job/Shiro/ws/trunk/pom.xml,>
MavenProject: org.apache.shiro:shiro-core:1.3.0-SNAPSHOT @ <https://builds.apache.org/job/Shiro/ws/trunk/core/pom.xml,>
MavenProject: org.apache.shiro:shiro-web:1.3.0-SNAPSHOT @ <https://builds.apache.org/job/Shiro/ws/trunk/web/pom.xml,>
MavenProject: org.apache.shiro:shiro-aspectj:1.3.0-SNAPSHOT @ <https://builds.apache.org/job/Shiro/ws/trunk/support/aspectj/pom.xml,>
MavenProject: org.apache.shiro:shiro-ehcache:1.3.0-SNAPSHOT @ <https://builds.apache.org/job/Shiro/ws/trunk/support/ehcache/pom.xml,>
MavenProject: org.apache.shiro:shiro-faces:1.3.0-SNAPSHOT @ <https://builds.apache.org/job/Shiro/ws/trunk/support/faces/pom.xml,>
MavenProject: org.apache.shiro:shiro-quartz:1.3.0-SNAPSHOT @ <https://builds.apache.org/job/Shiro/ws/trunk/support/quartz/pom.xml,>
MavenProject: org.apache.shiro:shiro-spring:1.3.0-SNAPSHOT @ <https://builds.apache.org/job/Shiro/ws/trunk/support/spring/pom.xml,>
MavenProject: org.apache.shiro:shiro-guice:1.3.0-SNAPSHOT @ <https://builds.apache.org/job/Shiro/ws/trunk/support/guice/pom.xml,>
MavenProject: org.apache.shiro:shiro-openid4j:1.3.0-SNAPSHOT @ <https://builds.apache.org/job/Shiro/ws/trunk/support/openid4j/pom.xml,>
MavenProject: org.apache.shiro:shiro-features:1.3.0-SNAPSHOT @ <https://builds.apache.org/job/Shiro/ws/trunk/support/features/pom.xml,>
MavenProject: org.apache.shiro:shiro-cas:1.3.0-SNAPSHOT @ <https://builds.apache.org/job/Shiro/ws/trunk/support/cas/pom.xml,>
MavenProject: org.apache.shiro:shiro-support:1.3.0-SNAPSHOT @ <https://builds.apache.org/job/Shiro/ws/trunk/support/pom.xml,>
MavenProject: org.apache.shiro.samples:shiro-samples:1.3.0-SNAPSHOT @ <https://builds.apache.org/job/Shiro/ws/trunk/samples/pom.xml,>
MavenProject: org.apache.shiro.samples:samples-aspectj:1.3.0-SNAPSHOT @ <https://builds.apache.org/job/Shiro/ws/trunk/samples/aspectj/pom.xml,>
MavenProject: org.apache.shiro.samples:samples-quickstart:1.3.0-SNAPSHOT @ <https://builds.apache.org/job/Shiro/ws/trunk/samples/quickstart/pom.xml,>
MavenProject: org.apache.shiro.samples:samples-web:1.3.0-SNAPSHOT @ <https://builds.apache.org/job/Shiro/ws/trunk/samples/web/pom.xml,>
MavenProject: org.apache.shiro.samples:samples-spring-client:1.3.0-SNAPSHOT @ <https://builds.apache.org/job/Shiro/ws/trunk/samples/spring-client/pom.xml,>
MavenProject: org.apache.shiro.samples:samples-spring:1.3.0-SNAPSHOT @ <https://builds.apache.org/job/Shiro/ws/trunk/samples/spring/pom.xml,>
MavenProject: org.apache.shiro.samples:samples-sprhib:1.3.0-SNAPSHOT @ <https://builds.apache.org/job/Shiro/ws/trunk/samples/spring-hibernate/pom.xml,>
MavenProject: org.apache.shiro.samples:samples-guice:1.3.0-SNAPSHOT @ <https://builds.apache.org/job/Shiro/ws/trunk/samples/guice/pom.xml,>
MavenProject: org.apache.shiro.samples:samples-quickstart-guice:1.3.0-SNAPSHOT @ <https://builds.apache.org/job/Shiro/ws/trunk/samples/quickstart-guice/pom.xml,>
MavenProject: org.apache.shiro.tools:shiro-tools:1.3.0-SNAPSHOT @ <https://builds.apache.org/job/Shiro/ws/trunk/tools/pom.xml,>
MavenProject: org.apache.shiro.tools:shiro-tools-hasher:1.3.0-SNAPSHOT @ <https://builds.apache.org/job/Shiro/ws/trunk/tools/hasher/pom.xml,>
MavenProject: org.apache.shiro:shiro-all:1.3.0-SNAPSHOT @ <https://builds.apache.org/job/Shiro/ws/trunk/all/pom.xml]>
projectStarted org.apache.shiro:shiro-root:1.3.0-SNAPSHOT
[INFO]                                                                         
[INFO] ------------------------------------------------------------------------
[INFO] Building Apache Shiro 1.3.0-SNAPSHOT
[INFO] ------------------------------------------------------------------------
Downloading: http://repo1.maven.org/maven2/org/codehaus/groovy/groovy-all/1.8.5/groovy-all-1.8.5.pom
Downloaded: http://repo1.maven.org/maven2/org/codehaus/groovy/groovy-all/1.8.5/groovy-all-1.8.5.pom
(30 KB at 93.7 KB/sec)
Downloading: http://repo1.maven.org/maven2/org/codehaus/groovy/groovy-all/1.8.5/groovy-all-1.8.5.jar
Downloaded: http://repo1.maven.org/maven2/org/codehaus/groovy/groovy-all/1.8.5/groovy-all-1.8.5.jar
(5996 KB at 7293.5 KB/sec)
mojoStarted org.apache.rat:apache-rat-plugin:0.8(default-cli)
[INFO] 
[INFO] --- apache-rat-plugin:0.8:check (default-cli) @ shiro-root ---
[INFO] Exclude: **/.externalToolBuilders/*
[INFO] Exclude: **/infinitest.filters
[INFO] Exclude: velocity.log
mojoSucceeded org.apache.rat:apache-rat-plugin:0.8(default-cli)
mojoStarted org.codehaus.mojo:buildnumber-maven-plugin:1.0(default)
[INFO] 
[INFO] --- buildnumber-maven-plugin:1.0:create (default) @ shiro-root ---
[INFO] Checking for local modifications: skipped.
[INFO] Updating project files from SCM: skipped.
[INFO] Executing: /bin/sh -c cd <https://builds.apache.org/job/Shiro/ws/trunk> &&
svn --non-interactive info
[INFO] Working directory: <https://builds.apache.org/job/Shiro/ws/trunk>
[INFO] Storing buildNumber: 1411039 at timestamp: 1353289070033
[INFO] Executing: /bin/sh -c cd <https://builds.apache.org/job/Shiro/ws/trunk> &&
svn --non-interactive info
[INFO] Working directory: <https://builds.apache.org/job/Shiro/ws/trunk>
[INFO] Storing buildScmBranch: trunk
mojoSucceeded org.codehaus.mojo:buildnumber-maven-plugin:1.0(default)
[INFO] Setting property: classpath.resource.loader.class => 'org.codehaus.plexus.velocity.ContextClassLoaderResourceLoader'.
[INFO] Setting property: velocimacro.messages.on => 'false'.
[INFO] Setting property: resource.loader => 'classpath'.
[INFO] Setting property: resource.manager.logwhenfound => 'false'.
mojoStarted org.apache.maven.plugins:maven-remote-resources-plugin:1.1(default)
[INFO] 
[INFO] --- maven-remote-resources-plugin:1.1:process (default) @ shiro-root ---
mojoSucceeded org.apache.maven.plugins:maven-remote-resources-plugin:1.1(default)
mojoStarted org.codehaus.gmaven:gmaven-plugin:1.4(default)Downloading: http://repo1.maven.org/maven2/org/codehaus/gmaven/runtime/gmaven-runtime-1.7/1.4/gmaven-runtime-1.7-1.4.pom

[INFO] 
[INFO] --- gmaven-plugin:1.4:compile (default) @ shiro-root ---
Downloaded: http://repo1.maven.org/maven2/org/codehaus/gmaven/runtime/gmaven-runtime-1.7/1.4/gmaven-runtime-1.7-1.4.pom
(4 KB at 39.1 KB/sec)
Downloading: http://repo1.maven.org/maven2/org/codehaus/gmaven/runtime/gmaven-runtime-1.7/1.4/gmaven-runtime-1.7-1.4.jar
Downloaded: http://repo1.maven.org/maven2/org/codehaus/gmaven/runtime/gmaven-runtime-1.7/1.4/gmaven-runtime-1.7-1.4.jar
(37 KB at 430.5 KB/sec)
Downloading: http://repo1.maven.org/maven2/org/codehaus/groovy/groovy-all/1.7.10/groovy-all-1.7.10.pom
Downloaded: http://repo1.maven.org/maven2/org/codehaus/groovy/groovy-all/1.7.10/groovy-all-1.7.10.pom
(27 KB at 152.6 KB/sec)
[INFO] No sources found to compile
mojoSucceeded org.codehaus.gmaven:gmaven-plugin:1.4(default)
mojoStarted org.codehaus.gmaven:gmaven-plugin:1.4(default)[INFO] No sources found to compile

[INFO] 
[INFO] --- gmaven-plugin:1.4:testCompile (default) @ shiro-root ---
mojoSucceeded org.codehaus.gmaven:gmaven-plugin:1.4(default)
mojoStarted org.apache.maven.plugins:maven-javadoc-plugin:2.8.1(attach-api-docs)
[INFO] 
[INFO] --- maven-javadoc-plugin:2.8.1:jar (attach-api-docs) @ shiro-root ---
[INFO] Not executing Javadoc as the project is not a Java classpath-capable package
mojoSucceeded org.apache.maven.plugins:maven-javadoc-plugin:2.8.1(attach-api-docs)
forkedProjectStarted org.apache.shiro:shiro-root:1.3.0-SNAPSHOT[INFO] Checking for local modifications:
skipped.
[INFO] Updating project files from SCM: skipped.
[INFO] Executing: /bin/sh -c cd <https://builds.apache.org/job/Shiro/ws/trunk> &&
svn --non-interactive info
[INFO] Working directory: <https://builds.apache.org/job/Shiro/ws/trunk>
[INFO] Storing buildNumber: 1411039 at timestamp: 1353289077665
[INFO] Executing: /bin/sh -c cd <https://builds.apache.org/job/Shiro/ws/trunk> &&
svn --non-interactive info
[INFO] Working directory: <https://builds.apache.org/job/Shiro/ws/trunk>
[INFO] Storing buildScmBranch: trunk

mojoStarted org.codehaus.mojo:buildnumber-maven-plugin:1.0(default)
[INFO] 
[INFO] --- buildnumber-maven-plugin:1.0:create (default) @ shiro-root ---
mojoSucceeded org.codehaus.mojo:buildnumber-maven-plugin:1.0(default)
forkedProjectSucceeded org.apache.shiro:shiro-root:1.3.0-SNAPSHOTNov 19, 2012 1:37:57 AM hudson.maven.ExecutedMojo
<init>
WARNING: Failed to getClass for org.apache.maven.plugin.source.SourceJarMojo

mojoStarted org.apache.maven.plugins:maven-source-plugin:2.0.4(attach-sources)
[INFO] 
[INFO] --- maven-source-plugin:2.0.4:jar (attach-sources) @ shiro-root ---
mojoSucceeded org.apache.maven.plugins:maven-source-plugin:2.0.4(attach-sources)
mojoStarted org.apache.maven.plugins:maven-install-plugin:2.3(default-install)[INFO] Installing
<https://builds.apache.org/job/Shiro/ws/trunk/pom.xml> to /home/hudson/hudson-slave/maven-repositories/1/org/apache/shiro/shiro-root/1.3.0-SNAPSHOT/shiro-root-1.3.0-SNAPSHOT.pom

[INFO] 
[INFO] --- maven-install-plugin:2.3:install (default-install) @ shiro-root ---
mojoSucceeded org.apache.maven.plugins:maven-install-plugin:2.3(default-install)
mojoStarted org.apache.maven.plugins:maven-deploy-plugin:2.5(default-deploy)Downloading: https://repository.apache.org/content/repositories/snapshots/org/apache/shiro/shiro-root/1.3.0-SNAPSHOT/maven-metadata.xml

[INFO] 
[INFO] --- maven-deploy-plugin:2.5:deploy (default-deploy) @ shiro-root ---
Downloaded: https://repository.apache.org/content/repositories/snapshots/org/apache/shiro/shiro-root/1.3.0-SNAPSHOT/maven-metadata.xml
(605 B at 0.9 KB/sec)
Uploading: https://repository.apache.org/content/repositories/snapshots/org/apache/shiro/shiro-root/1.3.0-SNAPSHOT/shiro-root-1.3.0-20121119.013759-26.pom
Uploaded: https://repository.apache.org/content/repositories/snapshots/org/apache/shiro/shiro-root/1.3.0-SNAPSHOT/shiro-root-1.3.0-20121119.013759-26.pom
(44 KB at 76.5 KB/sec)
Downloading: https://repository.apache.org/content/repositories/snapshots/org/apache/shiro/shiro-root/maven-metadata.xml
Downloaded: https://repository.apache.org/content/repositories/snapshots/org/apache/shiro/shiro-root/maven-metadata.xml
(526 B at 2.4 KB/sec)
Uploading: https://repository.apache.org/content/repositories/snapshots/org/apache/shiro/shiro-root/1.3.0-SNAPSHOT/maven-metadata.xml
Uploaded: https://repository.apache.org/content/repositories/snapshots/org/apache/shiro/shiro-root/1.3.0-SNAPSHOT/maven-metadata.xml
(605 B at 2.5 KB/sec)
Uploading: https://repository.apache.org/content/repositories/snapshots/org/apache/shiro/shiro-root/maven-metadata.xml
Uploaded: https://repository.apache.org/content/repositories/snapshots/org/apache/shiro/shiro-root/maven-metadata.xml
(526 B at 1.7 KB/sec)
mojoSucceeded org.apache.maven.plugins:maven-deploy-plugin:2.5(default-deploy)
projectSucceeded org.apache.shiro:shiro-root:1.3.0-SNAPSHOT
projectStarted org.apache.shiro:shiro-core:1.3.0-SNAPSHOT
[INFO]                                                                         
[INFO] ------------------------------------------------------------------------
[INFO] Building Apache Shiro :: Core 1.3.0-SNAPSHOT
[INFO] ------------------------------------------------------------------------
mojoStarted org.apache.rat:apache-rat-plugin:0.8(default-cli)[INFO] Exclude: **/.externalToolBuilders/*
[INFO] Exclude: **/infinitest.filters
[INFO] Exclude: velocity.log

[INFO] 
[INFO] --- apache-rat-plugin:0.8:check (default-cli) @ shiro-core ---
mojoFailed org.apache.rat:apache-rat-plugin:0.8(default-cli)
projectFailed org.apache.shiro:shiro-core:1.3.0-SNAPSHOT
sessionEnded
[INFO] ------------------------------------------------------------------------
[INFO] Reactor Summary:
[INFO] 
[INFO] Apache Shiro ...................................... SUCCESS [37.278s]
[INFO] Apache Shiro :: Core .............................. FAILURE [3.250s]
[INFO] Apache Shiro :: Web ............................... SKIPPED
[INFO] Apache Shiro :: Support :: AspectJ ................ SKIPPED
[INFO] Apache Shiro :: Support :: EHCache ................ SKIPPED
[INFO] Apache Shiro :: Support :: JSF .................... SKIPPED
[INFO] Apache Shiro :: Support :: Quartz ................. SKIPPED
[INFO] Apache Shiro :: Support :: Spring ................. SKIPPED
[INFO] Apache Shiro :: Support :: Guice .................. SKIPPED
[INFO] Apache Shiro :: Support :: OpenId4J ............... SKIPPED
[INFO] Apache Shiro :: Support :: Karaf Features ......... SKIPPED
[INFO] Apache Shiro :: Support :: CAS .................... SKIPPED
[INFO] Apache Shiro :: Support ........................... SKIPPED
[INFO] Apache Shiro :: Samples ........................... SKIPPED
[INFO] Apache Shiro :: Samples :: AspectJ ................ SKIPPED
[INFO] Apache Shiro :: Samples :: Quick Start ............ SKIPPED
[INFO] Apache Shiro :: Samples :: Web .................... SKIPPED
[INFO] Apache Shiro :: Samples :: Spring Client .......... SKIPPED
[INFO] Apache Shiro :: Samples :: Spring ................. SKIPPED
[INFO] Apache Shiro :: Samples :: Spring-Hibernate ....... SKIPPED
[INFO] Apache Shiro :: Samples :: Guice Web .............. SKIPPED
[INFO] Apache Shiro :: Samples :: Quick Start Guice ...... SKIPPED
[INFO] Apache Shiro :: Tools ............................. SKIPPED
[INFO] Apache Shiro :: Tools :: Hasher ................... SKIPPED
[INFO] Apache Shiro :: Jar Bundle ........................ SKIPPED
[INFO] ------------------------------------------------------------------------
[INFO] BUILD FAILURE
[INFO] ------------------------------------------------------------------------
[INFO] Total time: 45.474s
[INFO] Finished at: Mon Nov 19 01:38:04 UTC 2012
[INFO] Final Memory: 25M/159M
[INFO] ------------------------------------------------------------------------
Projects to build: [MavenProject: org.apache.shiro:shiro-root:1.3.0-SNAPSHOT @ <https://builds.apache.org/job/Shiro/ws/trunk/pom.xml,>
MavenProject: org.apache.shiro:shiro-core:1.3.0-SNAPSHOT @ <https://builds.apache.org/job/Shiro/ws/trunk/core/pom.xml,>
MavenProject: org.apache.shiro:shiro-web:1.3.0-SNAPSHOT @ <https://builds.apache.org/job/Shiro/ws/trunk/web/pom.xml,>
MavenProject: org.apache.shiro:shiro-aspectj:1.3.0-SNAPSHOT @ <https://builds.apache.org/job/Shiro/ws/trunk/support/aspectj/pom.xml,>
MavenProject: org.apache.shiro:shiro-ehcache:1.3.0-SNAPSHOT @ <https://builds.apache.org/job/Shiro/ws/trunk/support/ehcache/pom.xml,>
MavenProject: org.apache.shiro:shiro-faces:1.3.0-SNAPSHOT @ <https://builds.apache.org/job/Shiro/ws/trunk/support/faces/pom.xml,>
MavenProject: org.apache.shiro:shiro-quartz:1.3.0-SNAPSHOT @ <https://builds.apache.org/job/Shiro/ws/trunk/support/quartz/pom.xml,>
MavenProject: org.apache.shiro:shiro-spring:1.3.0-SNAPSHOT @ <https://builds.apache.org/job/Shiro/ws/trunk/support/spring/pom.xml,>
MavenProject: org.apache.shiro:shiro-guice:1.3.0-SNAPSHOT @ <https://builds.apache.org/job/Shiro/ws/trunk/support/guice/pom.xml,>
MavenProject: org.apache.shiro:shiro-openid4j:1.3.0-SNAPSHOT @ <https://builds.apache.org/job/Shiro/ws/trunk/support/openid4j/pom.xml,>
MavenProject: org.apache.shiro:shiro-features:1.3.0-SNAPSHOT @ <https://builds.apache.org/job/Shiro/ws/trunk/support/features/pom.xml,>
MavenProject: org.apache.shiro:shiro-cas:1.3.0-SNAPSHOT @ <https://builds.apache.org/job/Shiro/ws/trunk/support/cas/pom.xml,>
MavenProject: org.apache.shiro:shiro-support:1.3.0-SNAPSHOT @ <https://builds.apache.org/job/Shiro/ws/trunk/support/pom.xml,>
MavenProject: org.apache.shiro.samples:shiro-samples:1.3.0-SNAPSHOT @ <https://builds.apache.org/job/Shiro/ws/trunk/samples/pom.xml,>
MavenProject: org.apache.shiro.samples:samples-aspectj:1.3.0-SNAPSHOT @ <https://builds.apache.org/job/Shiro/ws/trunk/samples/aspectj/pom.xml,>
MavenProject: org.apache.shiro.samples:samples-quickstart:1.3.0-SNAPSHOT @ <https://builds.apache.org/job/Shiro/ws/trunk/samples/quickstart/pom.xml,>
MavenProject: org.apache.shiro.samples:samples-web:1.3.0-SNAPSHOT @ <https://builds.apache.org/job/Shiro/ws/trunk/samples/web/pom.xml,>
MavenProject: org.apache.shiro.samples:samples-spring-client:1.3.0-SNAPSHOT @ <https://builds.apache.org/job/Shiro/ws/trunk/samples/spring-client/pom.xml,>
MavenProject: org.apache.shiro.samples:samples-spring:1.3.0-SNAPSHOT @ <https://builds.apache.org/job/Shiro/ws/trunk/samples/spring/pom.xml,>
MavenProject: org.apache.shiro.samples:samples-sprhib:1.3.0-SNAPSHOT @ <https://builds.apache.org/job/Shiro/ws/trunk/samples/spring-hibernate/pom.xml,>
MavenProject: org.apache.shiro.samples:samples-guice:1.3.0-SNAPSHOT @ <https://builds.apache.org/job/Shiro/ws/trunk/samples/guice/pom.xml,>
MavenProject: org.apache.shiro.samples:samples-quickstart-guice:1.3.0-SNAPSHOT @ <https://builds.apache.org/job/Shiro/ws/trunk/samples/quickstart-guice/pom.xml,>
MavenProject: org.apache.shiro.tools:shiro-tools:1.3.0-SNAPSHOT @ <https://builds.apache.org/job/Shiro/ws/trunk/tools/pom.xml,>
MavenProject: org.apache.shiro.tools:shiro-tools-hasher:1.3.0-SNAPSHOT @ <https://builds.apache.org/job/Shiro/ws/trunk/tools/hasher/pom.xml,>
MavenProject: org.apache.shiro:shiro-all:1.3.0-SNAPSHOT @ <https://builds.apache.org/job/Shiro/ws/trunk/all/pom.xml]>
[JENKINS] Archiving <https://builds.apache.org/job/Shiro/ws/trunk/web/pom.xml> to /home/hudson/hudson/jobs/Shiro/modules/org.apache.shiro$shiro-web/builds/2012-11-19_01-37-05/archive/org.apache.shiro/shiro-web/1.3.0-SNAPSHOT/shiro-web-1.3.0-SNAPSHOT.pom
[JENKINS] Archiving <https://builds.apache.org/job/Shiro/ws/trunk/core/pom.xml> to /home/hudson/hudson/jobs/Shiro/modules/org.apache.shiro$shiro-core/builds/2012-11-19_01-37-05/archive/org.apache.shiro/shiro-core/1.3.0-SNAPSHOT/shiro-core-1.3.0-SNAPSHOT.pom
[JENKINS] Archiving <https://builds.apache.org/job/Shiro/ws/trunk/tools/pom.xml> to
/home/hudson/hudson/jobs/Shiro/modules/org.apache.shiro.tools$shiro-tools/builds/2012-11-19_01-37-06/archive/org.apache.shiro.tools/shiro-tools/1.3.0-SNAPSHOT/shiro-tools-1.3.0-SNAPSHOT.pom
[JENKINS] Archiving <https://builds.apache.org/job/Shiro/ws/trunk/all/pom.xml> to /home/hudson/hudson/jobs/Shiro/modules/org.apache.shiro$shiro-all/builds/2012-11-19_01-37-06/archive/org.apache.shiro/shiro-all/1.3.0-SNAPSHOT/shiro-all-1.3.0-SNAPSHOT.pom
[JENKINS] Archiving <https://builds.apache.org/job/Shiro/ws/trunk/support/features/pom.xml>
to /home/hudson/hudson/jobs/Shiro/modules/org.apache.shiro$shiro-features/builds/2012-11-19_01-37-05/archive/org.apache.shiro/shiro-features/1.3.0-SNAPSHOT/shiro-features-1.3.0-SNAPSHOT.pom
[JENKINS] Archiving <https://builds.apache.org/job/Shiro/ws/trunk/samples/pom.xml> to
/home/hudson/hudson/jobs/Shiro/modules/org.apache.shiro.samples$shiro-samples/builds/2012-11-19_01-37-05/archive/org.apache.shiro.samples/shiro-samples/1.3.0-SNAPSHOT/shiro-samples-1.3.0-SNAPSHOT.pom
[JENKINS] Archiving <https://builds.apache.org/job/Shiro/ws/trunk/samples/quickstart/pom.xml>
to /home/hudson/hudson/jobs/Shiro/modules/org.apache.shiro.samples$samples-quickstart/builds/2012-11-19_01-37-06/archive/org.apache.shiro.samples/samples-quickstart/1.3.0-SNAPSHOT/samples-quickstart-1.3.0-SNAPSHOT.pom
[JENKINS] Archiving <https://builds.apache.org/job/Shiro/ws/trunk/support/pom.xml> to
/home/hudson/hudson/jobs/Shiro/modules/org.apache.shiro$shiro-support/builds/2012-11-19_01-37-05/archive/org.apache.shiro/shiro-support/1.3.0-SNAPSHOT/shiro-support-1.3.0-SNAPSHOT.pom
[JENKINS] Archiving <https://builds.apache.org/job/Shiro/ws/trunk/support/quartz/pom.xml>
to /home/hudson/hudson/jobs/Shiro/modules/org.apache.shiro$shiro-quartz/builds/2012-11-19_01-37-05/archive/org.apache.shiro/shiro-quartz/1.3.0-SNAPSHOT/shiro-quartz-1.3.0-SNAPSHOT.pom
[JENKINS] Archiving <https://builds.apache.org/job/Shiro/ws/trunk/support/openid4j/pom.xml>
to /home/hudson/hudson/jobs/Shiro/modules/org.apache.shiro$shiro-openid4j/builds/2012-11-19_01-37-05/archive/org.apache.shiro/shiro-openid4j/1.3.0-SNAPSHOT/shiro-openid4j-1.3.0-SNAPSHOT.pom
[JENKINS] Archiving <https://builds.apache.org/job/Shiro/ws/trunk/tools/hasher/pom.xml>
to /home/hudson/hudson/jobs/Shiro/modules/org.apache.shiro.tools$shiro-tools-hasher/builds/2012-11-19_01-37-06/archive/org.apache.shiro.tools/shiro-tools-hasher/1.3.0-SNAPSHOT/shiro-tools-hasher-1.3.0-SNAPSHOT.pom
[JENKINS] Archiving <https://builds.apache.org/job/Shiro/ws/trunk/support/aspectj/pom.xml>
to /home/hudson/hudson/jobs/Shiro/modules/org.apache.shiro$shiro-aspectj/builds/2012-11-19_01-37-05/archive/org.apache.shiro/shiro-aspectj/1.3.0-SNAPSHOT/shiro-aspectj-1.3.0-SNAPSHOT.pom
[JENKINS] Archiving <https://builds.apache.org/job/Shiro/ws/trunk/samples/aspectj/pom.xml>
to /home/hudson/hudson/jobs/Shiro/modules/org.apache.shiro.samples$samples-aspectj/builds/2012-11-19_01-37-06/archive/org.apache.shiro.samples/samples-aspectj/1.3.0-SNAPSHOT/samples-aspectj-1.3.0-SNAPSHOT.pom
[JENKINS] Archiving <https://builds.apache.org/job/Shiro/ws/trunk/support/spring/pom.xml>
to /home/hudson/hudson/jobs/Shiro/modules/org.apache.shiro$shiro-spring/builds/2012-11-19_01-37-05/archive/org.apache.shiro/shiro-spring/1.3.0-SNAPSHOT/shiro-spring-1.3.0-SNAPSHOT.pom
[JENKINS] Archiving <https://builds.apache.org/job/Shiro/ws/trunk/samples/spring-client/pom.xml>
to /home/hudson/hudson/jobs/Shiro/modules/org.apache.shiro.samples$samples-spring-client/builds/2012-11-19_01-37-06/archive/org.apache.shiro.samples/samples-spring-client/1.3.0-SNAPSHOT/samples-spring-client-1.3.0-SNAPSHOT.pom
[JENKINS] Archiving <https://builds.apache.org/job/Shiro/ws/trunk/samples/web/pom.xml>
to /home/hudson/hudson/jobs/Shiro/modules/org.apache.shiro.samples$samples-web/builds/2012-11-19_01-37-06/archive/org.apache.shiro.samples/samples-web/1.3.0-SNAPSHOT/samples-web-1.3.0-SNAPSHOT.pom
[JENKINS] Archiving <https://builds.apache.org/job/Shiro/ws/trunk/samples/quickstart-guice/pom.xml>
to /home/hudson/hudson/jobs/Shiro/modules/org.apache.shiro.samples$samples-quickstart-guice/builds/2012-11-19_01-37-06/archive/org.apache.shiro.samples/samples-quickstart-guice/1.3.0-SNAPSHOT/samples-quickstart-guice-1.3.0-SNAPSHOT.pom
[JENKINS] Archiving <https://builds.apache.org/job/Shiro/ws/trunk/samples/spring/pom.xml>
to /home/hudson/hudson/jobs/Shiro/modules/org.apache.shiro.samples$samples-spring/builds/2012-11-19_01-37-06/archive/org.apache.shiro.samples/samples-spring/1.3.0-SNAPSHOT/samples-spring-1.3.0-SNAPSHOT.pom
[JENKINS] Archiving <https://builds.apache.org/job/Shiro/ws/trunk/support/cas/pom.xml>
to /home/hudson/hudson/jobs/Shiro/modules/org.apache.shiro$shiro-cas/builds/2012-11-19_01-37-05/archive/org.apache.shiro/shiro-cas/1.3.0-SNAPSHOT/shiro-cas-1.3.0-SNAPSHOT.pom
[JENKINS] Archiving <https://builds.apache.org/job/Shiro/ws/trunk/pom.xml> to /home/hudson/hudson/jobs/Shiro/modules/org.apache.shiro$shiro-root/builds/2012-11-19_01-37-05/archive/org.apache.shiro/shiro-root/1.3.0-SNAPSHOT/shiro-root-1.3.0-SNAPSHOT.pom
[JENKINS] Archiving <https://builds.apache.org/job/Shiro/ws/trunk/support/ehcache/pom.xml>
to /home/hudson/hudson/jobs/Shiro/modules/org.apache.shiro$shiro-ehcache/builds/2012-11-19_01-37-05/archive/org.apache.shiro/shiro-ehcache/1.3.0-SNAPSHOT/shiro-ehcache-1.3.0-SNAPSHOT.pom
[JENKINS] Archiving <https://builds.apache.org/job/Shiro/ws/trunk/samples/guice/pom.xml>
to /home/hudson/hudson/jobs/Shiro/modules/org.apache.shiro.samples$samples-guice/builds/2012-11-19_01-37-06/archive/org.apache.shiro.samples/samples-guice/1.3.0-SNAPSHOT/samples-guice-1.3.0-SNAPSHOT.pom
[JENKINS] Archiving <https://builds.apache.org/job/Shiro/ws/trunk/support/faces/pom.xml>
to /home/hudson/hudson/jobs/Shiro/modules/org.apache.shiro$shiro-faces/builds/2012-11-19_01-37-05/archive/org.apache.shiro/shiro-faces/1.3.0-SNAPSHOT/shiro-faces-1.3.0-SNAPSHOT.pom
[JENKINS] Archiving <https://builds.apache.org/job/Shiro/ws/trunk/samples/spring-hibernate/pom.xml>
to /home/hudson/hudson/jobs/Shiro/modules/org.apache.shiro.samples$samples-sprhib/builds/2012-11-19_01-37-06/archive/org.apache.shiro.samples/samples-sprhib/1.3.0-SNAPSHOT/samples-sprhib-1.3.0-SNAPSHOT.pom
[JENKINS] Archiving <https://builds.apache.org/job/Shiro/ws/trunk/support/guice/pom.xml>
to /home/hudson/hudson/jobs/Shiro/modules/org.apache.shiro$shiro-guice/builds/2012-11-19_01-37-05/archive/org.apache.shiro/shiro-guice/1.3.0-SNAPSHOT/shiro-guice-1.3.0-SNAPSHOT.pom
Waiting for Jenkins to finish collecting data
mavenExecutionResult exceptions not empty
message : Failed to execute goal org.apache.rat:apache-rat-plugin:0.8:check (default-cli)
on project shiro-core: Too many unapproved licenses: 10
cause : Too many unapproved licenses: 10
Stack trace : 
org.apache.maven.lifecycle.LifecycleExecutionException: Failed to execute goal org.apache.rat:apache-rat-plugin:0.8:check
(default-cli) on project shiro-core: Too many unapproved licenses: 10
	at org.apache.maven.lifecycle.internal.MojoExecutor.execute(MojoExecutor.java:213)
	at org.apache.maven.lifecycle.internal.MojoExecutor.execute(MojoExecutor.java:153)
	at org.apache.maven.lifecycle.internal.MojoExecutor.execute(MojoExecutor.java:145)
	at org.apache.maven.lifecycle.internal.LifecycleModuleBuilder.buildProject(LifecycleModuleBuilder.java:84)
	at org.apache.maven.lifecycle.internal.LifecycleModuleBuilder.buildProject(LifecycleModuleBuilder.java:59)
	at org.apache.maven.lifecycle.internal.LifecycleStarter.singleThreadedBuild(LifecycleStarter.java:183)
	at org.apache.maven.lifecycle.internal.LifecycleStarter.execute(LifecycleStarter.java:161)
	at org.apache.maven.DefaultMaven.doExecute(DefaultMaven.java:319)
	at org.apache.maven.DefaultMaven.execute(DefaultMaven.java:156)
	at org.jvnet.hudson.maven3.launcher.Maven3Launcher.main(Maven3Launcher.java:79)
	at sun.reflect.NativeMethodAccessorImpl.invoke0(Native Method)
	at sun.reflect.NativeMethodAccessorImpl.invoke(NativeMethodAccessorImpl.java:39)
	at sun.reflect.DelegatingMethodAccessorImpl.invoke(DelegatingMethodAccessorImpl.java:25)
	at java.lang.reflect.Method.invoke(Method.java:597)
	at org.codehaus.plexus.classworlds.launcher.Launcher.launchStandard(Launcher.java:329)
	at org.codehaus.plexus.classworlds.launcher.Launcher.launch(Launcher.java:239)
	at org.jvnet.hudson.maven3.agent.Maven3Main.launch(Maven3Main.java:158)
	at hudson.maven.Maven3Builder.call(Maven3Builder.java:98)
	at hudson.maven.Maven3Builder.call(Maven3Builder.java:64)
	at hudson.remoting.UserRequest.perform(UserRequest.java:118)
	at hudson.remoting.UserRequest.perform(UserRequest.java:48)
	at hudson.remoting.Request$2.run(Request.java:326)
	at hudson.remoting.InterceptingExecutorService$1.call(InterceptingExecutorService.java:72)
	at java.util.concurrent.FutureTask$Sync.innerRun(FutureTask.java:303)
	at java.util.concurrent.FutureTask.run(FutureTask.java:138)
	at java.util.concurrent.ThreadPoolExecutor$Worker.runTask(ThreadPoolExecutor.java:886)
	at java.util.concurrent.ThreadPoolExecutor$Worker.run(ThreadPoolExecutor.java:908)
	at java.lang.Thread.run(Thread.java:662)
Caused by: org.apache.rat.mp.RatCheckException: Too many unapproved licenses: 10
	at org.apache.rat.mp.RatCheckMojo.check(RatCheckMojo.java:167)
	at org.apache.rat.mp.RatCheckMojo.execute(RatCheckMojo.java:159)
	at org.apache.maven.plugin.DefaultBuildPluginManager.executeMojo(DefaultBuildPluginManager.java:101)
	at org.apache.maven.lifecycle.internal.MojoExecutor.execute(MojoExecutor.java:209)
	... 27 more
Sending e-mails to: commits@shiro.apache.org
channel stopped

Mime
View raw message