shiro-commits mailing list archives

Site index · List index
Message view « Date » · « Thread »
Top « Date » · « Thread »
From Apache Jenkins Server <jenk...@builds.apache.org>
Subject Build failed in Jenkins: Shiro-1.2.x » Apache Shiro :: Samples :: Web #9
Date Mon, 21 Mar 2016 18:55:54 GMT
See <https://builds.apache.org/job/Shiro-1.2.x/org.apache.shiro.samples$samples-web/9/>

------------------------------------------
[...truncated 4 lines...]
[INFO] [apache-rat:check {execution: default-cli}]
[INFO] 51 implicit excludes (use -debug for more details).
[INFO] Exclude: **/.externalToolBuilders/*
[INFO] Exclude: **/infinitest.filters
[INFO] Exclude: velocity.log
[INFO] 12 resources included (use -debug for more details)
Warning:  org.apache.xerces.jaxp.SAXParserImpl$JAXPSAXParser: Property 'http://www.oracle.com/xml/jaxp/properties/entityExpansionLimit'
is not recognized.
Compiler warnings:
  WARNING:  'org.apache.xerces.jaxp.SAXParserImpl: Property 'http://javax.xml.XMLConstants/property/accessExternalDTD'
is not recognized.'
Warning:  org.apache.xerces.parsers.SAXParser: Feature 'http://javax.xml.XMLConstants/feature/secure-processing'
is not recognized.
Warning:  org.apache.xerces.parsers.SAXParser: Property 'http://javax.xml.XMLConstants/property/accessExternalDTD'
is not recognized.
Warning:  org.apache.xerces.parsers.SAXParser: Property 'http://www.oracle.com/xml/jaxp/properties/entityExpansionLimit'
is not recognized.
[INFO] Rat check: Summary of files. Unapproved: 0 unknown: 0 generated: 0 approved: 12 licence.
[INFO] [buildnumber:create {execution: default}]
[INFO] Executing: /bin/sh -c cd '<https://builds.apache.org/job/Shiro-1.2.x/org.apache.shiro.samples$samples-web/ws/'>
&& 'git' 'rev-parse' '--verify' 'HEAD'
[INFO] Executing: /bin/sh -c cd '<https://builds.apache.org/job/Shiro-1.2.x/org.apache.shiro.samples$samples-web/ws/'>
&& 'git' 'rev-parse' '--verify' 'HEAD'
[INFO] Executing: /bin/sh -c cd '<https://builds.apache.org/job/Shiro-1.2.x/org.apache.shiro.samples$samples-web/ws/'>
&& 'git' 'rev-parse' '--verify' 'HEAD'
[INFO] Executing: /bin/sh -c cd '<https://builds.apache.org/job/Shiro-1.2.x/org.apache.shiro.samples$samples-web/ws/'>
&& 'git' 'rev-parse' '--verify' 'HEAD'
[INFO] Executing: /bin/sh -c cd '<https://builds.apache.org/job/Shiro-1.2.x/org.apache.shiro.samples$samples-web/ws/'>
&& 'git' 'rev-parse' '--verify' 'HEAD'
[INFO] Executing: /bin/sh -c cd '<https://builds.apache.org/job/Shiro-1.2.x/org.apache.shiro.samples$samples-web/ws/'>
&& 'git' 'rev-parse' '--verify' 'HEAD'
[INFO] Executing: /bin/sh -c cd '<https://builds.apache.org/job/Shiro-1.2.x/org.apache.shiro.samples$samples-web/ws/'>
&& 'git' 'rev-parse' '--verify' 'HEAD'
[INFO] Executing: /bin/sh -c cd '<https://builds.apache.org/job/Shiro-1.2.x/org.apache.shiro.samples$samples-web/ws/'>
&& 'git' 'rev-parse' '--verify' 'HEAD'
[INFO] Executing: /bin/sh -c cd '<https://builds.apache.org/job/Shiro-1.2.x/org.apache.shiro.samples$samples-web/ws/'>
&& 'git' 'rev-parse' '--verify' 'HEAD'
[INFO] Executing: /bin/sh -c cd '<https://builds.apache.org/job/Shiro-1.2.x/org.apache.shiro.samples$samples-web/ws/'>
&& 'git' 'rev-parse' '--verify' 'HEAD'
[INFO] Executing: /bin/sh -c cd '<https://builds.apache.org/job/Shiro-1.2.x/org.apache.shiro.samples$samples-web/ws/'>
&& 'git' 'rev-parse' '--verify' 'HEAD'
[INFO] Executing: /bin/sh -c cd '<https://builds.apache.org/job/Shiro-1.2.x/org.apache.shiro.samples$samples-web/ws/'>
&& 'git' 'rev-parse' '--verify' 'HEAD'
[INFO] Executing: /bin/sh -c cd '<https://builds.apache.org/job/Shiro-1.2.x/org.apache.shiro.samples$samples-web/ws/'>
&& 'git' 'rev-parse' '--verify' 'HEAD'
[INFO] Executing: /bin/sh -c cd '<https://builds.apache.org/job/Shiro-1.2.x/org.apache.shiro.samples$samples-web/ws/'>
&& 'git' 'rev-parse' '--verify' 'HEAD'
[INFO] Executing: /bin/sh -c cd '<https://builds.apache.org/job/Shiro-1.2.x/org.apache.shiro.samples$samples-web/ws/'>
&& 'git' 'rev-parse' '--verify' 'HEAD'
[INFO] Executing: /bin/sh -c cd '<https://builds.apache.org/job/Shiro-1.2.x/org.apache.shiro.samples$samples-web/ws/'>
&& 'git' 'rev-parse' '--verify' 'HEAD'
[INFO] Executing: /bin/sh -c cd '<https://builds.apache.org/job/Shiro-1.2.x/org.apache.shiro.samples$samples-web/ws/'>
&& 'git' 'rev-parse' '--verify' 'HEAD'
[INFO] Executing: /bin/sh -c cd '<https://builds.apache.org/job/Shiro-1.2.x/org.apache.shiro.samples$samples-web/ws/'>
&& 'git' 'rev-parse' '--verify' 'HEAD'
[INFO] Executing: /bin/sh -c cd '<https://builds.apache.org/job/Shiro-1.2.x/org.apache.shiro.samples$samples-web/ws/'>
&& 'git' 'rev-parse' '--verify' 'HEAD'
[INFO] Executing: /bin/sh -c cd '<https://builds.apache.org/job/Shiro-1.2.x/org.apache.shiro.samples$samples-web/ws/'>
&& 'git' 'rev-parse' '--verify' 'HEAD'
[INFO] Executing: /bin/sh -c cd '<https://builds.apache.org/job/Shiro-1.2.x/org.apache.shiro.samples$samples-web/ws/'>
&& 'git' 'rev-parse' '--verify' 'HEAD'
[INFO] Executing: /bin/sh -c cd '<https://builds.apache.org/job/Shiro-1.2.x/org.apache.shiro.samples$samples-web/ws/'>
&& 'git' 'rev-parse' '--verify' 'HEAD'
[INFO] Executing: /bin/sh -c cd '<https://builds.apache.org/job/Shiro-1.2.x/org.apache.shiro.samples$samples-web/ws/'>
&& 'git' 'rev-parse' '--verify' 'HEAD'
[INFO] Executing: /bin/sh -c cd '<https://builds.apache.org/job/Shiro-1.2.x/org.apache.shiro.samples$samples-web/ws/'>
&& 'git' 'rev-parse' '--verify' 'HEAD'
[INFO] Executing: /bin/sh -c cd '<https://builds.apache.org/job/Shiro-1.2.x/org.apache.shiro.samples$samples-web/ws/'>
&& 'git' 'rev-parse' '--verify' 'HEAD'
[INFO] Executing: /bin/sh -c cd '<https://builds.apache.org/job/Shiro-1.2.x/org.apache.shiro.samples$samples-web/ws/'>
&& 'git' 'rev-parse' '--verify' 'HEAD'
[INFO] Executing: /bin/sh -c cd '<https://builds.apache.org/job/Shiro-1.2.x/org.apache.shiro.samples$samples-web/ws/'>
&& 'git' 'rev-parse' '--verify' 'HEAD'
[INFO] Executing: /bin/sh -c cd '<https://builds.apache.org/job/Shiro-1.2.x/org.apache.shiro.samples$samples-web/ws/'>
&& 'git' 'rev-parse' '--verify' 'HEAD'
[INFO] Executing: /bin/sh -c cd '<https://builds.apache.org/job/Shiro-1.2.x/org.apache.shiro.samples$samples-web/ws/'>
&& 'git' 'rev-parse' '--verify' 'HEAD'
[INFO] Working directory: <https://builds.apache.org/job/Shiro-1.2.x/org.apache.shiro.samples$samples-web/ws/>
[INFO] Working directory: <https://builds.apache.org/job/Shiro-1.2.x/org.apache.shiro.samples$samples-web/ws/>
[INFO] Working directory: <https://builds.apache.org/job/Shiro-1.2.x/org.apache.shiro.samples$samples-web/ws/>
[INFO] Working directory: <https://builds.apache.org/job/Shiro-1.2.x/org.apache.shiro.samples$samples-web/ws/>
[INFO] Working directory: <https://builds.apache.org/job/Shiro-1.2.x/org.apache.shiro.samples$samples-web/ws/>
[INFO] Working directory: <https://builds.apache.org/job/Shiro-1.2.x/org.apache.shiro.samples$samples-web/ws/>
[INFO] Working directory: <https://builds.apache.org/job/Shiro-1.2.x/org.apache.shiro.samples$samples-web/ws/>
[INFO] Working directory: <https://builds.apache.org/job/Shiro-1.2.x/org.apache.shiro.samples$samples-web/ws/>
[INFO] Working directory: <https://builds.apache.org/job/Shiro-1.2.x/org.apache.shiro.samples$samples-web/ws/>
[INFO] Working directory: <https://builds.apache.org/job/Shiro-1.2.x/org.apache.shiro.samples$samples-web/ws/>
[INFO] Working directory: <https://builds.apache.org/job/Shiro-1.2.x/org.apache.shiro.samples$samples-web/ws/>
[INFO] Working directory: <https://builds.apache.org/job/Shiro-1.2.x/org.apache.shiro.samples$samples-web/ws/>
[INFO] Working directory: <https://builds.apache.org/job/Shiro-1.2.x/org.apache.shiro.samples$samples-web/ws/>
[INFO] Working directory: <https://builds.apache.org/job/Shiro-1.2.x/org.apache.shiro.samples$samples-web/ws/>
[INFO] Working directory: <https://builds.apache.org/job/Shiro-1.2.x/org.apache.shiro.samples$samples-web/ws/>
[INFO] Working directory: <https://builds.apache.org/job/Shiro-1.2.x/org.apache.shiro.samples$samples-web/ws/>
[INFO] Working directory: <https://builds.apache.org/job/Shiro-1.2.x/org.apache.shiro.samples$samples-web/ws/>
[INFO] Working directory: <https://builds.apache.org/job/Shiro-1.2.x/org.apache.shiro.samples$samples-web/ws/>
[INFO] Working directory: <https://builds.apache.org/job/Shiro-1.2.x/org.apache.shiro.samples$samples-web/ws/>
[INFO] Working directory: <https://builds.apache.org/job/Shiro-1.2.x/org.apache.shiro.samples$samples-web/ws/>
[INFO] Working directory: <https://builds.apache.org/job/Shiro-1.2.x/org.apache.shiro.samples$samples-web/ws/>
[INFO] Working directory: <https://builds.apache.org/job/Shiro-1.2.x/org.apache.shiro.samples$samples-web/ws/>
[INFO] Working directory: <https://builds.apache.org/job/Shiro-1.2.x/org.apache.shiro.samples$samples-web/ws/>
[INFO] Working directory: <https://builds.apache.org/job/Shiro-1.2.x/org.apache.shiro.samples$samples-web/ws/>
[INFO] Working directory: <https://builds.apache.org/job/Shiro-1.2.x/org.apache.shiro.samples$samples-web/ws/>
[INFO] Working directory: <https://builds.apache.org/job/Shiro-1.2.x/org.apache.shiro.samples$samples-web/ws/>
[INFO] Working directory: <https://builds.apache.org/job/Shiro-1.2.x/org.apache.shiro.samples$samples-web/ws/>
[INFO] Working directory: <https://builds.apache.org/job/Shiro-1.2.x/org.apache.shiro.samples$samples-web/ws/>
[INFO] Working directory: <https://builds.apache.org/job/Shiro-1.2.x/org.apache.shiro.samples$samples-web/ws/>
[INFO] Storing buildNumber: 7e4c1f0140a040ef85ded0e3476320517c5d0dd0 at timestamp: 1458586544450
[WARNING] Cannot get the branch information from the git repository: 
Detecting the current branch failed: fatal: ref HEAD is not a symbolic ref

[INFO] Executing: /bin/sh -c cd '<https://builds.apache.org/job/Shiro-1.2.x/org.apache.shiro.samples$samples-web/ws/'>
&& 'git' 'rev-parse' '--verify' 'HEAD'
[INFO] Executing: /bin/sh -c cd '<https://builds.apache.org/job/Shiro-1.2.x/org.apache.shiro.samples$samples-web/ws/'>
&& 'git' 'rev-parse' '--verify' 'HEAD'
[INFO] Executing: /bin/sh -c cd '<https://builds.apache.org/job/Shiro-1.2.x/org.apache.shiro.samples$samples-web/ws/'>
&& 'git' 'rev-parse' '--verify' 'HEAD'
[INFO] Executing: /bin/sh -c cd '<https://builds.apache.org/job/Shiro-1.2.x/org.apache.shiro.samples$samples-web/ws/'>
&& 'git' 'rev-parse' '--verify' 'HEAD'
[INFO] Executing: /bin/sh -c cd '<https://builds.apache.org/job/Shiro-1.2.x/org.apache.shiro.samples$samples-web/ws/'>
&& 'git' 'rev-parse' '--verify' 'HEAD'
[INFO] Executing: /bin/sh -c cd '<https://builds.apache.org/job/Shiro-1.2.x/org.apache.shiro.samples$samples-web/ws/'>
&& 'git' 'rev-parse' '--verify' 'HEAD'
[INFO] Executing: /bin/sh -c cd '<https://builds.apache.org/job/Shiro-1.2.x/org.apache.shiro.samples$samples-web/ws/'>
&& 'git' 'rev-parse' '--verify' 'HEAD'
[INFO] Executing: /bin/sh -c cd '<https://builds.apache.org/job/Shiro-1.2.x/org.apache.shiro.samples$samples-web/ws/'>
&& 'git' 'rev-parse' '--verify' 'HEAD'
[INFO] Executing: /bin/sh -c cd '<https://builds.apache.org/job/Shiro-1.2.x/org.apache.shiro.samples$samples-web/ws/'>
&& 'git' 'rev-parse' '--verify' 'HEAD'
[INFO] Executing: /bin/sh -c cd '<https://builds.apache.org/job/Shiro-1.2.x/org.apache.shiro.samples$samples-web/ws/'>
&& 'git' 'rev-parse' '--verify' 'HEAD'
[INFO] Executing: /bin/sh -c cd '<https://builds.apache.org/job/Shiro-1.2.x/org.apache.shiro.samples$samples-web/ws/'>
&& 'git' 'rev-parse' '--verify' 'HEAD'
[INFO] Executing: /bin/sh -c cd '<https://builds.apache.org/job/Shiro-1.2.x/org.apache.shiro.samples$samples-web/ws/'>
&& 'git' 'rev-parse' '--verify' 'HEAD'
[INFO] Executing: /bin/sh -c cd '<https://builds.apache.org/job/Shiro-1.2.x/org.apache.shiro.samples$samples-web/ws/'>
&& 'git' 'rev-parse' '--verify' 'HEAD'
[INFO] Executing: /bin/sh -c cd '<https://builds.apache.org/job/Shiro-1.2.x/org.apache.shiro.samples$samples-web/ws/'>
&& 'git' 'rev-parse' '--verify' 'HEAD'
[INFO] Executing: /bin/sh -c cd '<https://builds.apache.org/job/Shiro-1.2.x/org.apache.shiro.samples$samples-web/ws/'>
&& 'git' 'rev-parse' '--verify' 'HEAD'
[INFO] Executing: /bin/sh -c cd '<https://builds.apache.org/job/Shiro-1.2.x/org.apache.shiro.samples$samples-web/ws/'>
&& 'git' 'rev-parse' '--verify' 'HEAD'
[INFO] Executing: /bin/sh -c cd '<https://builds.apache.org/job/Shiro-1.2.x/org.apache.shiro.samples$samples-web/ws/'>
&& 'git' 'rev-parse' '--verify' 'HEAD'
[INFO] Executing: /bin/sh -c cd '<https://builds.apache.org/job/Shiro-1.2.x/org.apache.shiro.samples$samples-web/ws/'>
&& 'git' 'rev-parse' '--verify' 'HEAD'
[INFO] Executing: /bin/sh -c cd '<https://builds.apache.org/job/Shiro-1.2.x/org.apache.shiro.samples$samples-web/ws/'>
&& 'git' 'rev-parse' '--verify' 'HEAD'
[INFO] Executing: /bin/sh -c cd '<https://builds.apache.org/job/Shiro-1.2.x/org.apache.shiro.samples$samples-web/ws/'>
&& 'git' 'rev-parse' '--verify' 'HEAD'
[INFO] Executing: /bin/sh -c cd '<https://builds.apache.org/job/Shiro-1.2.x/org.apache.shiro.samples$samples-web/ws/'>
&& 'git' 'rev-parse' '--verify' 'HEAD'
[INFO] Executing: /bin/sh -c cd '<https://builds.apache.org/job/Shiro-1.2.x/org.apache.shiro.samples$samples-web/ws/'>
&& 'git' 'rev-parse' '--verify' 'HEAD'
[INFO] Executing: /bin/sh -c cd '<https://builds.apache.org/job/Shiro-1.2.x/org.apache.shiro.samples$samples-web/ws/'>
&& 'git' 'rev-parse' '--verify' 'HEAD'
[INFO] Executing: /bin/sh -c cd '<https://builds.apache.org/job/Shiro-1.2.x/org.apache.shiro.samples$samples-web/ws/'>
&& 'git' 'rev-parse' '--verify' 'HEAD'
[INFO] Executing: /bin/sh -c cd '<https://builds.apache.org/job/Shiro-1.2.x/org.apache.shiro.samples$samples-web/ws/'>
&& 'git' 'rev-parse' '--verify' 'HEAD'
[INFO] Executing: /bin/sh -c cd '<https://builds.apache.org/job/Shiro-1.2.x/org.apache.shiro.samples$samples-web/ws/'>
&& 'git' 'rev-parse' '--verify' 'HEAD'
[INFO] Executing: /bin/sh -c cd '<https://builds.apache.org/job/Shiro-1.2.x/org.apache.shiro.samples$samples-web/ws/'>
&& 'git' 'rev-parse' '--verify' 'HEAD'
[INFO] Executing: /bin/sh -c cd '<https://builds.apache.org/job/Shiro-1.2.x/org.apache.shiro.samples$samples-web/ws/'>
&& 'git' 'rev-parse' '--verify' 'HEAD'
[INFO] Executing: /bin/sh -c cd '<https://builds.apache.org/job/Shiro-1.2.x/org.apache.shiro.samples$samples-web/ws/'>
&& 'git' 'rev-parse' '--verify' 'HEAD'
[INFO] Working directory: <https://builds.apache.org/job/Shiro-1.2.x/org.apache.shiro.samples$samples-web/ws/>
[INFO] Working directory: <https://builds.apache.org/job/Shiro-1.2.x/org.apache.shiro.samples$samples-web/ws/>
[INFO] Working directory: <https://builds.apache.org/job/Shiro-1.2.x/org.apache.shiro.samples$samples-web/ws/>
[INFO] Working directory: <https://builds.apache.org/job/Shiro-1.2.x/org.apache.shiro.samples$samples-web/ws/>
[INFO] Working directory: <https://builds.apache.org/job/Shiro-1.2.x/org.apache.shiro.samples$samples-web/ws/>
[INFO] Working directory: <https://builds.apache.org/job/Shiro-1.2.x/org.apache.shiro.samples$samples-web/ws/>
[INFO] Working directory: <https://builds.apache.org/job/Shiro-1.2.x/org.apache.shiro.samples$samples-web/ws/>
[INFO] Working directory: <https://builds.apache.org/job/Shiro-1.2.x/org.apache.shiro.samples$samples-web/ws/>
[INFO] Working directory: <https://builds.apache.org/job/Shiro-1.2.x/org.apache.shiro.samples$samples-web/ws/>
[INFO] Working directory: <https://builds.apache.org/job/Shiro-1.2.x/org.apache.shiro.samples$samples-web/ws/>
[INFO] Working directory: <https://builds.apache.org/job/Shiro-1.2.x/org.apache.shiro.samples$samples-web/ws/>
[INFO] Working directory: <https://builds.apache.org/job/Shiro-1.2.x/org.apache.shiro.samples$samples-web/ws/>
[INFO] Working directory: <https://builds.apache.org/job/Shiro-1.2.x/org.apache.shiro.samples$samples-web/ws/>
[INFO] Working directory: <https://builds.apache.org/job/Shiro-1.2.x/org.apache.shiro.samples$samples-web/ws/>
[INFO] Working directory: <https://builds.apache.org/job/Shiro-1.2.x/org.apache.shiro.samples$samples-web/ws/>
[INFO] Working directory: <https://builds.apache.org/job/Shiro-1.2.x/org.apache.shiro.samples$samples-web/ws/>
[INFO] Working directory: <https://builds.apache.org/job/Shiro-1.2.x/org.apache.shiro.samples$samples-web/ws/>
[INFO] Working directory: <https://builds.apache.org/job/Shiro-1.2.x/org.apache.shiro.samples$samples-web/ws/>
[INFO] Working directory: <https://builds.apache.org/job/Shiro-1.2.x/org.apache.shiro.samples$samples-web/ws/>
[INFO] Working directory: <https://builds.apache.org/job/Shiro-1.2.x/org.apache.shiro.samples$samples-web/ws/>
[INFO] Working directory: <https://builds.apache.org/job/Shiro-1.2.x/org.apache.shiro.samples$samples-web/ws/>
[INFO] Working directory: <https://builds.apache.org/job/Shiro-1.2.x/org.apache.shiro.samples$samples-web/ws/>
[INFO] Working directory: <https://builds.apache.org/job/Shiro-1.2.x/org.apache.shiro.samples$samples-web/ws/>
[INFO] Working directory: <https://builds.apache.org/job/Shiro-1.2.x/org.apache.shiro.samples$samples-web/ws/>
[INFO] Working directory: <https://builds.apache.org/job/Shiro-1.2.x/org.apache.shiro.samples$samples-web/ws/>
[INFO] Working directory: <https://builds.apache.org/job/Shiro-1.2.x/org.apache.shiro.samples$samples-web/ws/>
[INFO] Working directory: <https://builds.apache.org/job/Shiro-1.2.x/org.apache.shiro.samples$samples-web/ws/>
[INFO] Working directory: <https://builds.apache.org/job/Shiro-1.2.x/org.apache.shiro.samples$samples-web/ws/>
[INFO] Working directory: <https://builds.apache.org/job/Shiro-1.2.x/org.apache.shiro.samples$samples-web/ws/>
[INFO] Storing buildScmBranch: UNKNOWN
[INFO] [remote-resources:process {execution: default}]
[INFO] [resources:resources {execution: default-resources}]
[INFO] Using 'UTF-8' encoding to copy filtered resources.
[INFO] Copying 1 resource
[INFO] Copying 3 resources
[INFO] [compiler:compile {execution: default-compile}]
[INFO] No sources to compile
[INFO] [groovy:compile {execution: default}]
[INFO] No sources found to compile
[INFO] [resources:testResources {execution: default-testResources}]
[INFO] Using 'UTF-8' encoding to copy filtered resources.
[INFO] skip non existing resourceDirectory <https://builds.apache.org/job/Shiro-1.2.x/org.apache.shiro.samples$samples-web/ws/src/test/resources>
[INFO] Copying 3 resources
[INFO] [compiler:testCompile {execution: default-testCompile}]
[INFO] Nothing to compile - all classes are up to date
[INFO] [groovy:testCompile {execution: default}]
[INFO] No sources found to compile
[INFO] [surefire:test {execution: default-test}]
[WARNING] useSystemClassloader setting has no effect when not forking
[INFO] Surefire report directory: <https://builds.apache.org/job/Shiro-1.2.x/org.apache.shiro.samples$samples-web/ws/target/surefire-reports>

-------------------------------------------------------
 T E S T S
-------------------------------------------------------
Running org.apache.shiro.test.ContainerIntegrationTest
Tests run: 1, Failures: 0, Errors: 0, Skipped: 1, Time elapsed: 0.012 sec

Results :

Tests run: 1, Failures: 0, Errors: 0, Skipped: 1

[JENKINS] Recording test results
[INFO] [war:war {execution: default-war}]
[INFO] Packaging webapp
[INFO] ------------------------------------------------------------------------
[ERROR] FATAL ERROR
[INFO] ------------------------------------------------------------------------
[INFO] Cannot construct org.apache.maven.plugin.war.util.WebappStructure as it does not have
a no-args constructor
---- Debugging information ----
message             : Cannot construct org.apache.maven.plugin.war.util.WebappStructure as
it does not have a no-args constructor
cause-exception     : com.thoughtworks.xstream.converters.reflection.ObjectAccessException
cause-message       : Cannot construct org.apache.maven.plugin.war.util.WebappStructure as
it does not have a no-args constructor
class               : org.apache.maven.plugin.war.util.WebappStructure
required-type       : org.apache.maven.plugin.war.util.WebappStructure
path                : /webapp-structure
line number         : 1
-------------------------------
[INFO] ------------------------------------------------------------------------
[INFO] Trace
com.thoughtworks.xstream.converters.ConversionException: Cannot construct org.apache.maven.plugin.war.util.WebappStructure
as it does not have a no-args constructor
---- Debugging information ----
message             : Cannot construct org.apache.maven.plugin.war.util.WebappStructure as
it does not have a no-args constructor
cause-exception     : com.thoughtworks.xstream.converters.reflection.ObjectAccessException
cause-message       : Cannot construct org.apache.maven.plugin.war.util.WebappStructure as
it does not have a no-args constructor
class               : org.apache.maven.plugin.war.util.WebappStructure
required-type       : org.apache.maven.plugin.war.util.WebappStructure
path                : /webapp-structure
line number         : 1
-------------------------------
	at com.thoughtworks.xstream.core.TreeUnmarshaller.convert(TreeUnmarshaller.java:63)
	at com.thoughtworks.xstream.core.AbstractReferenceUnmarshaller.convert(AbstractReferenceUnmarshaller.java:45)
	at com.thoughtworks.xstream.core.TreeUnmarshaller.convertAnother(TreeUnmarshaller.java:46)
	at com.thoughtworks.xstream.core.TreeUnmarshaller.start(TreeUnmarshaller.java:117)
	at com.thoughtworks.xstream.core.ReferenceByXPathMarshallingStrategy.unmarshal(ReferenceByXPathMarshallingStrategy.java:29)
	at com.thoughtworks.xstream.XStream.unmarshal(XStream.java:846)
	at com.thoughtworks.xstream.XStream.unmarshal(XStream.java:833)
	at com.thoughtworks.xstream.XStream.fromXML(XStream.java:781)
	at org.apache.maven.plugin.war.util.WebappStructureSerializer.fromXml(WebappStructureSerializer.java:73)
	at org.apache.maven.plugin.war.AbstractWarMojo.buildWebapp(AbstractWarMojo.java:404)
	at org.apache.maven.plugin.war.AbstractWarMojo.buildExplodedWebapp(AbstractWarMojo.java:375)
	at org.apache.maven.plugin.war.WarMojo.performPackaging(WarMojo.java:181)
	at org.apache.maven.plugin.war.WarMojo.execute(WarMojo.java:143)
	at org.apache.maven.plugin.DefaultPluginManager.executeMojo(DefaultPluginManager.java:490)
	at hudson.maven.agent.PluginManagerInterceptor.executeMojo(PluginManagerInterceptor.java:182)
	at org.apache.maven.lifecycle.DefaultLifecycleExecutor.executeGoals(DefaultLifecycleExecutor.java:694)
	at org.apache.maven.lifecycle.DefaultLifecycleExecutor.executeGoalWithLifecycle(DefaultLifecycleExecutor.java:556)
	at org.apache.maven.lifecycle.DefaultLifecycleExecutor.executeGoal(DefaultLifecycleExecutor.java:535)
	at org.apache.maven.lifecycle.DefaultLifecycleExecutor.executeGoalAndHandleFailures(DefaultLifecycleExecutor.java:387)
	at org.apache.maven.lifecycle.DefaultLifecycleExecutor.executeTaskSegments(DefaultLifecycleExecutor.java:348)
	at org.apache.maven.lifecycle.DefaultLifecycleExecutor.execute(DefaultLifecycleExecutor.java:180)
	at org.apache.maven.lifecycle.LifecycleExecutorInterceptor.execute(LifecycleExecutorInterceptor.java:65)
	at org.apache.maven.DefaultMaven.doExecute(DefaultMaven.java:328)
	at org.apache.maven.DefaultMaven.execute(DefaultMaven.java:138)
	at org.apache.maven.cli.MavenCli.main(MavenCli.java:362)
	at sun.reflect.NativeMethodAccessorImpl.invoke0(Native Method)
	at sun.reflect.NativeMethodAccessorImpl.invoke(NativeMethodAccessorImpl.java:57)
	at sun.reflect.DelegatingMethodAccessorImpl.invoke(DelegatingMethodAccessorImpl.java:43)
	at java.lang.reflect.Method.invoke(Method.java:606)
	at org.codehaus.classworlds.Launcher.launchEnhanced(Launcher.java:315)
	at org.codehaus.classworlds.Launcher.launch(Launcher.java:255)
	at hudson.maven.agent.Main.launch(Main.java:205)
	at hudson.maven.MavenBuilder.call(MavenBuilder.java:154)
	at hudson.maven.Maven2Builder.call(Maven2Builder.java:79)
	at hudson.maven.Maven2Builder.call(Maven2Builder.java:55)
	at hudson.remoting.UserRequest.perform(UserRequest.java:120)
	at hudson.remoting.UserRequest.perform(UserRequest.java:48)
	at hudson.remoting.Request$2.run(Request.java:326)
	at hudson.remoting.InterceptingExecutorService$1.call(InterceptingExecutorService.java:68)
	at java.util.concurrent.FutureTask.run(FutureTask.java:262)
	at java.util.concurrent.ThreadPoolExecutor.runWorker(ThreadPoolExecutor.java:1145)
	at java.util.concurrent.ThreadPoolExecutor$Worker.run(ThreadPoolExecutor.java:615)
	at java.lang.Thread.run(Thread.java:745)
Caused by: com.thoughtworks.xstream.converters.reflection.ObjectAccessException: Cannot construct
org.apache.maven.plugin.war.util.WebappStructure as it does not have a no-args constructor
	at com.thoughtworks.xstream.converters.reflection.PureJavaReflectionProvider.newInstance(PureJavaReflectionProvider.java:59)
	at com.thoughtworks.xstream.converters.reflection.AbstractReflectionConverter.instantiateNewInstance(AbstractReflectionConverter.java:257)
	at com.thoughtworks.xstream.converters.reflection.AbstractReflectionConverter.unmarshal(AbstractReflectionConverter.java:124)
	at com.thoughtworks.xstream.core.TreeUnmarshaller.convert(TreeUnmarshaller.java:56)
	... 42 more
[INFO] ------------------------------------------------------------------------
[INFO] Total time: 5 minutes 13 seconds
[INFO] Finished at: Mon Mar 21 18:55:46 UTC 2016
[INFO] Final Memory: 114M/494M
[INFO] ------------------------------------------------------------------------
Waiting for Jenkins to finish collecting data

Mime
View raw message