shiro-commits mailing list archives

Site index · List index
Message view « Date » · « Thread »
Top « Date » · « Thread »
From Apache Jenkins Server <jenk...@builds.apache.org>
Subject Build failed in Jenkins: Shiro-1.2.x » Apache Shiro :: Support :: EHCache #5
Date Fri, 04 Mar 2016 20:51:55 GMT
See <https://builds.apache.org/job/Shiro-1.2.x/org.apache.shiro$shiro-ehcache/5/>

------------------------------------------
[INFO] ------------------------------------------------------------------------
[INFO] Building Apache Shiro :: Support :: EHCache
[INFO]    task-segment: [apache-rat:check, deploy]
[INFO] ------------------------------------------------------------------------
[INFO] [apache-rat:check {execution: default-cli}]
[INFO] Exclude: **/.externalToolBuilders/*
[INFO] Exclude: **/infinitest.filters
[INFO] Exclude: velocity.log
[INFO] [buildnumber:create {execution: default}]
[INFO] Checking for local modifications: skipped.
[INFO] Updating project files from SCM: skipped.
[INFO] Executing: /bin/sh -c cd <https://builds.apache.org/job/Shiro-1.2.x/org.apache.shiro$shiro-ehcache/ws/>
&& svn --non-interactive info
[INFO] Working directory: <https://builds.apache.org/job/Shiro-1.2.x/org.apache.shiro$shiro-ehcache/ws/>
[INFO] Storing buildNumber: 1733649 at timestamp: 1457124554709
[INFO] Executing: /bin/sh -c cd <https://builds.apache.org/job/Shiro-1.2.x/org.apache.shiro$shiro-ehcache/ws/>
&& svn --non-interactive info
[INFO] Working directory: <https://builds.apache.org/job/Shiro-1.2.x/org.apache.shiro$shiro-ehcache/ws/>
[INFO] Storing buildScmBranch: branches/1.2.x/support/ehcache
[INFO] [remote-resources:process {execution: default}]
[INFO] [resources:resources {execution: default-resources}]
[INFO] Using 'UTF-8' encoding to copy filtered resources.
[INFO] Copying 1 resource
[INFO] Copying 3 resources
[INFO] [compiler:compile {execution: default-compile}]
[INFO] Compiling 3 source files to <https://builds.apache.org/job/Shiro-1.2.x/org.apache.shiro$shiro-ehcache/ws/target/classes>
[INFO] [groovy:compile {execution: default}]
[INFO] No sources found to compile
[INFO] [resources:testResources {execution: default-testResources}]
[INFO] Using 'UTF-8' encoding to copy filtered resources.
[INFO] Copying 1 resource
[INFO] Copying 3 resources
[INFO] [compiler:testCompile {execution: default-testCompile}]
[INFO] Compiling 1 source file to <https://builds.apache.org/job/Shiro-1.2.x/org.apache.shiro$shiro-ehcache/ws/target/test-classes>
[INFO] [groovy:testCompile {execution: default}]
[INFO] No sources found to compile
[INFO] [surefire:test {execution: default-test}]
[INFO] Surefire report directory: <https://builds.apache.org/job/Shiro-1.2.x/org.apache.shiro$shiro-ehcache/ws/target/surefire-reports>

-------------------------------------------------------
 T E S T S
-------------------------------------------------------
Running org.apache.shiro.cache.ehcache.EhCacheManagerTest
2016-03-04 20:49:16,382 DEBUG [org.apache.shiro.cache.ehcache.EhCacheManager] - cacheManager
property not set.  Constructing CacheManager instance...  
2016-03-04 20:49:16,395 DEBUG [org.apache.shiro.io.ResourceUtils] - Opening resource from
class path [org/apache/shiro/cache/ehcache/ehcache.xml] 
2016-03-04 20:49:16,655 TRACE [org.apache.shiro.cache.ehcache.EhCacheManager] - instantiated
Ehcache CacheManager instance. 
2016-03-04 20:49:16,655 DEBUG [org.apache.shiro.cache.ehcache.EhCacheManager] - implicit cacheManager
created successfully. 
2016-03-04 20:49:16,663 TRACE [org.apache.shiro.cache.ehcache.EhCacheManager] - Acquiring
EhCache instance named [test] 
2016-03-04 20:49:16,663 DEBUG [org.apache.shiro.cache.ehcache.EhCacheManager] - cacheManager
property not set.  Constructing CacheManager instance...  
2016-03-04 20:49:16,663 DEBUG [org.apache.shiro.io.ResourceUtils] - Opening resource from
class path [org/apache/shiro/cache/ehcache/ehcache.xml] 
2016-03-04 20:49:16,681 TRACE [org.apache.shiro.cache.ehcache.EhCacheManager] - instantiated
Ehcache CacheManager instance. 
2016-03-04 20:49:16,681 DEBUG [org.apache.shiro.cache.ehcache.EhCacheManager] - implicit cacheManager
created successfully. 
2016-03-04 20:49:16,681 INFO [org.apache.shiro.cache.ehcache.EhCacheManager] - Cache with
name 'test' does not yet exist.  Creating now. 
2016-03-04 20:49:16,684 INFO [org.apache.shiro.cache.ehcache.EhCacheManager] - Added EhCache
named [test] 
2016-03-04 20:49:16,685 TRACE [org.apache.shiro.cache.ehcache.EhCache] - Putting object in
cache [test] for key [hello] 
2016-03-04 20:49:16,685 TRACE [org.apache.shiro.cache.ehcache.EhCache] - Getting object from
cache [test] for key [hello] 
2016-03-04 20:49:16,686 TRACE [org.apache.shiro.cache.ehcache.EhCache] - Element for [hello]
is null. 
2016-03-04 20:49:16,687 TRACE [org.apache.shiro.cache.ehcache.EhCache] - Getting object from
cache [test] for key [hello] 
Tests run: 2, Failures: 0, Errors: 0, Skipped: 0, Time elapsed: 0.419 sec

Results :

Tests run: 2, Failures: 0, Errors: 0, Skipped: 0

[JENKINS] Recording test results
[INFO] [bundle:bundle {execution: default-bundle}]
[INFO] [javadoc:jar {execution: attach-api-docs}]
[ERROR] Error fetching link: http://junit.org/junit/javadoc/4.4/package-list. Ignored it.
[ERROR] Error fetching link: http://easymock.org/api/easymock/2.4/package-list. Ignored it.
[ERROR] Error fetching link: http://www.quartz-scheduler.org/docs/api/1.8.0/package-list.
Ignored it.
[ERROR] Error fetching link: /home/jenkins/jenkins-slave/workspace/Shiro-1.2.x/1.2.x/support/quartz/target/apidocs/package-list.
Ignored it.
[ERROR] Error fetching link: /home/jenkins/jenkins-slave/workspace/Shiro-1.2.x/1.2.x/support/spring/target/apidocs/package-list.
Ignored it.
[ERROR] Error fetching link: /home/jenkins/jenkins-slave/workspace/Shiro-1.2.x/1.2.x/support/guice/target/apidocs/package-list.
Ignored it.
[ERROR] Error fetching link: /home/jenkins/jenkins-slave/workspace/Shiro-1.2.x/1.2.x/support/cas/target/apidocs/package-list.
Ignored it.
[ERROR] Error fetching link: /home/jenkins/jenkins-slave/workspace/Shiro-1.2.x/1.2.x/samples/aspectj/target/apidocs/package-list.
Ignored it.
[ERROR] Error fetching link: /home/jenkins/jenkins-slave/workspace/Shiro-1.2.x/1.2.x/samples/quickstart/target/apidocs/package-list.
Ignored it.
[ERROR] Error fetching link: /home/jenkins/jenkins-slave/workspace/Shiro-1.2.x/1.2.x/samples/web/target/apidocs/package-list.
Ignored it.
[ERROR] Error fetching link: /home/jenkins/jenkins-slave/workspace/Shiro-1.2.x/1.2.x/samples/spring-client/target/apidocs/package-list.
Ignored it.
[ERROR] Error fetching link: /home/jenkins/jenkins-slave/workspace/Shiro-1.2.x/1.2.x/samples/spring/target/apidocs/package-list.
Ignored it.
[ERROR] Error fetching link: /home/jenkins/jenkins-slave/workspace/Shiro-1.2.x/1.2.x/samples/spring-hibernate/target/apidocs/package-list.
Ignored it.
[ERROR] Error fetching link: /home/jenkins/jenkins-slave/workspace/Shiro-1.2.x/1.2.x/tools/hasher/target/apidocs/package-list.
Ignored it.
[ERROR] Error fetching link: /home/jenkins/jenkins-slave/workspace/Shiro-1.2.x/1.2.x/all/target/apidocs/package-list.
Ignored it.
[INFO] 
Loading source files for package org.apache.shiro.cache.ehcache...
Constructing Javadoc information...
Standard Doclet version 1.7.0_55
Building tree for all the packages and classes...
Generating <https://builds.apache.org/job/Shiro-1.2.x/org.apache.shiro$shiro-ehcache/ws/target/apidocs/org/apache/shiro/cache/ehcache/EhCache.html...>
Generating <https://builds.apache.org/job/Shiro-1.2.x/org.apache.shiro$shiro-ehcache/ws/target/apidocs/org/apache/shiro/cache/ehcache/EhCacheManager.html...>
Generating <https://builds.apache.org/job/Shiro-1.2.x/org.apache.shiro$shiro-ehcache/ws/target/apidocs/org/apache/shiro/cache/ehcache/package-frame.html...>
Generating <https://builds.apache.org/job/Shiro-1.2.x/org.apache.shiro$shiro-ehcache/ws/target/apidocs/org/apache/shiro/cache/ehcache/package-summary.html...>
Generating <https://builds.apache.org/job/Shiro-1.2.x/org.apache.shiro$shiro-ehcache/ws/target/apidocs/org/apache/shiro/cache/ehcache/package-tree.html...>
Generating <https://builds.apache.org/job/Shiro-1.2.x/org.apache.shiro$shiro-ehcache/ws/target/apidocs/constant-values.html...>
Generating <https://builds.apache.org/job/Shiro-1.2.x/org.apache.shiro$shiro-ehcache/ws/target/apidocs/src-html/org/apache/shiro/cache/ehcache/EhCacheManager.html...>
Generating <https://builds.apache.org/job/Shiro-1.2.x/org.apache.shiro$shiro-ehcache/ws/target/apidocs/src-html/org/apache/shiro/cache/ehcache/EhCache.html...>
Generating <https://builds.apache.org/job/Shiro-1.2.x/org.apache.shiro$shiro-ehcache/ws/target/apidocs/org/apache/shiro/cache/ehcache/class-use/EhCacheManager.html...>
Generating <https://builds.apache.org/job/Shiro-1.2.x/org.apache.shiro$shiro-ehcache/ws/target/apidocs/org/apache/shiro/cache/ehcache/class-use/EhCache.html...>
Generating <https://builds.apache.org/job/Shiro-1.2.x/org.apache.shiro$shiro-ehcache/ws/target/apidocs/org/apache/shiro/cache/ehcache/package-use.html...>
Building index for all the packages and classes...
Generating <https://builds.apache.org/job/Shiro-1.2.x/org.apache.shiro$shiro-ehcache/ws/target/apidocs/overview-tree.html...>
Generating <https://builds.apache.org/job/Shiro-1.2.x/org.apache.shiro$shiro-ehcache/ws/target/apidocs/index-all.html...>
Generating <https://builds.apache.org/job/Shiro-1.2.x/org.apache.shiro$shiro-ehcache/ws/target/apidocs/deprecated-list.html...>
Building index for all classes...
Generating <https://builds.apache.org/job/Shiro-1.2.x/org.apache.shiro$shiro-ehcache/ws/target/apidocs/allclasses-frame.html...>
Generating <https://builds.apache.org/job/Shiro-1.2.x/org.apache.shiro$shiro-ehcache/ws/target/apidocs/allclasses-noframe.html...>
Generating <https://builds.apache.org/job/Shiro-1.2.x/org.apache.shiro$shiro-ehcache/ws/target/apidocs/index.html...>
Generating <https://builds.apache.org/job/Shiro-1.2.x/org.apache.shiro$shiro-ehcache/ws/target/apidocs/help-doc.html...>
1 warning
[WARNING] Javadoc Warnings
[WARNING] warning: [options] bootstrap class path not set in conjunction with -source 1.6
[INFO] Building jar: <https://builds.apache.org/job/Shiro-1.2.x/org.apache.shiro$shiro-ehcache/ws/target/shiro-ehcache-1.2.5-SNAPSHOT-javadoc.jar>
[INFO] Preparing source:jar
[WARNING] Removing: jar from forked lifecycle, to prevent recursive invocation.
[INFO] [buildnumber:create {execution: default}]
[INFO] Checking for local modifications: skipped.
[INFO] Updating project files from SCM: skipped.
[INFO] Executing: /bin/sh -c cd <https://builds.apache.org/job/Shiro-1.2.x/org.apache.shiro$shiro-ehcache/ws/>
&& svn --non-interactive info
[INFO] Working directory: <https://builds.apache.org/job/Shiro-1.2.x/org.apache.shiro$shiro-ehcache/ws/>
[INFO] Storing buildNumber: 1733649 at timestamp: 1457124565916
[INFO] Executing: /bin/sh -c cd <https://builds.apache.org/job/Shiro-1.2.x/org.apache.shiro$shiro-ehcache/ws/>
&& svn --non-interactive info
[INFO] Working directory: <https://builds.apache.org/job/Shiro-1.2.x/org.apache.shiro$shiro-ehcache/ws/>
[INFO] Storing buildScmBranch: branches/1.2.x/support/ehcache
ERROR: Could not find local repository for 2.2.1
[INFO] [source:jar {execution: attach-sources}]
[INFO] Building jar: <https://builds.apache.org/job/Shiro-1.2.x/org.apache.shiro$shiro-ehcache/ws/target/shiro-ehcache-1.2.5-SNAPSHOT-sources.jar>
[INFO] [install:install {execution: default-install}]
[INFO] Installing <https://builds.apache.org/job/Shiro-1.2.x/org.apache.shiro$shiro-ehcache/ws/target/shiro-ehcache-1.2.5-SNAPSHOT.jar>
to /home/jenkins/jenkins-slave/maven-repositories/0/org/apache/shiro/shiro-ehcache/1.2.5-SNAPSHOT/shiro-ehcache-1.2.5-SNAPSHOT.jar
[INFO] Installing <https://builds.apache.org/job/Shiro-1.2.x/org.apache.shiro$shiro-ehcache/ws/target/shiro-ehcache-1.2.5-SNAPSHOT-javadoc.jar>
to /home/jenkins/jenkins-slave/maven-repositories/0/org/apache/shiro/shiro-ehcache/1.2.5-SNAPSHOT/shiro-ehcache-1.2.5-SNAPSHOT-javadoc.jar
[INFO] Installing <https://builds.apache.org/job/Shiro-1.2.x/org.apache.shiro$shiro-ehcache/ws/target/shiro-ehcache-1.2.5-SNAPSHOT-sources.jar>
to /home/jenkins/jenkins-slave/maven-repositories/0/org/apache/shiro/shiro-ehcache/1.2.5-SNAPSHOT/shiro-ehcache-1.2.5-SNAPSHOT-sources.jar
[INFO] [bundle:install {execution: default-install}]
[INFO] Installing org/apache/shiro/shiro-ehcache/1.2.5-SNAPSHOT/shiro-ehcache-1.2.5-SNAPSHOT.jar
[INFO] Writing OBR metadata
[INFO] ------------------------------------------------------------------------
[ERROR] FATAL ERROR
[INFO] ------------------------------------------------------------------------
[INFO] GC overhead limit exceeded
[INFO] ------------------------------------------------------------------------
[INFO] Trace
java.lang.OutOfMemoryError: GC overhead limit exceeded
	at java.util.regex.Pattern.compile(Pattern.java:1655)
	at java.util.regex.Pattern.<init>(Pattern.java:1337)
	at java.util.regex.Pattern.compile(Pattern.java:1022)
	at java.lang.String.replaceAll(String.java:2162)
	at org.apache.felix.bundlerepository.impl.XmlWriter.encode(XmlWriter.java:142)
	at org.apache.felix.bundlerepository.impl.XmlWriter.attribute(XmlWriter.java:89)
	at org.apache.felix.bundlerepository.impl.DataModelHelperImpl.toXml(DataModelHelperImpl.java:371)
	at org.apache.felix.bundlerepository.impl.DataModelHelperImpl.toXml(DataModelHelperImpl.java:364)
	at org.apache.felix.bundlerepository.impl.DataModelHelperImpl.toXml(DataModelHelperImpl.java:331)
	at org.apache.felix.bundlerepository.impl.DataModelHelperImpl.toXml(DataModelHelperImpl.java:299)
	at org.apache.felix.bundlerepository.impl.DataModelHelperImpl.writeRepository(DataModelHelperImpl.java:186)
	at org.apache.felix.obrplugin.ObrUpdate.writeRepositoryXml(ObrUpdate.java:249)
	at org.apache.felix.obrplugin.ObrInstall.execute(ObrInstall.java:148)
	at org.apache.maven.plugin.DefaultPluginManager.executeMojo(DefaultPluginManager.java:490)
	at hudson.maven.agent.PluginManagerInterceptor.executeMojo(PluginManagerInterceptor.java:182)
	at org.apache.maven.lifecycle.DefaultLifecycleExecutor.executeGoals(DefaultLifecycleExecutor.java:694)
	at org.apache.maven.lifecycle.DefaultLifecycleExecutor.executeGoalWithLifecycle(DefaultLifecycleExecutor.java:556)
	at org.apache.maven.lifecycle.DefaultLifecycleExecutor.executeGoal(DefaultLifecycleExecutor.java:535)
	at org.apache.maven.lifecycle.DefaultLifecycleExecutor.executeGoalAndHandleFailures(DefaultLifecycleExecutor.java:387)
	at org.apache.maven.lifecycle.DefaultLifecycleExecutor.executeTaskSegments(DefaultLifecycleExecutor.java:348)
	at org.apache.maven.lifecycle.DefaultLifecycleExecutor.execute(DefaultLifecycleExecutor.java:180)
	at org.apache.maven.lifecycle.LifecycleExecutorInterceptor.execute(LifecycleExecutorInterceptor.java:65)
	at org.apache.maven.DefaultMaven.doExecute(DefaultMaven.java:328)
	at org.apache.maven.DefaultMaven.execute(DefaultMaven.java:138)
	at org.apache.maven.cli.MavenCli.main(MavenCli.java:362)
	at sun.reflect.NativeMethodAccessorImpl.invoke0(Native Method)
	at sun.reflect.NativeMethodAccessorImpl.invoke(NativeMethodAccessorImpl.java:57)
	at sun.reflect.DelegatingMethodAccessorImpl.invoke(DelegatingMethodAccessorImpl.java:43)
	at java.lang.reflect.Method.invoke(Method.java:606)
	at org.codehaus.classworlds.Launcher.launchEnhanced(Launcher.java:315)
	at org.codehaus.classworlds.Launcher.launch(Launcher.java:255)
	at hudson.maven.agent.Main.launch(Main.java:205)
[INFO] ------------------------------------------------------------------------
[INFO] Total time: 12 minutes 46 seconds
[INFO] Finished at: Fri Mar 04 20:51:59 UTC 2016
[INFO] Final Memory: 82M/205M
[INFO] ------------------------------------------------------------------------

Mime
View raw message