shiro-commits mailing list archives

Site index · List index
Message view « Date » · « Thread »
Top « Date » · « Thread »
From Apache Jenkins Server <jenk...@builds.apache.org>
Subject Build failed in Jenkins: Shiro-1.3.x #13
Date Fri, 08 Jul 2016 15:03:28 GMT
See <https://builds.apache.org/job/Shiro-1.3.x/13/changes>

Changes:

[bdemers] SHIRO-436 Added EnvironmentLoader.finalizeEnvironment() method

------------------------------------------
[...truncated 3001 lines...]
Generating <https://builds.apache.org/job/Shiro-1.3.x/ws/core/target/apidocs/org/apache/shiro/aop/class-use/MethodInvocation.html...>
Generating <https://builds.apache.org/job/Shiro-1.3.x/ws/core/target/apidocs/org/apache/shiro/aop/class-use/AnnotationMethodInterceptor.html...>
Generating <https://builds.apache.org/job/Shiro-1.3.x/ws/core/target/apidocs/org/apache/shiro/aop/class-use/MethodInterceptorSupport.html...>
Generating <https://builds.apache.org/job/Shiro-1.3.x/ws/core/target/apidocs/org/apache/shiro/aop/class-use/AnnotationHandler.html...>
Generating <https://builds.apache.org/job/Shiro-1.3.x/ws/core/target/apidocs/org/apache/shiro/aop/class-use/MethodInterceptor.html...>
Generating <https://builds.apache.org/job/Shiro-1.3.x/ws/core/target/apidocs/org/apache/shiro/aop/class-use/DefaultAnnotationResolver.html...>
Generating <https://builds.apache.org/job/Shiro-1.3.x/ws/core/target/apidocs/org/apache/shiro/aop/class-use/AnnotationResolver.html...>
Generating <https://builds.apache.org/job/Shiro-1.3.x/ws/core/target/apidocs/org/apache/shiro/util/class-use/InstantiationException.html...>
Generating <https://builds.apache.org/job/Shiro-1.3.x/ws/core/target/apidocs/org/apache/shiro/util/class-use/JavaEnvironment.html...>
Generating <https://builds.apache.org/job/Shiro-1.3.x/ws/core/target/apidocs/org/apache/shiro/util/class-use/SimpleByteSource.html...>
Generating <https://builds.apache.org/job/Shiro-1.3.x/ws/core/target/apidocs/org/apache/shiro/util/class-use/Nameable.html...>
Generating <https://builds.apache.org/job/Shiro-1.3.x/ws/core/target/apidocs/org/apache/shiro/util/class-use/Destroyable.html...>
Generating <https://builds.apache.org/job/Shiro-1.3.x/ws/core/target/apidocs/org/apache/shiro/util/class-use/ThreadContext.html...>
Generating <https://builds.apache.org/job/Shiro-1.3.x/ws/core/target/apidocs/org/apache/shiro/util/class-use/RegExPatternMatcher.html...>
Generating <https://builds.apache.org/job/Shiro-1.3.x/ws/core/target/apidocs/org/apache/shiro/util/class-use/ThreadState.html...>
Generating <https://builds.apache.org/job/Shiro-1.3.x/ws/core/target/apidocs/org/apache/shiro/util/class-use/ClassUtils.html...>
Generating <https://builds.apache.org/job/Shiro-1.3.x/ws/core/target/apidocs/org/apache/shiro/util/class-use/AntPathMatcher.html...>
Generating <https://builds.apache.org/job/Shiro-1.3.x/ws/core/target/apidocs/org/apache/shiro/util/class-use/JdbcUtils.html...>
Generating <https://builds.apache.org/job/Shiro-1.3.x/ws/core/target/apidocs/org/apache/shiro/util/class-use/StringUtils.html...>
Generating <https://builds.apache.org/job/Shiro-1.3.x/ws/core/target/apidocs/org/apache/shiro/util/class-use/UnavailableConstructorException.html...>
Generating <https://builds.apache.org/job/Shiro-1.3.x/ws/core/target/apidocs/org/apache/shiro/util/class-use/PermissionUtils.html...>
Generating <https://builds.apache.org/job/Shiro-1.3.x/ws/core/target/apidocs/org/apache/shiro/util/class-use/MapContext.html...>
Generating <https://builds.apache.org/job/Shiro-1.3.x/ws/core/target/apidocs/org/apache/shiro/util/class-use/UnknownClassException.html...>
Generating <https://builds.apache.org/job/Shiro-1.3.x/ws/core/target/apidocs/org/apache/shiro/util/class-use/Initializable.html...>
Generating <https://builds.apache.org/job/Shiro-1.3.x/ws/core/target/apidocs/org/apache/shiro/util/class-use/SoftHashMap.html...>
Generating <https://builds.apache.org/job/Shiro-1.3.x/ws/core/target/apidocs/org/apache/shiro/util/class-use/CollectionUtils.html...>
Generating <https://builds.apache.org/job/Shiro-1.3.x/ws/core/target/apidocs/org/apache/shiro/util/class-use/PatternMatcher.html...>
Generating <https://builds.apache.org/job/Shiro-1.3.x/ws/core/target/apidocs/org/apache/shiro/util/class-use/AbstractFactory.html...>
Generating <https://builds.apache.org/job/Shiro-1.3.x/ws/core/target/apidocs/org/apache/shiro/util/class-use/LifecycleUtils.html...>
Generating <https://builds.apache.org/job/Shiro-1.3.x/ws/core/target/apidocs/org/apache/shiro/util/class-use/Factory.html...>
Generating <https://builds.apache.org/job/Shiro-1.3.x/ws/core/target/apidocs/org/apache/shiro/util/class-use/ByteSource.html...>
Generating <https://builds.apache.org/job/Shiro-1.3.x/ws/core/target/apidocs/org/apache/shiro/util/class-use/ByteSource.Util.html...>
Generating <https://builds.apache.org/job/Shiro-1.3.x/ws/core/target/apidocs/org/apache/shiro/package-use.html...>
Generating <https://builds.apache.org/job/Shiro-1.3.x/ws/core/target/apidocs/org/apache/shiro/aop/package-use.html...>
Generating <https://builds.apache.org/job/Shiro-1.3.x/ws/core/target/apidocs/org/apache/shiro/authc/package-use.html...>
Generating <https://builds.apache.org/job/Shiro-1.3.x/ws/core/target/apidocs/org/apache/shiro/authc/credential/package-use.html...>
Generating <https://builds.apache.org/job/Shiro-1.3.x/ws/core/target/apidocs/org/apache/shiro/authc/pam/package-use.html...>
Generating <https://builds.apache.org/job/Shiro-1.3.x/ws/core/target/apidocs/org/apache/shiro/authz/package-use.html...>
Generating <https://builds.apache.org/job/Shiro-1.3.x/ws/core/target/apidocs/org/apache/shiro/authz/annotation/package-use.html...>
Generating <https://builds.apache.org/job/Shiro-1.3.x/ws/core/target/apidocs/org/apache/shiro/authz/aop/package-use.html...>
Generating <https://builds.apache.org/job/Shiro-1.3.x/ws/core/target/apidocs/org/apache/shiro/authz/permission/package-use.html...>
Generating <https://builds.apache.org/job/Shiro-1.3.x/ws/core/target/apidocs/org/apache/shiro/cache/package-use.html...>
Generating <https://builds.apache.org/job/Shiro-1.3.x/ws/core/target/apidocs/org/apache/shiro/codec/package-use.html...>
Generating <https://builds.apache.org/job/Shiro-1.3.x/ws/core/target/apidocs/org/apache/shiro/concurrent/package-use.html...>
Generating <https://builds.apache.org/job/Shiro-1.3.x/ws/core/target/apidocs/org/apache/shiro/config/package-use.html...>
Generating <https://builds.apache.org/job/Shiro-1.3.x/ws/core/target/apidocs/org/apache/shiro/crypto/package-use.html...>
Generating <https://builds.apache.org/job/Shiro-1.3.x/ws/core/target/apidocs/org/apache/shiro/crypto/hash/package-use.html...>
Generating <https://builds.apache.org/job/Shiro-1.3.x/ws/core/target/apidocs/org/apache/shiro/crypto/hash/format/package-use.html...>
Generating <https://builds.apache.org/job/Shiro-1.3.x/ws/core/target/apidocs/org/apache/shiro/dao/package-use.html...>
Generating <https://builds.apache.org/job/Shiro-1.3.x/ws/core/target/apidocs/org/apache/shiro/env/package-use.html...>
Generating <https://builds.apache.org/job/Shiro-1.3.x/ws/core/target/apidocs/org/apache/shiro/functor/package-use.html...>
Generating <https://builds.apache.org/job/Shiro-1.3.x/ws/core/target/apidocs/org/apache/shiro/io/package-use.html...>
Generating <https://builds.apache.org/job/Shiro-1.3.x/ws/core/target/apidocs/org/apache/shiro/jndi/package-use.html...>
Generating <https://builds.apache.org/job/Shiro-1.3.x/ws/core/target/apidocs/org/apache/shiro/ldap/package-use.html...>
Generating <https://builds.apache.org/job/Shiro-1.3.x/ws/core/target/apidocs/org/apache/shiro/mgt/package-use.html...>
Generating <https://builds.apache.org/job/Shiro-1.3.x/ws/core/target/apidocs/org/apache/shiro/realm/package-use.html...>
Generating <https://builds.apache.org/job/Shiro-1.3.x/ws/core/target/apidocs/org/apache/shiro/realm/activedirectory/package-use.html...>
Generating <https://builds.apache.org/job/Shiro-1.3.x/ws/core/target/apidocs/org/apache/shiro/realm/jdbc/package-use.html...>
Generating <https://builds.apache.org/job/Shiro-1.3.x/ws/core/target/apidocs/org/apache/shiro/realm/jndi/package-use.html...>
Generating <https://builds.apache.org/job/Shiro-1.3.x/ws/core/target/apidocs/org/apache/shiro/realm/ldap/package-use.html...>
Generating <https://builds.apache.org/job/Shiro-1.3.x/ws/core/target/apidocs/org/apache/shiro/realm/text/package-use.html...>
Generating <https://builds.apache.org/job/Shiro-1.3.x/ws/core/target/apidocs/org/apache/shiro/session/package-use.html...>
Generating <https://builds.apache.org/job/Shiro-1.3.x/ws/core/target/apidocs/org/apache/shiro/session/mgt/package-use.html...>
Generating <https://builds.apache.org/job/Shiro-1.3.x/ws/core/target/apidocs/org/apache/shiro/session/mgt/eis/package-use.html...>
Generating <https://builds.apache.org/job/Shiro-1.3.x/ws/core/target/apidocs/org/apache/shiro/subject/package-use.html...>
Generating <https://builds.apache.org/job/Shiro-1.3.x/ws/core/target/apidocs/org/apache/shiro/subject/support/package-use.html...>
Generating <https://builds.apache.org/job/Shiro-1.3.x/ws/core/target/apidocs/org/apache/shiro/util/package-use.html...>
Building index for all the packages and classes...
Generating <https://builds.apache.org/job/Shiro-1.3.x/ws/core/target/apidocs/overview-tree.html...>
Generating <https://builds.apache.org/job/Shiro-1.3.x/ws/core/target/apidocs/index-all.html...>
Generating <https://builds.apache.org/job/Shiro-1.3.x/ws/core/target/apidocs/deprecated-list.html...>
Building index for all classes...
Generating <https://builds.apache.org/job/Shiro-1.3.x/ws/core/target/apidocs/allclasses-frame.html...>
Generating <https://builds.apache.org/job/Shiro-1.3.x/ws/core/target/apidocs/allclasses-noframe.html...>
Generating <https://builds.apache.org/job/Shiro-1.3.x/ws/core/target/apidocs/index.html...>
Generating <https://builds.apache.org/job/Shiro-1.3.x/ws/core/target/apidocs/overview-summary.html...>
Generating <https://builds.apache.org/job/Shiro-1.3.x/ws/core/target/apidocs/help-doc.html...>
45 warnings
[WARNING] Javadoc Warnings
[WARNING] <https://builds.apache.org/job/Shiro-1.3.x/ws/core/src/main/java/org/apache/shiro/subject/Subject.java>:608:
warning - Tag @link: can't find Builder() in org.apache.shiro.subject.Subject.Builder
[WARNING] <https://builds.apache.org/job/Shiro-1.3.x/ws/core/src/main/java/org/apache/shiro/subject/Subject.java>:608:
warning - Tag @link: can't find Builder(org.apache.shiro.mgt.SecurityManager) in org.apache.shiro.subject.Subject.Builder
[WARNING] <https://builds.apache.org/job/Shiro-1.3.x/ws/core/src/main/java/org/apache/shiro/subject/Subject.java>:315:
warning - Tag @link:illegal character: "60" in "#checkRoles(Collection<String> roleIdentifiers)
checkRoles(Collection<String> roleIdentifiers)"
[WARNING] <https://builds.apache.org/job/Shiro-1.3.x/ws/core/src/main/java/org/apache/shiro/subject/Subject.java>:315:
warning - Tag @link:illegal character: "62" in "#checkRoles(Collection<String> roleIdentifiers)
checkRoles(Collection<String> roleIdentifiers)"
[WARNING] <https://builds.apache.org/job/Shiro-1.3.x/ws/core/src/main/java/org/apache/shiro/subject/Subject.java>:315:
warning - Tag @link: can't find checkRoles(Collection<String> roleIdentifiers) in org.apache.shiro.subject.Subject
[WARNING] <https://builds.apache.org/job/Shiro-1.3.x/ws/core/src/main/java/org/apache/shiro/authc/credential/PasswordService.java>:115:
warning - Tag @link: reference not found: ByteSource.Util#isCompatible(Object)
[WARNING] <https://builds.apache.org/job/Shiro-1.3.x/ws/core/src/main/java/org/apache/shiro/authc/credential/PasswordService.java>:115:
warning - Tag @see: reference not found: ByteSource.Util#isCompatible(Object)
[WARNING] <https://builds.apache.org/job/Shiro-1.3.x/ws/core/src/main/java/org/apache/shiro/authc/credential/HashingPasswordService.java>:68:
warning - Tag @link: reference not found: ByteSource.Util#isCompatible(Object)
[WARNING] <https://builds.apache.org/job/Shiro-1.3.x/ws/core/src/main/java/org/apache/shiro/authc/credential/HashingPasswordService.java>:68:
warning - Tag @link: reference not found: ByteSource.Util
[WARNING] <https://builds.apache.org/job/Shiro-1.3.x/ws/core/src/main/java/org/apache/shiro/authc/credential/HashingPasswordService.java>:68:
warning - Tag @see: reference not found: ByteSource.Util#isCompatible(Object)
[WARNING] <https://builds.apache.org/job/Shiro-1.3.x/ws/core/src/main/java/org/apache/shiro/authc/credential/HashingPasswordService.java>:90:
warning - Tag @link: reference not found: ByteSource.Util#isCompatible(Object)
[WARNING] <https://builds.apache.org/job/Shiro-1.3.x/ws/core/src/main/java/org/apache/shiro/authc/credential/PasswordService.java>:146:
warning - Tag @link: reference not found: ByteSource.Util#isCompatible(Object)
[WARNING] <https://builds.apache.org/job/Shiro-1.3.x/ws/core/src/main/java/org/apache/shiro/authc/credential/PasswordService.java>:146:
warning - Tag @see: reference not found: ByteSource.Util#isCompatible(Object)
[WARNING] <https://builds.apache.org/job/Shiro-1.3.x/ws/core/src/main/java/org/apache/shiro/authc/credential/HashingPasswordService.java>:68:
warning - Tag @link: reference not found: ByteSource.Util#isCompatible(Object)
[WARNING] <https://builds.apache.org/job/Shiro-1.3.x/ws/core/src/main/java/org/apache/shiro/authc/credential/HashingPasswordService.java>:68:
warning - Tag @link: reference not found: ByteSource.Util
[WARNING] <https://builds.apache.org/job/Shiro-1.3.x/ws/core/src/main/java/org/apache/shiro/authc/credential/HashingPasswordService.java>:68:
warning - Tag @link: reference not found: ByteSource.Util#isCompatible(Object)
[WARNING] <https://builds.apache.org/job/Shiro-1.3.x/ws/core/src/main/java/org/apache/shiro/authc/credential/HashingPasswordService.java>:68:
warning - Tag @see: reference not found: ByteSource.Util#isCompatible(Object)
[WARNING] <https://builds.apache.org/job/Shiro-1.3.x/ws/core/src/main/java/org/apache/shiro/authc/credential/HashingPasswordService.java>:90:
warning - Tag @link: reference not found: ByteSource.Util#isCompatible(Object)
[WARNING] <https://builds.apache.org/job/Shiro-1.3.x/ws/core/src/main/java/org/apache/shiro/authc/credential/PasswordService.java>:115:
warning - Tag @link: reference not found: ByteSource.Util#isCompatible(Object)
[WARNING] <https://builds.apache.org/job/Shiro-1.3.x/ws/core/src/main/java/org/apache/shiro/authc/credential/PasswordService.java>:115:
warning - Tag @link: reference not found: ByteSource.Util#isCompatible(Object)
[WARNING] <https://builds.apache.org/job/Shiro-1.3.x/ws/core/src/main/java/org/apache/shiro/authc/credential/PasswordService.java>:115:
warning - Tag @see: reference not found: ByteSource.Util#isCompatible(Object)
[WARNING] <https://builds.apache.org/job/Shiro-1.3.x/ws/core/src/main/java/org/apache/shiro/authc/credential/PasswordService.java>:146:
warning - Tag @link: reference not found: ByteSource.Util#isCompatible(Object)
[WARNING] <https://builds.apache.org/job/Shiro-1.3.x/ws/core/src/main/java/org/apache/shiro/authc/credential/PasswordService.java>:146:
warning - Tag @see: reference not found: ByteSource.Util#isCompatible(Object)
[WARNING] <https://builds.apache.org/job/Shiro-1.3.x/ws/core/src/main/java/org/apache/shiro/codec/H64.java>:108:
warning - @return tag has no arguments.
[WARNING] <https://builds.apache.org/job/Shiro-1.3.x/ws/core/src/main/java/org/apache/shiro/mgt/AbstractRememberMeManager.java>:380:
warning - Tag @link: reference not found: Subject.Builder
[WARNING] <https://builds.apache.org/job/Shiro-1.3.x/ws/core/src/main/java/org/apache/shiro/mgt/AbstractRememberMeManager.java>:406:
warning - Tag @link: reference not found: Subject.Builder
[WARNING] <https://builds.apache.org/job/Shiro-1.3.x/ws/core/src/main/java/org/apache/shiro/mgt/AbstractRememberMeManager.java>:406:
warning - Tag @link: reference not found: Subject.Builder
[WARNING] <https://builds.apache.org/job/Shiro-1.3.x/ws/core/src/main/java/org/apache/shiro/mgt/AbstractRememberMeManager.java>:417:
warning - Tag @link: reference not found: Subject.Builder
[WARNING] <https://builds.apache.org/job/Shiro-1.3.x/ws/core/src/main/java/org/apache/shiro/mgt/AbstractRememberMeManager.java>:441:
warning - Tag @link: reference not found: Subject.Builder
[WARNING] <https://builds.apache.org/job/Shiro-1.3.x/ws/core/src/main/java/org/apache/shiro/mgt/RememberMeManager.java>:48:
warning - Tag @link: reference not found: Subject.Builder
[WARNING] <https://builds.apache.org/job/Shiro-1.3.x/ws/core/src/main/java/org/apache/shiro/mgt/RememberMeManager.java>:48:
warning - Tag @link: reference not found: Subject.Builder
[WARNING] <https://builds.apache.org/job/Shiro-1.3.x/ws/core/src/main/java/org/apache/shiro/mgt/RememberMeManager.java>:60:
warning - Tag @link: reference not found: Subject.Builder
[WARNING] <https://builds.apache.org/job/Shiro-1.3.x/ws/core/src/main/java/org/apache/shiro/mgt/RememberMeManager.java>:60:
warning - Tag @link: reference not found: Subject.Builder
[WARNING] <https://builds.apache.org/job/Shiro-1.3.x/ws/core/src/main/java/org/apache/shiro/mgt/SecurityManager.java>:112:
warning - Tag @see: reference not found: Subject.Builder
[WARNING] <https://builds.apache.org/job/Shiro-1.3.x/ws/core/src/main/java/org/apache/shiro/realm/text/IniRealm.java>:45:
warning - Tag @link: reference not found: Ini.Section sections
[WARNING] <https://builds.apache.org/job/Shiro-1.3.x/ws/core/src/main/java/org/apache/shiro/crypto/hash/HashRequest.java>:129:
warning - Tag @link: reference not found: ByteSource.Util#isCompatible(Object) ByteSource.Util.isCompatible
[WARNING] <https://builds.apache.org/job/Shiro-1.3.x/ws/core/src/main/java/org/apache/shiro/crypto/hash/HashRequest.java>:168:
warning - Tag @link: reference not found: ByteSource.Util#isCompatible(Object) ByteSource.Util.isCompatible
[WARNING] <https://builds.apache.org/job/Shiro-1.3.x/ws/core/src/main/java/org/apache/shiro/authc/pam/package-info.java>:32:
warning - Tag @link: reference not found: AuthenticationStrategy
[WARNING] <https://builds.apache.org/job/Shiro-1.3.x/ws/core/src/main/java/org/apache/shiro/concurrent/package-info.java>:28:
warning - Tag @see: reference not found: SubjectAwareExecutor
[WARNING] <https://builds.apache.org/job/Shiro-1.3.x/ws/core/src/main/java/org/apache/shiro/concurrent/package-info.java>:28:
warning - Tag @see: reference not found: SubjectAwareExecutorService
[WARNING] <https://builds.apache.org/job/Shiro-1.3.x/ws/core/src/main/java/org/apache/shiro/concurrent/package-info.java>:28:
warning - Tag @see: reference not found: SubjectAwareScheduledExecutorService
[WARNING] <https://builds.apache.org/job/Shiro-1.3.x/ws/core/src/main/java/org/apache/shiro/env/package-info.java>:25:
warning - Tag @link: reference not found: Environment
[WARNING] <https://builds.apache.org/job/Shiro-1.3.x/ws/core/src/main/java/org/apache/shiro/env/package-info.java>:25:
warning - Tag @see: reference not found: Environment
[WARNING] <https://builds.apache.org/job/Shiro-1.3.x/ws/core/src/main/java/org/apache/shiro/functor/package-info.java>:30:
warning - Tag @link: reference not found: Translator
[WARNING] <https://builds.apache.org/job/Shiro-1.3.x/ws/core/src/main/java/org/apache/shiro/functor/package-info.java>:30:
warning - Tag @see: reference not found: Translator
[INFO] Building jar: <https://builds.apache.org/job/Shiro-1.3.x/ws/core/target/shiro-core-1.3.0-SNAPSHOT-javadoc.jar>
[INFO] 
[INFO] >>> maven-source-plugin:2.4:jar (attach-sources) > generate-sources @ shiro-core
>>>
[INFO] 
[INFO] --- buildnumber-maven-plugin:1.4:create (default) @ shiro-core ---
[INFO] Executing: /bin/sh -c cd '<https://builds.apache.org/job/Shiro-1.3.x/ws/core'>
&& 'git' 'rev-parse' '--verify' 'HEAD'
[INFO] Working directory: <https://builds.apache.org/job/Shiro-1.3.x/ws/core>
[INFO] Storing buildNumber: 84884e1f83982ee1f65950e04a62bfcb3c43e2fb at timestamp: 1467990178472
[WARNING] Cannot get the branch information from the git repository: 
Detecting the current branch failed: fatal: ref HEAD is not a symbolic ref

[INFO] Executing: /bin/sh -c cd '<https://builds.apache.org/job/Shiro-1.3.x/ws/core'>
&& 'git' 'rev-parse' '--verify' 'HEAD'
[INFO] Working directory: <https://builds.apache.org/job/Shiro-1.3.x/ws/core>
[INFO] Storing buildScmBranch: UNKNOWN
[WARNING] Failed to getClass for org.apache.maven.plugin.source.SourceJarMojo
[INFO] 
[INFO] <<< maven-source-plugin:2.4:jar (attach-sources) < generate-sources @ shiro-core
<<<
[INFO] 
[INFO] --- maven-source-plugin:2.4:jar (attach-sources) @ shiro-core ---
[INFO] Building jar: <https://builds.apache.org/job/Shiro-1.3.x/ws/core/target/shiro-core-1.3.0-SNAPSHOT-sources.jar>
[INFO] 
[INFO] --- maven-install-plugin:2.5.2:install (default-install) @ shiro-core ---
[INFO] Installing <https://builds.apache.org/job/Shiro-1.3.x/ws/core/target/shiro-core-1.3.0-SNAPSHOT.jar>
to /home/jenkins/jenkins-slave/maven-repositories/1/org/apache/shiro/shiro-core/1.3.0-SNAPSHOT/shiro-core-1.3.0-SNAPSHOT.jar
[INFO] Installing <https://builds.apache.org/job/Shiro-1.3.x/ws/core/pom.xml> to /home/jenkins/jenkins-slave/maven-repositories/1/org/apache/shiro/shiro-core/1.3.0-SNAPSHOT/shiro-core-1.3.0-SNAPSHOT.pom
[INFO] Installing <https://builds.apache.org/job/Shiro-1.3.x/ws/core/target/shiro-core-1.3.0-SNAPSHOT-tests.jar>
to /home/jenkins/jenkins-slave/maven-repositories/1/org/apache/shiro/shiro-core/1.3.0-SNAPSHOT/shiro-core-1.3.0-SNAPSHOT-tests.jar
[INFO] Installing <https://builds.apache.org/job/Shiro-1.3.x/ws/core/target/shiro-core-1.3.0-SNAPSHOT-javadoc.jar>
to /home/jenkins/jenkins-slave/maven-repositories/1/org/apache/shiro/shiro-core/1.3.0-SNAPSHOT/shiro-core-1.3.0-SNAPSHOT-javadoc.jar
[INFO] Installing <https://builds.apache.org/job/Shiro-1.3.x/ws/core/target/shiro-core-1.3.0-SNAPSHOT-sources.jar>
to /home/jenkins/jenkins-slave/maven-repositories/1/org/apache/shiro/shiro-core/1.3.0-SNAPSHOT/shiro-core-1.3.0-SNAPSHOT-sources.jar
[INFO] 
[INFO] --- maven-bundle-plugin:2.1.0:install (default-install) @ shiro-core ---
[INFO] Installing org/apache/shiro/shiro-core/1.3.0-SNAPSHOT/shiro-core-1.3.0-SNAPSHOT.jar
[INFO] Writing OBR metadata
[INFO] 
[INFO] --- maven-bundle-plugin:2.1.0:deploy (default-deploy) @ shiro-core ---
[INFO] Remote OBR update disabled (enable with -DremoteOBR)
[INFO] 
[INFO] --- nexus-staging-maven-plugin:1.6:deploy (injected-nexus-deploy) @ shiro-core ---
[INFO] Performing deferred deploys (gathering into "<https://builds.apache.org/job/Shiro-1.3.x/ws/target/nexus-staging/deferred")...>
[INFO] Installing <https://builds.apache.org/job/Shiro-1.3.x/ws/core/target/shiro-core-1.3.0-SNAPSHOT.jar>
to <https://builds.apache.org/job/Shiro-1.3.x/ws/target/nexus-staging/deferred/org/apache/shiro/shiro-core/1.3.0-SNAPSHOT/shiro-core-1.3.0-SNAPSHOT.jar>
[INFO] Installing <https://builds.apache.org/job/Shiro-1.3.x/ws/core/pom.xml> to <https://builds.apache.org/job/Shiro-1.3.x/ws/target/nexus-staging/deferred/org/apache/shiro/shiro-core/1.3.0-SNAPSHOT/shiro-core-1.3.0-SNAPSHOT.pom>
[INFO] Installing <https://builds.apache.org/job/Shiro-1.3.x/ws/core/target/shiro-core-1.3.0-SNAPSHOT-tests.jar>
to <https://builds.apache.org/job/Shiro-1.3.x/ws/target/nexus-staging/deferred/org/apache/shiro/shiro-core/1.3.0-SNAPSHOT/shiro-core-1.3.0-SNAPSHOT-tests.jar>
[INFO] Installing <https://builds.apache.org/job/Shiro-1.3.x/ws/core/target/shiro-core-1.3.0-SNAPSHOT-javadoc.jar>
to <https://builds.apache.org/job/Shiro-1.3.x/ws/target/nexus-staging/deferred/org/apache/shiro/shiro-core/1.3.0-SNAPSHOT/shiro-core-1.3.0-SNAPSHOT-javadoc.jar>
[INFO] Installing <https://builds.apache.org/job/Shiro-1.3.x/ws/core/target/shiro-core-1.3.0-SNAPSHOT-sources.jar>
to <https://builds.apache.org/job/Shiro-1.3.x/ws/target/nexus-staging/deferred/org/apache/shiro/shiro-core/1.3.0-SNAPSHOT/shiro-core-1.3.0-SNAPSHOT-sources.jar>
[INFO] Execution skipped to the last project...
[INFO]                                                                         
[INFO] ------------------------------------------------------------------------
[INFO] Building Apache Shiro :: Web 1.3.0-SNAPSHOT
[INFO] ------------------------------------------------------------------------
[INFO] 
[INFO] --- apache-rat-plugin:0.11:check (default-cli) @ shiro-web ---
[INFO] 51 implicit excludes (use -debug for more details).
[INFO] Exclude: **/.externalToolBuilders/*
[INFO] Exclude: **/infinitest.filters
[INFO] Exclude: velocity.log
[INFO] 128 resources included (use -debug for more details)
[INFO] Rat check: Summary of files. Unapproved: 1 unknown: 1 generated: 0 approved: 127 licence.
[INFO] ------------------------------------------------------------------------
[INFO] Reactor Summary:
[INFO] 
[INFO] Apache Shiro ....................................... SUCCESS [ 11.145 s]
[INFO] Apache Shiro :: Core ............................... SUCCESS [01:22 min]
[INFO] Apache Shiro :: Web ................................ FAILURE [  0.551 s]
[INFO] Apache Shiro :: Support :: AspectJ ................. SKIPPED
[INFO] Apache Shiro :: Support :: EHCache ................. SKIPPED
[INFO] Apache Shiro :: Support :: Quartz .................. SKIPPED
[INFO] Apache Shiro :: Support :: Spring .................. SKIPPED
[INFO] Apache Shiro :: Support :: Guice ................... SKIPPED
[INFO] Apache Shiro :: Support :: Karaf Features .......... SKIPPED
[INFO] Apache Shiro :: Support :: CAS ..................... SKIPPED
[INFO] Apache Shiro :: Support ............................ SKIPPED
[INFO] Apache Shiro :: Samples ............................ SKIPPED
[INFO] Apache Shiro :: Samples :: AspectJ ................. SKIPPED
[INFO] Apache Shiro :: Samples :: Quick Start ............. SKIPPED
[INFO] Apache Shiro :: Samples :: Web ..................... SKIPPED
[INFO] Apache Shiro :: Samples :: Spring Client ........... SKIPPED
[INFO] Apache Shiro :: Samples :: Spring .................. SKIPPED
[INFO] Apache Shiro :: Samples :: Spring-Hibernate ........ SKIPPED
[INFO] Apache Shiro :: Tools .............................. SKIPPED
[INFO] Apache Shiro :: Tools :: Hasher .................... SKIPPED
[INFO] Apache Shiro :: Jar Bundle ......................... SKIPPED
[INFO] ------------------------------------------------------------------------
[INFO] BUILD FAILURE
[INFO] ------------------------------------------------------------------------
[INFO] Total time: 01:55 min
[INFO] Finished at: 2016-07-08T15:03:16+00:00
[INFO] Final Memory: 50M/229M
[INFO] ------------------------------------------------------------------------
[ERROR] Failed to execute goal org.apache.rat:apache-rat-plugin:0.11:check (default-cli) on
project shiro-web: Too many files with unapproved license: 1 See RAT report in: <https://builds.apache.org/job/Shiro-1.3.x/ws/web/target/rat.txt>
-> [Help 1]
[ERROR] 
[ERROR] To see the full stack trace of the errors, re-run Maven with the -e switch.
[ERROR] Re-run Maven using the -X switch to enable full debug logging.
[ERROR] 
[ERROR] For more information about the errors and possible solutions, please read the following
articles:
[ERROR] [Help 1] http://cwiki.apache.org/confluence/display/MAVEN/MojoFailureException
[ERROR] 
[ERROR] After correcting the problems, you can resume the build with the command
[ERROR]   mvn <goals> -rf :shiro-web
[JENKINS] Archiving <https://builds.apache.org/job/Shiro-1.3.x/ws/support/pom.xml> to
org.apache.shiro/shiro-support/1.3.0-SNAPSHOT/shiro-support-1.3.0-SNAPSHOT.pom
[JENKINS] Archiving <https://builds.apache.org/job/Shiro-1.3.x/ws/samples/spring/pom.xml>
to org.apache.shiro.samples/samples-spring/1.3.0-SNAPSHOT/samples-spring-1.3.0-SNAPSHOT.pom
[JENKINS] Archiving <https://builds.apache.org/job/Shiro-1.3.x/ws/pom.xml> to org.apache.shiro/shiro-root/1.3.0-SNAPSHOT/shiro-root-1.3.0-SNAPSHOT.pom
[JENKINS] Archiving <https://builds.apache.org/job/Shiro-1.3.x/ws/target/shiro-root-1.3.0-SNAPSHOT-site.xml>
to org.apache.shiro/shiro-root/1.3.0-SNAPSHOT/shiro-root-1.3.0-SNAPSHOT-site.xml
Compressed 45.55 KB of artifacts by 70.2% relative to #12
[JENKINS] Archiving <https://builds.apache.org/job/Shiro-1.3.x/ws/samples/spring-hibernate/pom.xml>
to org.apache.shiro.samples/samples-sprhib/1.3.0-SNAPSHOT/samples-sprhib-1.3.0-SNAPSHOT.pom
[JENKINS] Archiving <https://builds.apache.org/job/Shiro-1.3.x/ws/samples/quickstart/pom.xml>
to org.apache.shiro.samples/samples-quickstart/1.3.0-SNAPSHOT/samples-quickstart-1.3.0-SNAPSHOT.pom
[JENKINS] Archiving <https://builds.apache.org/job/Shiro-1.3.x/ws/tools/hasher/pom.xml>
to org.apache.shiro.tools/shiro-tools-hasher/1.3.0-SNAPSHOT/shiro-tools-hasher-1.3.0-SNAPSHOT.pom
[JENKINS] Archiving <https://builds.apache.org/job/Shiro-1.3.x/ws/core/pom.xml> to org.apache.shiro/shiro-core/1.3.0-SNAPSHOT/shiro-core-1.3.0-SNAPSHOT.pom
[JENKINS] Archiving <https://builds.apache.org/job/Shiro-1.3.x/ws/core/target/shiro-core-1.3.0-SNAPSHOT.jar>
to org.apache.shiro/shiro-core/1.3.0-SNAPSHOT/shiro-core-1.3.0-SNAPSHOT.jar
[JENKINS] Archiving <https://builds.apache.org/job/Shiro-1.3.x/ws/core/target/shiro-core-1.3.0-SNAPSHOT-tests.jar>
to org.apache.shiro/shiro-core/1.3.0-SNAPSHOT/shiro-core-1.3.0-SNAPSHOT-tests.jar
[JENKINS] Archiving <https://builds.apache.org/job/Shiro-1.3.x/ws/core/target/shiro-core-1.3.0-SNAPSHOT-javadoc.jar>
to org.apache.shiro/shiro-core/1.3.0-SNAPSHOT/shiro-core-1.3.0-SNAPSHOT-javadoc.jar
[JENKINS] Archiving <https://builds.apache.org/job/Shiro-1.3.x/ws/core/target/shiro-core-1.3.0-SNAPSHOT-sources.jar>
to org.apache.shiro/shiro-core/1.3.0-SNAPSHOT/shiro-core-1.3.0-SNAPSHOT-sources.jar
[JENKINS] Archiving <https://builds.apache.org/job/Shiro-1.3.x/ws/support/aspectj/pom.xml>
to org.apache.shiro/shiro-aspectj/1.3.0-SNAPSHOT/shiro-aspectj-1.3.0-SNAPSHOT.pom
[JENKINS] Archiving <https://builds.apache.org/job/Shiro-1.3.x/ws/support/guice/pom.xml>
to org.apache.shiro/shiro-guice/1.3.0-SNAPSHOT/shiro-guice-1.3.0-SNAPSHOT.pom
[JENKINS] Archiving <https://builds.apache.org/job/Shiro-1.3.x/ws/support/cas/pom.xml>
to org.apache.shiro/shiro-cas/1.3.0-SNAPSHOT/shiro-cas-1.3.0-SNAPSHOT.pom
[JENKINS] Archiving <https://builds.apache.org/job/Shiro-1.3.x/ws/all/pom.xml> to org.apache.shiro/shiro-all/1.3.0-SNAPSHOT/shiro-all-1.3.0-SNAPSHOT.pom
[JENKINS] Archiving <https://builds.apache.org/job/Shiro-1.3.x/ws/samples/aspectj/pom.xml>
to org.apache.shiro.samples/samples-aspectj/1.3.0-SNAPSHOT/samples-aspectj-1.3.0-SNAPSHOT.pom
[JENKINS] Archiving <https://builds.apache.org/job/Shiro-1.3.x/ws/support/quartz/pom.xml>
to org.apache.shiro/shiro-quartz/1.3.0-SNAPSHOT/shiro-quartz-1.3.0-SNAPSHOT.pom
[JENKINS] Archiving <https://builds.apache.org/job/Shiro-1.3.x/ws/samples/spring-client/pom.xml>
to org.apache.shiro.samples/samples-spring-client/1.3.0-SNAPSHOT/samples-spring-client-1.3.0-SNAPSHOT.pom
[JENKINS] Archiving <https://builds.apache.org/job/Shiro-1.3.x/ws/samples/web/pom.xml>
to org.apache.shiro.samples/samples-web/1.3.0-SNAPSHOT/samples-web-1.3.0-SNAPSHOT.pom
[JENKINS] Archiving <https://builds.apache.org/job/Shiro-1.3.x/ws/web/pom.xml> to org.apache.shiro/shiro-web/1.3.0-SNAPSHOT/shiro-web-1.3.0-SNAPSHOT.pom
[JENKINS] Archiving <https://builds.apache.org/job/Shiro-1.3.x/ws/support/ehcache/pom.xml>
to org.apache.shiro/shiro-ehcache/1.3.0-SNAPSHOT/shiro-ehcache-1.3.0-SNAPSHOT.pom
[JENKINS] Archiving <https://builds.apache.org/job/Shiro-1.3.x/ws/tools/pom.xml> to
org.apache.shiro.tools/shiro-tools/1.3.0-SNAPSHOT/shiro-tools-1.3.0-SNAPSHOT.pom
[JENKINS] Archiving <https://builds.apache.org/job/Shiro-1.3.x/ws/support/spring/pom.xml>
to org.apache.shiro/shiro-spring/1.3.0-SNAPSHOT/shiro-spring-1.3.0-SNAPSHOT.pom
[JENKINS] Archiving <https://builds.apache.org/job/Shiro-1.3.x/ws/samples/pom.xml> to
org.apache.shiro.samples/shiro-samples/1.3.0-SNAPSHOT/shiro-samples-1.3.0-SNAPSHOT.pom
[JENKINS] Archiving <https://builds.apache.org/job/Shiro-1.3.x/ws/support/features/pom.xml>
to org.apache.shiro/shiro-features/1.3.0-SNAPSHOT/shiro-features-1.3.0-SNAPSHOT.pom
Sending e-mails to: commits@shiro.apache.org bdemers@apache.org
channel stopped

Mime
View raw message