shiro-commits mailing list archives

Site index · List index
Message view « Date » · « Thread »
Top « Date » · « Thread »
From Apache Jenkins Server <jenk...@builds.apache.org>
Subject Build failed in Jenkins: Shrio-1.4.x #5
Date Fri, 21 Oct 2016 14:37:07 GMT
See <https://builds.apache.org/job/Shrio-1.4.x/5/changes>

Changes:

[bdemers] SHIRO-586 - Change getRoleNamesForUser from private to protected so that

[bdemers] SHIRO-576 Updated dependency beanutils to version 1.9.3 in order to get

[bdemers] SHIRO-587 - Expose searchFilter as a property that can be set in the ini

[bdemers] Revert "SHIRO-462 - Changing swallowed exceptions to log.warn instead of

[bdemers] Cleaned up duplicated integration test code

[bdemers] Update groovy dependency version to 2.4.7

[bdemers] Updated Spring hibernate example to use hibernate 4

[bdemers] SHIRO-576 Added OWASP dependency check plugin

[bdemers] SHIRO-595 - Allow for POST method only logouts via the LogoutFilter

------------------------------------------
Started by user bdemers
[EnvInject] - Loading node environment variables.
Building remotely on beam2 (beam) in workspace <https://builds.apache.org/job/Shrio-1.4.x/ws/>
Wiping out workspace first.
Cloning the remote Git repository
Cloning repository git://git.apache.org/shiro.git
 > git init <https://builds.apache.org/job/Shrio-1.4.x/ws/> # timeout=10
Fetching upstream changes from git://git.apache.org/shiro.git
 > git --version # timeout=10
 > git -c core.askpass=true fetch --tags --progress git://git.apache.org/shiro.git +refs/heads/*:refs/remotes/origin/*
 > git config remote.origin.url git://git.apache.org/shiro.git # timeout=10
 > git config --add remote.origin.fetch +refs/heads/*:refs/remotes/origin/* # timeout=10
 > git config remote.origin.url git://git.apache.org/shiro.git # timeout=10
Fetching upstream changes from git://git.apache.org/shiro.git
 > git -c core.askpass=true fetch --tags --progress git://git.apache.org/shiro.git +refs/heads/*:refs/remotes/origin/*
 > git rev-parse refs/remotes/origin/1.4.x^{commit} # timeout=10
 > git rev-parse refs/remotes/origin/origin/1.4.x^{commit} # timeout=10
Checking out Revision 921753e82de6b7e55277a3be378e68035eea3af5 (refs/remotes/origin/1.4.x)
 > git config core.sparsecheckout # timeout=10
 > git checkout -f 921753e82de6b7e55277a3be378e68035eea3af5
 > git rev-list d8efb4fd12d09ca86ef8c47bf7e5a013e7991a87 # timeout=10
Parsing POMs
Discovered a new module org.apache.shiro.integrationtests:shiro-its-support Apache Shiro ::
ITs :: Support
Modules changed, recalculating dependency graph
Established TCP socket on 48269
maven32-agent.jar already up to date
maven32-interceptor.jar already up to date
maven3-interceptor-commons.jar already up to date
[Shrio-1.4.x] $ /home/jenkins/tools/java/latest1.7/bin/java -Xms128m -Xmx512m -XX:MaxPermSize=128m
-cp /home/jenkins/jenkins-slave/maven32-agent.jar:/home/jenkins/tools/maven/apache-maven-3.2.5/boot/plexus-classworlds-2.5.2.jar:/home/jenkins/tools/maven/apache-maven-3.2.5/conf/logging
jenkins.maven3.agent.Maven32Main /home/jenkins/tools/maven/apache-maven-3.2.5 /home/jenkins/jenkins-slave/slave.jar
/home/jenkins/jenkins-slave/maven32-interceptor.jar /home/jenkins/jenkins-slave/maven3-interceptor-commons.jar
48269
<===[JENKINS REMOTING CAPACITY]===>   channel started
Executing Maven:  -B -f <https://builds.apache.org/job/Shrio-1.4.x/ws/pom.xml> -Dmaven.repo.local=/home/jenkins/jenkins-slave/maven-repositories/1
-Pdocs apache-rat:check deploy
[INFO] Scanning for projects...
[INFO] Inspecting build with total of 37 modules...
[INFO] Installing Nexus Staging features:
[INFO]   ... total of 37 executions of maven-deploy-plugin replaced with nexus-staging-maven-plugin
[INFO] ------------------------------------------------------------------------
[INFO] Reactor Build Order:
[INFO] 
[INFO] Apache Shiro
[INFO] Apache Shiro :: Core
[INFO] Apache Shiro :: Web
[INFO] Apache Shiro :: Support :: AspectJ
[INFO] Apache Shiro :: Support :: EHCache
[INFO] Apache Shiro :: Support :: Hazelcast
[INFO] Apache Shiro :: Support :: Quartz
[INFO] Apache Shiro :: Support :: Spring
[INFO] Apache Shiro :: Support :: Guice
[INFO] Apache Shiro :: Support :: Karaf Features
[INFO] Apache Shiro :: Support :: CAS
[INFO] Apache Shiro :: Support :: Spring Boot Parent
[INFO] Apache Shiro :: Support :: Spring Boot
[INFO] Apache Shiro :: Support :: Spring Boot Web
[INFO] Apache Shiro :: Support
[INFO] Apache Shiro :: Support :: Servlet Plugin
[INFO] Apache Shiro :: Support :: JAX-RS
[INFO] Apache Shiro :: Samples
[INFO] Apache Shiro :: Samples :: AspectJ
[INFO] Apache Shiro :: Samples :: Quick Start
[INFO] Apache Shiro :: Integration Tests
[INFO] Apache Shiro :: ITs :: Support
[INFO] Apache Shiro :: Samples :: Web
[INFO] Apache Shiro :: Samples :: Spring Client
[INFO] Apache Shiro :: Samples :: Spring
[INFO] Apache Shiro :: Samples :: Spring-Hibernate
[INFO] Apache Shiro :: Samples :: Spring Boot Web
[INFO] Apache Shiro :: Samples :: Guice Web
[INFO] Apache Shiro :: Samples :: Quick Start Guice
[INFO] Apache Shiro :: Samples :: Servlet Plugin
[INFO] Apache Shiro :: Samples :: JAX-RS
[INFO] Apache Shiro :: Tools
[INFO] Apache Shiro :: Tools :: Hasher
[INFO] Apache Shiro :: Jar Bundle
[INFO] Apache Shiro :: ITs :: Guice 3
[INFO] Apache Shiro :: ITs :: Guice 4
[INFO] Apache Shiro :: Test Coverage
[INFO]                                                                         
[INFO] ------------------------------------------------------------------------
[INFO] Building Apache Shiro 1.4.0-SNAPSHOT
[INFO] ------------------------------------------------------------------------
[INFO] Downloading: https://repo.maven.apache.org/maven2/org/apache/maven/plugins/maven-failsafe-plugin/2.19.1/maven-failsafe-plugin-2.19.1.pom
[INFO] Downloaded: https://repo.maven.apache.org/maven2/org/apache/maven/plugins/maven-failsafe-plugin/2.19.1/maven-failsafe-plugin-2.19.1.pom
(0 B at 0.0 KB/sec)
[INFO] Downloading: https://repo.maven.apache.org/maven2/org/apache/maven/plugins/maven-failsafe-plugin/2.19.1/maven-failsafe-plugin-2.19.1.jar
[INFO] Downloaded: https://repo.maven.apache.org/maven2/org/apache/maven/plugins/maven-failsafe-plugin/2.19.1/maven-failsafe-plugin-2.19.1.jar
(0 B at 0.0 KB/sec)
[INFO] Downloading: https://repo.maven.apache.org/maven2/org/hamcrest/java-hamcrest/2.0.0.0/java-hamcrest-2.0.0.0.pom
[INFO] Downloaded: https://repo.maven.apache.org/maven2/org/hamcrest/java-hamcrest/2.0.0.0/java-hamcrest-2.0.0.0.pom
(2 KB at 32.1 KB/sec)
[INFO] Downloading: https://repo.maven.apache.org/maven2/org/codehaus/groovy/groovy-all/2.4.7/groovy-all-2.4.7.pom
[INFO] Downloaded: https://repo.maven.apache.org/maven2/org/codehaus/groovy/groovy-all/2.4.7/groovy-all-2.4.7.pom
(20 KB at 268.3 KB/sec)
[INFO] Downloading: https://repo.maven.apache.org/maven2/org/powermock/powermock-module-junit4/1.6.5/powermock-module-junit4-1.6.5.pom
[INFO] Downloaded: https://repo.maven.apache.org/maven2/org/powermock/powermock-module-junit4/1.6.5/powermock-module-junit4-1.6.5.pom
(2 KB at 52.2 KB/sec)
[INFO] Downloading: https://repo.maven.apache.org/maven2/org/powermock/powermock-api-easymock/1.6.5/powermock-api-easymock-1.6.5.pom
[INFO] Downloaded: https://repo.maven.apache.org/maven2/org/powermock/powermock-api-easymock/1.6.5/powermock-api-easymock-1.6.5.pom
(2 KB at 38.5 KB/sec)
[INFO] Downloading: https://repo.maven.apache.org/maven2/org/hamcrest/java-hamcrest/2.0.0.0/java-hamcrest-2.0.0.0.jar
[INFO] Downloading: https://repo.maven.apache.org/maven2/org/codehaus/groovy/groovy-all/2.4.7/groovy-all-2.4.7.jar
[INFO] Downloading: https://repo.maven.apache.org/maven2/org/powermock/powermock-module-junit4/1.6.5/powermock-module-junit4-1.6.5.jar
[INFO] Downloading: https://repo.maven.apache.org/maven2/org/powermock/powermock-api-easymock/1.6.5/powermock-api-easymock-1.6.5.jar
[INFO] Downloaded: https://repo.maven.apache.org/maven2/org/hamcrest/java-hamcrest/2.0.0.0/java-hamcrest-2.0.0.0.jar
(111 KB at 1490.3 KB/sec)
[INFO] Downloaded: https://repo.maven.apache.org/maven2/org/powermock/powermock-api-easymock/1.6.5/powermock-api-easymock-1.6.5.jar
(53 KB at 585.9 KB/sec)
[INFO] Downloaded: https://repo.maven.apache.org/maven2/org/powermock/powermock-module-junit4/1.6.5/powermock-module-junit4-1.6.5.jar
(46 KB at 500.1 KB/sec)
[INFO] Downloaded: https://repo.maven.apache.org/maven2/org/codehaus/groovy/groovy-all/2.4.7/groovy-all-2.4.7.jar
(6852 KB at 11853.0 KB/sec)
[INFO] 
[INFO] --- apache-rat-plugin:0.11:check (default-cli) @ shiro-root ---
[INFO] 59 implicit excludes (use -debug for more details).
[INFO] Exclude: **/.externalToolBuilders/*
[INFO] Exclude: **/infinitest.filters
[INFO] Exclude: velocity.log
[INFO] Exclude: **/*.json
[INFO] Exclude: **/spring.factories
[INFO] Exclude: **/spring.provides
[INFO] 12 resources included (use -debug for more details)
[INFO] Rat check: Summary of files. Unapproved: 1 unknown: 1 generated: 0 approved: 5 licence.
[INFO] ------------------------------------------------------------------------
[INFO] Reactor Summary:
[INFO] 
[INFO] Apache Shiro ....................................... FAILURE [  4.923 s]
[INFO] Apache Shiro :: Core ............................... SKIPPED
[INFO] Apache Shiro :: Web ................................ SKIPPED
[INFO] Apache Shiro :: Support :: AspectJ ................. SKIPPED
[INFO] Apache Shiro :: Support :: EHCache ................. SKIPPED
[INFO] Apache Shiro :: Support :: Hazelcast ............... SKIPPED
[INFO] Apache Shiro :: Support :: Quartz .................. SKIPPED
[INFO] Apache Shiro :: Support :: Spring .................. SKIPPED
[INFO] Apache Shiro :: Support :: Guice ................... SKIPPED
[INFO] Apache Shiro :: Support :: Karaf Features .......... SKIPPED
[INFO] Apache Shiro :: Support :: CAS ..................... SKIPPED
[INFO] Apache Shiro :: Support :: Spring Boot Parent ...... SKIPPED
[INFO] Apache Shiro :: Support :: Spring Boot ............. SKIPPED
[INFO] Apache Shiro :: Support :: Spring Boot Web ......... SKIPPED
[INFO] Apache Shiro :: Support ............................ SKIPPED
[INFO] Apache Shiro :: Support :: Servlet Plugin .......... SKIPPED
[INFO] Apache Shiro :: Support :: JAX-RS .................. SKIPPED
[INFO] Apache Shiro :: Samples ............................ SKIPPED
[INFO] Apache Shiro :: Samples :: AspectJ ................. SKIPPED
[INFO] Apache Shiro :: Samples :: Quick Start ............. SKIPPED
[INFO] Apache Shiro :: Integration Tests .................. SKIPPED
[INFO] Apache Shiro :: ITs :: Support ..................... SKIPPED
[INFO] Apache Shiro :: Samples :: Web ..................... SKIPPED
[INFO] Apache Shiro :: Samples :: Spring Client ........... SKIPPED
[INFO] Apache Shiro :: Samples :: Spring .................. SKIPPED
[INFO] Apache Shiro :: Samples :: Spring-Hibernate ........ SKIPPED
[INFO] Apache Shiro :: Samples :: Spring Boot Web ......... SKIPPED
[INFO] Apache Shiro :: Samples :: Guice Web ............... SKIPPED
[INFO] Apache Shiro :: Samples :: Quick Start Guice ....... SKIPPED
[INFO] Apache Shiro :: Samples :: Servlet Plugin .......... SKIPPED
[INFO] Apache Shiro :: Samples :: JAX-RS .................. SKIPPED
[INFO] Apache Shiro :: Tools .............................. SKIPPED
[INFO] Apache Shiro :: Tools :: Hasher .................... SKIPPED
[INFO] Apache Shiro :: Jar Bundle ......................... SKIPPED
[INFO] Apache Shiro :: ITs :: Guice 3 ..................... SKIPPED
[INFO] Apache Shiro :: ITs :: Guice 4 ..................... SKIPPED
[INFO] Apache Shiro :: Test Coverage ...................... SKIPPED
[INFO] ------------------------------------------------------------------------
[INFO] BUILD FAILURE
[INFO] ------------------------------------------------------------------------
[INFO] Total time: 19.350 s
[INFO] Finished at: 2016-10-21T14:36:54+00:00
[INFO] Final Memory: 36M/233M
[INFO] ------------------------------------------------------------------------
[ERROR] Failed to execute goal org.apache.rat:apache-rat-plugin:0.11:check (default-cli) on
project shiro-root: Too many files with unapproved license: 1 See RAT report in: <https://builds.apache.org/job/Shrio-1.4.x/ws/target/rat.txt>
-> [Help 1]
[ERROR] 
[ERROR] To see the full stack trace of the errors, re-run Maven with the -e switch.
[ERROR] Re-run Maven using the -X switch to enable full debug logging.
[ERROR] 
[ERROR] For more information about the errors and possible solutions, please read the following
articles:
[ERROR] [Help 1] http://cwiki.apache.org/confluence/display/MAVEN/MojoFailureException
[JENKINS] Archiving <https://builds.apache.org/job/Shrio-1.4.x/ws/samples/jaxrs/pom.xml>
to org.apache.shiro.samples/samples-jaxrs/1.4.0-SNAPSHOT/samples-jaxrs-1.4.0-SNAPSHOT.pom
[JENKINS] Archiving <https://builds.apache.org/job/Shrio-1.4.x/ws/support/spring-boot/spring-boot-web-starter/pom.xml>
to org.apache.shiro/shiro-spring-boot-web-starter/1.4.0-SNAPSHOT/shiro-spring-boot-web-starter-1.4.0-SNAPSHOT.pom
[JENKINS] Archiving <https://builds.apache.org/job/Shrio-1.4.x/ws/tools/pom.xml> to
org.apache.shiro.tools/shiro-tools/1.4.0-SNAPSHOT/shiro-tools-1.4.0-SNAPSHOT.pom
[JENKINS] Archiving <https://builds.apache.org/job/Shrio-1.4.x/ws/samples/servlet-plugin/pom.xml>
to org.apache.shiro.samples/samples-servlet-plugin/1.4.0-SNAPSHOT/samples-servlet-plugin-1.4.0-SNAPSHOT.pom
[JENKINS] Archiving <https://builds.apache.org/job/Shrio-1.4.x/ws/samples/spring-hibernate/pom.xml>
to org.apache.shiro.samples/samples-sprhib/1.4.0-SNAPSHOT/samples-sprhib-1.4.0-SNAPSHOT.pom
[JENKINS] Archiving <https://builds.apache.org/job/Shrio-1.4.x/ws/test-coverage/pom.xml>
to org.apache.shiro/shiro-test-coverage/1.4.0-SNAPSHOT/shiro-test-coverage-1.4.0-SNAPSHOT.pom
[JENKINS] Archiving <https://builds.apache.org/job/Shrio-1.4.x/ws/support/cas/pom.xml>
to org.apache.shiro/shiro-cas/1.4.0-SNAPSHOT/shiro-cas-1.4.0-SNAPSHOT.pom
[JENKINS] Archiving <https://builds.apache.org/job/Shrio-1.4.x/ws/support/aspectj/pom.xml>
to org.apache.shiro/shiro-aspectj/1.4.0-SNAPSHOT/shiro-aspectj-1.4.0-SNAPSHOT.pom
[JENKINS] Archiving <https://builds.apache.org/job/Shrio-1.4.x/ws/samples/pom.xml> to
org.apache.shiro.samples/shiro-samples/1.4.0-SNAPSHOT/shiro-samples-1.4.0-SNAPSHOT.pom
[JENKINS] Archiving <https://builds.apache.org/job/Shrio-1.4.x/ws/web/pom.xml> to org.apache.shiro/shiro-web/1.4.0-SNAPSHOT/shiro-web-1.4.0-SNAPSHOT.pom
[JENKINS] Archiving <https://builds.apache.org/job/Shrio-1.4.x/ws/support/hazelcast/pom.xml>
to org.apache.shiro/shiro-hazelcast/1.4.0-SNAPSHOT/shiro-hazelcast-1.4.0-SNAPSHOT.pom
[JENKINS] Archiving <https://builds.apache.org/job/Shrio-1.4.x/ws/support/quartz/pom.xml>
to org.apache.shiro/shiro-quartz/1.4.0-SNAPSHOT/shiro-quartz-1.4.0-SNAPSHOT.pom
[JENKINS] Archiving <https://builds.apache.org/job/Shrio-1.4.x/ws/core/pom.xml> to org.apache.shiro/shiro-core/1.4.0-SNAPSHOT/shiro-core-1.4.0-SNAPSHOT.pom
[JENKINS] Archiving <https://builds.apache.org/job/Shrio-1.4.x/ws/pom.xml> to org.apache.shiro/shiro-root/1.4.0-SNAPSHOT/shiro-root-1.4.0-SNAPSHOT.pom
[JENKINS] Archiving <https://builds.apache.org/job/Shrio-1.4.x/ws/samples/aspectj/pom.xml>
to org.apache.shiro.samples/samples-aspectj/1.4.0-SNAPSHOT/samples-aspectj-1.4.0-SNAPSHOT.pom
[JENKINS] Archiving <https://builds.apache.org/job/Shrio-1.4.x/ws/samples/spring-boot-web/pom.xml>
to org.apache.shiro.samples/samples-spring-boot-web/1.4.0-SNAPSHOT/samples-spring-boot-web-1.4.0-SNAPSHOT.pom
[JENKINS] Archiving <https://builds.apache.org/job/Shrio-1.4.x/ws/samples/spring-client/pom.xml>
to org.apache.shiro.samples/samples-spring-client/1.4.0-SNAPSHOT/samples-spring-client-1.4.0-SNAPSHOT.pom
[JENKINS] Archiving <https://builds.apache.org/job/Shrio-1.4.x/ws/tools/hasher/pom.xml>
to org.apache.shiro.tools/shiro-tools-hasher/1.4.0-SNAPSHOT/shiro-tools-hasher-1.4.0-SNAPSHOT.pom
[JENKINS] Archiving <https://builds.apache.org/job/Shrio-1.4.x/ws/support/ehcache/pom.xml>
to org.apache.shiro/shiro-ehcache/1.4.0-SNAPSHOT/shiro-ehcache-1.4.0-SNAPSHOT.pom
[JENKINS] Archiving <https://builds.apache.org/job/Shrio-1.4.x/ws/samples/quickstart/pom.xml>
to org.apache.shiro.samples/samples-quickstart/1.4.0-SNAPSHOT/samples-quickstart-1.4.0-SNAPSHOT.pom
[JENKINS] Archiving <https://builds.apache.org/job/Shrio-1.4.x/ws/support/spring-boot/pom.xml>
to org.apache.shiro/shiro-spring-boot/1.4.0-SNAPSHOT/shiro-spring-boot-1.4.0-SNAPSHOT.pom
[JENKINS] Archiving <https://builds.apache.org/job/Shrio-1.4.x/ws/samples/spring/pom.xml>
to org.apache.shiro.samples/samples-spring/1.4.0-SNAPSHOT/samples-spring-1.4.0-SNAPSHOT.pom
[JENKINS] Archiving <https://builds.apache.org/job/Shrio-1.4.x/ws/support/spring-boot/spring-boot-starter/pom.xml>
to org.apache.shiro/shiro-spring-boot-starter/1.4.0-SNAPSHOT/shiro-spring-boot-starter-1.4.0-SNAPSHOT.pom
[JENKINS] Archiving <https://builds.apache.org/job/Shrio-1.4.x/ws/support/pom.xml> to
org.apache.shiro/shiro-support/1.4.0-SNAPSHOT/shiro-support-1.4.0-SNAPSHOT.pom
[JENKINS] Archiving <https://builds.apache.org/job/Shrio-1.4.x/ws/support/jaxrs/pom.xml>
to org.apache.shiro/shiro-jaxrs/1.4.0-SNAPSHOT/shiro-jaxrs-1.4.0-SNAPSHOT.pom
[JENKINS] Archiving <https://builds.apache.org/job/Shrio-1.4.x/ws/samples/guice/pom.xml>
to org.apache.shiro.samples/samples-guice/1.4.0-SNAPSHOT/samples-guice-1.4.0-SNAPSHOT.pom
[JENKINS] Archiving <https://builds.apache.org/job/Shrio-1.4.x/ws/support/features/pom.xml>
to org.apache.shiro/shiro-features/1.4.0-SNAPSHOT/shiro-features-1.4.0-SNAPSHOT.pom
[JENKINS] Archiving <https://builds.apache.org/job/Shrio-1.4.x/ws/integration-tests/support/pom.xml>
to org.apache.shiro.integrationtests/shiro-its-support/1.4.0-SNAPSHOT/shiro-its-support-1.4.0-SNAPSHOT.pom
No prior successful build to compare, so performing full copy of artifacts
[JENKINS] Archiving <https://builds.apache.org/job/Shrio-1.4.x/ws/samples/web/pom.xml>
to org.apache.shiro.samples/samples-web/1.4.0-SNAPSHOT/samples-web-1.4.0-SNAPSHOT.pom
[JENKINS] Archiving <https://builds.apache.org/job/Shrio-1.4.x/ws/support/servlet-plugin/pom.xml>
to org.apache.shiro/shiro-servlet-plugin/1.4.0-SNAPSHOT/shiro-servlet-plugin-1.4.0-SNAPSHOT.pom
[JENKINS] Archiving <https://builds.apache.org/job/Shrio-1.4.x/ws/support/spring/pom.xml>
to org.apache.shiro/shiro-spring/1.4.0-SNAPSHOT/shiro-spring-1.4.0-SNAPSHOT.pom
[JENKINS] Archiving <https://builds.apache.org/job/Shrio-1.4.x/ws/integration-tests/pom.xml>
to org.apache.shiro.integrationtests/shiro-integration-tests/1.4.0-SNAPSHOT/shiro-integration-tests-1.4.0-SNAPSHOT.pom
[JENKINS] Archiving <https://builds.apache.org/job/Shrio-1.4.x/ws/integration-tests/guice3/pom.xml>
to org.apache.shiro.integrationtests/shiro-its-guice3/1.4.0-SNAPSHOT/shiro-its-guice3-1.4.0-SNAPSHOT.pom
[JENKINS] Archiving <https://builds.apache.org/job/Shrio-1.4.x/ws/support/guice/pom.xml>
to org.apache.shiro/shiro-guice/1.4.0-SNAPSHOT/shiro-guice-1.4.0-SNAPSHOT.pom
[JENKINS] Archiving <https://builds.apache.org/job/Shrio-1.4.x/ws/integration-tests/guice4/pom.xml>
to org.apache.shiro.integrationtests/shiro-its-guice4/1.4.0-SNAPSHOT/shiro-its-guice4-1.4.0-SNAPSHOT.pom
[JENKINS] Archiving <https://builds.apache.org/job/Shrio-1.4.x/ws/samples/quickstart-guice/pom.xml>
to org.apache.shiro.samples/samples-quickstart-guice/1.4.0-SNAPSHOT/samples-quickstart-guice-1.4.0-SNAPSHOT.pom
[JENKINS] Archiving <https://builds.apache.org/job/Shrio-1.4.x/ws/all/pom.xml> to org.apache.shiro/shiro-all/1.4.0-SNAPSHOT/shiro-all-1.4.0-SNAPSHOT.pom
Sending e-mails to: commits@shiro.apache.org bdemers@apache.org
channel stopped

Mime
View raw message