spark-dev mailing list archives

Site index · List index
Message view « Date » · « Thread »
Top « Date » · « Thread »
From Jacek Laskowski <ja...@japila.pl>
Subject BUILD FAILURE due to...Unable to find configuration file at location dev/scalastyle-config.xml
Date Tue, 08 Mar 2016 07:38:22 GMT
Hi,

Got the BUILD FAILURE. Anyone looking into it?

➜  spark git:(master) ✗ ./build/mvn -Pyarn -Phadoop-2.6
-Dhadoop.version=2.7.2 -Phive -Phive-thriftserver -DskipTests clean
install
...
[INFO] ------------------------------------------------------------------------
[INFO] BUILD FAILURE
[INFO] ------------------------------------------------------------------------
[INFO] Total time: 2.837 s
[INFO] Finished at: 2016-03-08T08:19:36+01:00
[INFO] Final Memory: 50M/581M
[INFO] ------------------------------------------------------------------------
[ERROR] Failed to execute goal
org.scalastyle:scalastyle-maven-plugin:0.8.0:check (default) on
project spark-parent_2.11: Failed during scalastyle execution: Unable
to find configuration file at location dev/scalastyle-config.xml ->
[Help 1]
[ERROR]
[ERROR] To see the full stack trace of the errors, re-run Maven with
the -e switch.
[ERROR] Re-run Maven using the -X switch to enable full debug logging.
[ERROR]
[ERROR] For more information about the errors and possible solutions,
please read the following articles:
[ERROR] [Help 1]
http://cwiki.apache.org/confluence/display/MAVEN/MojoExecutionException

Pozdrawiam,
Jacek Laskowski
----
https://medium.com/@jaceklaskowski/
Mastering Apache Spark http://bit.ly/mastering-apache-spark
Follow me at https://twitter.com/jaceklaskowski

---------------------------------------------------------------------
To unsubscribe, e-mail: dev-unsubscribe@spark.apache.org
For additional commands, e-mail: dev-help@spark.apache.org


Mime
View raw message