spark-user mailing list archives

Site index · List index
Message view « Date » · « Thread »
Top « Date » · « Thread »
From "Boavida, Rodrigo" <Rodrigo.Boav...@Aspect.com>
Subject RE: Scala 2.11 and Akka 2.4.0
Date Tue, 01 Dec 2015 15:32:34 GMT
No, Akka 2.4.0 does not support Scala 2.10 that is why it’s not found.

One other things I just found was that after running the script to change the build to Scala
2.11, the Scala version isn’t changed in the main pom.xml . I’ve tried to change it but
with no luck.

Here is what the dependency stack is looking:

Downloading: https://repo1.maven.org/maven2/com/twitter/chill_2.10/0.5.0/chill_2.10-0.5.0.pom
Downloaded: https://repo1.maven.org/maven2/com/twitter/chill_2.10/0.5.0/chill_2.10-0.5.0.pom
(3 KB at 30.5 KB/sec)
Downloading: https://repo1.maven.org/maven2/org/apache/hadoop/hadoop-client/2.2.0/hadoop-client-2.2.0.pom
Downloaded: https://repo1.maven.org/maven2/org/apache/hadoop/hadoop-client/2.2.0/hadoop-client-2.2.0.pom
(11 KB at 117.4 KB/sec)
Downloading: https://repo1.maven.org/maven2/org/apache/hadoop/hadoop-project-dist/2.2.0/hadoop-project-dist-2.2.0.pom
Downloaded: https://repo1.maven.org/maven2/org/apache/hadoop/hadoop-project-dist/2.2.0/hadoop-project-dist-2.2.0.pom
(18 KB at 250.3 KB/sec)
Downloading: https://repo1.maven.org/maven2/org/apache/hadoop/hadoop-project/2.2.0/hadoop-project-2.2.0.pom
Downloaded: https://repo1.maven.org/maven2/org/apache/hadoop/hadoop-project/2.2.0/hadoo-project-2.2.0.pom
(37 KB at 421.9 KB/sec)
Downloading: https://repo1.maven.org/maven2/org/apache/hadoop/hadoop-main/2.2.0/hadoop-main-2.2.0.pom
Downloaded: https://repo1.maven.org/maven2/org/apache/hadoop/hadoop-main/2.2.0/hadoop-main-2.2.0.pom
(17 KB at 224.7 KB/sec)
Downloading: https://repo1.maven.org/maven2/org/apache/hadoop/hadoop-common/2.2.0/hadoop-common-2.2.0.pom
Downloaded: https://repo1.maven.org/maven2/org/apache/hadoop/hadoop-common/2.2.0/hadoop-common-2.2.0.pom
(27 KB at 312.4 KB/sec)
Downloading: https://repo1.maven.org/maven2/org/apache/hadoop/hadoop-annotations/2.2.0/hadoop-annotations-2.2.0.pom
Downloaded: https://repo1.maven.org/maven2/org/apache/hadoop/hadoop-annotations/2.2.0/hadoop-annotations-2.2.0.pom
(3 KB at 39.5 KB/sec)
Downloading: https://repo1.maven.org/maven2/org/apache/commons/commons-math/2.1/commons-math-2.1.pom
Downloaded: https://repo1.maven.org/maven2/org/apache/commons/commons-math/2.1/commons-math-2.1.pom
(11 KB at 140.0 KB/sec)
Downloading: https://repo1.maven.org/maven2/org/apache/commons/commons-parent/14/commons-parent-14.pom
Downloaded: https://repo1.maven.org/maven2/org/apache/commons/commons-parent/14/commons-parent-14.pom
(31 KB at 369.3 KB/sec)
Downloading: https://repo1.maven.org/maven2/org/apache/hadoop/hadoop-auth/2.2.0/hadoop-auth-2.2.0.pom
Downloaded: https://repo1.maven.org/maven2/org/apache/hadoop/hadoop-auth/2.2.0/hadoop-auth-2.2.0.pom
(7 KB at 98.0 KB/sec)
Downloading: https://repo1.maven.org/maven2/org/apache/hadoop/hadoop-hdfs/2.2.0/hadoop-hdfs-2.2.0.pom
Downloaded: https://repo1.maven.org/maven2/org/apache/hadoop/hadoop-hdfs/2.2.0/hadoop-hdfs-2.2.0.pom
(24 KB at 300.8 KB/sec)
Downloading: https://repo1.maven.org/maven2/org/apache/hadoop/hadoop-mapreduce-client-app/2.2.0/hadoop-mapreduce-client-app-2.2.0.pom
Downloaded: https://repo1.maven.org/maven2/org/apache/hadoop/hadoop-mapreduce-client-app/2.2.0/hadoop-mapreduce-client-app-2.2.0.pom
(5 KB at 69.4 KB/sec)
Downloading: https://repo1.maven.org/maven2/org/apache/hadoop/hadoop-mapreduce-client/2.2.0/hadoop-mapreduce-client-2.2.0.pom
Downloaded: https://repo1.maven.org/maven2/org/apache/hadoop/hadoop-mapreduce-client/2.2.0/hadoop-mapreduce-client-2.2.0.pom
(7 KB at 97.1 KB/sec)
Downloading: https://repo1.maven.org/maven2/org/apache/hadoop/hadoop-mapreduce-client-common/2.2.0/hadoop-mapreduce-client-common-2.2.0.pom
Downloaded: https://repo1.maven.org/maven2/org/apache/hadoop/hadoop-mapreduce-client-common/2.2.0/hadoop-mapreduce-client-common-2.2.0.pom
(4 KB at 55.1 KB/sec)
Downloading: https://repo1.maven.org/maven2/org/apache/hadoop/hadoop-yarn-common/2.2.0/hadoop-yarn-common-2.2.0.pom
Downloaded: https://repo1.maven.org/maven2/org/apache/hadoop/hadoop-yarn-common/2.2.0/hadoop-yarn-common-2.2.0.pom
(5 KB at 78.0 KB/sec)
Downloading: https://repo1.maven.org/maven2/org/apache/hadoop/hadoop-yarn/2.2.0/hadoop-yarn-2.2.0.pom
Downloaded: https://repo1.maven.org/maven2/org/apache/hadoop/hadoop-yarn/2.2.0/hadoop-yarn-2.2.0.pom
(7 KB at 88.4 KB/sec)
Downloading: https://repo1.maven.org/maven2/org/apache/hadoop/hadoop-yarn-api/2.2.0/hadoop-yarn-api-2.2.0.pom
Downloaded: https://repo1.maven.org/maven2/org/apache/hadoop/hadoop-yarn-api/2.2.0/hadoop-yarn-api-2.2.0.pom
(3 KB at 46.6 KB/sec)
Downloading: https://repo1.maven.org/maven2/com/sun/jersey/jersey-test-framework/jersey-test-framework-grizzly2/1.9/jersey-test-framework-grizzly2-1.9.pom
Downloaded: https://repo1.maven.org/maven2/com/sun/jersey/jersey-test-framework/jersey-test-framework-grizzly2/1.9/jersey-test-framework-grizzly2-1.9.pom
(7 KB at 87.1 KB/sec)
Downloading: https://repo1.maven.org/maven2/com/sun/jersey/jersey-test-framework/1.9/jersey-test-framework-1.9.pom
Downloaded: https://repo1.maven.org/maven2/com/sun/jersey/jersey-test-framework/1.9/jersey-test-framework-1.9.pom
(3 KB at 46.7 KB/sec)
Downloading: https://repo1.maven.org/maven2/com/sun/jersey/jersey-test-framework/jersey-test-framework-core/1.9/jersey-test-framework-core-1.9.pom
Downloaded: https://repo1.maven.org/maven2/com/sun/jersey/jersey-test-framework/jersey-test-framework-core/1.9/jersey-test-framework-core-1.9.pom
(7 KB at 91.5 KB/sec)
Downloading: https://repo1.maven.org/maven2/javax/servlet/javax.servlet-api/3.0.1/javax.servlet-api-3.0.1.pom
Downloaded: https://repo1.maven.org/maven2/javax/servlet/javax.servlet-api/3.0.1/javax.servlet-api-3.0.1.pom
(13 KB at 150.5 KB/sec)
Downloading: https://repo1.maven.org/maven2/com/sun/jersey/jersey-grizzly2/1.9/jersey-grizzly2-1.9.pom
Downloaded: https://repo1.maven.org/maven2/com/sun/jersey/jersey-grizzly2/1.9/jersey-grizzly2-1.9.pom
(6 KB at 74.6 KB/sec)
Downloading: https://repo1.maven.org/maven2/org/glassfish/grizzly/grizzly-http/2.1.2/grizzly-http-2.1.2.pom
Downloaded: https://repo1.maven.org/maven2/org/glassfish/grizzly/grizzly-http/2.1.2/grizzly-http-2.1.2.pom
(5 KB at 59.0 KB/sec)
Downloading: https://repo1.maven.org/maven2/org/glassfish/grizzly/grizzly-project/2.1.2/grizzly-project-2.1.2.pom
Downloaded: https://repo1.maven.org/maven2/org/glassfish/grizzly/grizzly-project/2.1.2/grizzly-project-2.1.2.pom
(17 KB at 173.6 KB/sec)
Downloading: https://repo1.maven.org/maven2/org/glassfish/grizzly/grizzly-framework/2.1.2/grizzly-framework-2.1.2.pom
Downloaded: https://repo1.maven.org/maven2/org/glassfish/grizzly/grizzly-framework/2.1.2/grizzly-framework-2.1.2.pom
(7 KB at 91.9 KB/sec)
Downloading: https://repo1.maven.org/maven2/org/glassfish/gmbal/gmbal-api-only/3.0.0-b023/gmbal-api-only-3.0.0-b023.pom
Downloaded: https://repo1.maven.org/maven2/org/glassfish/gmbal/gmbal-api-only/3.0.0-b023/gmbal-api-only-3.0.0-b023.pom
(6 KB at 82.8 KB/sec)
Downloading: https://repo1.maven.org/maven2/org/glassfish/external/management-api/3.0.0-b012/management-api-3.0.0-b012.pom
Downloaded: https://repo1.maven.org/maven2/org/glassfish/external/management-api/3.0.0-b012/management-api-3.0.0-b012.pom
(3 KB at 44.2 KB/sec)
Downloading: https://repo1.maven.org/maven2/org/glassfish/grizzly/grizzly-http-server/2.1.2/grizzly-http-server-2.1.2.pom
Downloaded: https://repo1.maven.org/maven2/org/glassfish/grizzly/grizzly-http-server/2.1.2/grizzly-http-server-2.1.2.pom
(5 KB at 72.5 KB/sec)
Downloading: https://repo1.maven.org/maven2/org/glassfish/grizzly/grizzly-rcm/2.1.2/grizzly-rcm-2.1.2.pom
Downloaded: https://repo1.maven.org/maven2/org/glassfish/grizzly/grizzly-rcm/2.1.2/grizzly-rcm-2.1.2.pom
(4 KB at 45.2 KB/sec)
Downloading: https://repo1.maven.org/maven2/org/glassfish/grizzly/grizzly-http-servlet/2.1.2/grizzly-http-servlet-2.1.2.pom
Downloaded: https://repo1.maven.org/maven2/org/glassfish/grizzly/grizzly-http-servlet/2.1.2/grizzly-http-servlet-2.1.2.pom
(7 KB at 100.9 KB/sec)
Downloading: https://repo1.maven.org/maven2/org/glassfish/javax.servlet/3.1/javax.servlet-3.1.pom
Downloaded: https://repo1.maven.org/maven2/org/glassfish/javax.servlet/3.1/javax.servlet-3.1.pom
(5 KB at 67.8 KB/sec)
Downloading: https://repo1.maven.org/maven2/org/glassfish/api-pom/3.1/api-pom-3.1.pom
Downloaded: https://repo1.maven.org/maven2/org/glassfish/api-pom/3.1/api-pom-3.1.pom (5 KB
at 81.5 KB/sec)
Downloading: https://repo1.maven.org/maven2/org/glassfish/glassfish-parent/3.1/glassfish-parent-3.1.pom
Downloaded: https://repo1.maven.org/maven2/org/glassfish/glassfish-parent/3.1/glassfish-parent-3.1.pom
(59 KB at 558.3 KB/sec)
Downloading: https://repo1.maven.org/maven2/org/glassfish/pom/8/pom-8.pom
Downloaded: https://repo1.maven.org/maven2/org/glassfish/pom/8/pom-8.pom (11 KB at 143.1 KB/sec)
Downloading: https://repo1.maven.org/maven2/org/apache/hadoop/hadoop-yarn-client/2.2.0/hadoop-yarn-client-2.2.0.pom
Downloaded: https://repo1.maven.org/maven2/org/apache/hadoop/hadoop-yarn-client/2.2.0/hadoop-yarn-client-2.2.0.pom
(2 KB at 32.5 KB/sec)
Downloading: https://repo1.maven.org/maven2/org/apache/hadoop/hadoop-mapreduce-client-core/2.2.0/hadoop-mapreduce-client-core-2.2.0.pom
Downloaded: https://repo1.maven.org/maven2/org/apache/hadoop/hadoop-mapreduce-client-core/2.2.0/hadoop-mapreduce-client-core-2.2.0.pom
(4 KB at 50.2 KB/sec)
Downloading: https://repo1.maven.org/maven2/org/apache/hadoop/hadoop-yarn-server-common/2.2.0/hadoop-yarn-server-common-2.2.0.pom
Downloaded: https://repo1.maven.org/maven2/org/apache/hadoop/hadoop-yarn-server-common/2.2.0/hadoop-yarn-server-common-2.2.0.pom
(4 KB at 50.0 KB/sec)
Downloading: https://repo1.maven.org/maven2/org/apache/hadoop/hadoop-yarn-server/2.2.0/hadoop-yarn-server-2.2.0.pom
Downloaded: https://repo1.maven.org/maven2/org/apache/hadoop/hadoop-yarn-server/2.2.0/hadoop-yarn-server-2.2.0.pom
(2 KB at 33.9 KB/sec)
Downloading: https://repo1.maven.org/maven2/org/apache/hadoop/hadoop-mapreduce-client-shuffle/2.2.0/hadoop-mapreduce-client-shuffle-2.2.0.pom
Downloaded: https://repo1.maven.org/maven2/org/apache/hadoop/hadoop-mapreduce-client-shuffle/2.2.0/hadoop-mapreduce-client-shuffle-2.2.0.pom
(2 KB at 30.3 KB/sec)
Downloading: https://repo1.maven.org/maven2/org/apache/hadoop/hadoop-mapreduce-client-jobclient/2.2.0/hadoop-mapreduce-client-jobclient-2.2.0.pom
Downloaded: https://repo1.maven.org/maven2/org/apache/hadoop/hadoop-mapreduce-client-jobclient/2.2.0/hadoop-mapreduce-client-jobclient-2.2.0.pom
(6 KB at 100.9 KB/sec)
Downloading: https://repo1.maven.org/maven2/org/apache/hadoop/hadoop-yarn-server-nodemanager/2.2.0/hadoop-yarn-server-nodemanager-2.2.0.pom
Downloaded: https://repo1.maven.org/maven2/org/apache/hadoop/hadoop-yarn-server-nodemanager/2.2.0/hadoop-yarn-server-nodemanager-2.2.0.pom
(8 KB at 115.4 KB/sec)
Downloading: https://repo1.maven.org/maven2/org/apache/spark/spark-launcher_2.10/1.5.2/spark-launcher_2.10-1.5.2.pom
Downloaded: https://repo1.maven.org/maven2/org/apache/spark/spark-launcher_2.10/1.5.2/spark-launcher_2.10-1.5.2.pom
(5 KB at 80.4 KB/sec)
Downloading: https://repo1.maven.org/maven2/org/apache/spark/spark-parent_2.10/1.5.2/spark-parent_2.10-1.5.2.pom
Downloaded: https://repo1.maven.org/maven2/org/apache/spark/spark-parent_2.10/1.5.2/spark-parent_2.10-1.5.2.pom
(85 KB at 668.0 KB/sec)
Downloading: https://repo1.maven.org/maven2/org/apache/spark/spark-network-common_2.10/1.5.2/spark-network-common_2.10-1.5.2.pom
Downloaded: https://repo1.maven.org/maven2/org/apache/spark/spark-network-common_2.10/1.5.2/spark-network-common_2.10-1.5.2.pom
(4 KB at 64.6 KB/sec)
Downloading: https://repo1.maven.org/maven2/org/apache/spark/spark-network-shuffle_2.10/1.5.2/spark-network-shuffle_2.10-1.5.2.pom
Downloaded: https://repo1.maven.org/maven2/org/apache/spark/spark-network-shuffle_2.10/1.5.2/spark-network-shuffle_2.10-1.5.2.pom
(4 KB at 60.7 KB/sec)
Downloading: https://repo1.maven.org/maven2/org/apache/spark/spark-unsafe_2.10/1.5.2/spark-unsafe_2.10-1.5.2.pom
Downloaded: https://repo1.maven.org/maven2/org/apache/spark/spark-unsafe_2.10/1.5.2/spark-unsafe_2.10-1.5.2.pom
(5 KB at 69.7 KB/sec)
Downloading: https://repo1.maven.org/maven2/net/java/dev/jets3t/jets3t/0.7.1/jets3t-0.7.1.pom
Downloaded: https://repo1.maven.org/maven2/net/java/dev/jets3t/jets3t/0.7.1/jets3t-0.7.1.pom
(2 KB at 21.5 KB/sec)
Downloading: https://repo1.maven.org/maven2/com/typesafe/akka/akka-remote_2.10/2.4.0/akka-remote_2.10-2.4.0.pom
Downloading: https://repository.apache.org/content/repositories/releases/com/typesafe/akka/akka-remote_2.10/2.4.0/akka-remote_2.10-2.4.0.pom
Downloading: https://repository.jboss.org/nexus/content/repositories/releases/com/typesafe/akka/akka-remote_2.10/2.4.0/akka-remote_2.10-2.4.0.pom
Downloading: https://repo.eclipse.org/content/repositories/paho-releases/com/typesafe/akka/akka-remote_2.10/2.4.0/akka-remote_2.10-2.4.0.pom
Downloading: https://repository.cloudera.com/artifactory/cloudera-repos/com/typesafe/akka/akka-remote_2.10/2.4.0/akka-remote_2.10-2.4.0.pom
Downloading: https://oss.sonatype.org/content/repositories/orgspark-project-1113/com/typesafe/akka/akka-remote_2.10/2.4.0/akka-remote_2.10-2.4.0.pom
Downloading: http://repository.mapr.com/maven/com/typesafe/akka/akka-remote_2.10/2.4.0/akka-remote_2.10-2.4.0.pom
Downloading: http://maven.twttr.com/com/typesafe/akka/akka-remote_2.10/2.4.0/akka-remote_2.10-2.4.0.pom
[WARNING] The POM for com.typesafe.akka:akka-remote_2.10:jar:2.4.0 is missing, no dependency
information available
Downloading: https://repo1.maven.org/maven2/com/typesafe/akka/akka-slf4j_2.10/2.4.0/akka-slf4j_2.10-2.4.0.pom
Downloading: https://repository.apache.org/content/repositories/releases/com/typesafe/akka/akka-slf4j_2.10/2.4.0/akka-slf4j_2.10-2.4.0.pom
Downloading: https://repository.jboss.org/nexus/content/repositories/releases/com/typesafe/akka/akka-slf4j_2.10/2.4.0/akka-slf4j_2.10-2.4.0.pom
Downloading: https://repo.eclipse.org/content/repositories/paho-releases/com/typesafe/akka/akka-slf4j_2.10/2.4.0/akka-slf4j_2.10-2.4.0.pom
Downloading: https://repository.cloudera.com/artifactory/cloudera-repos/com/typesafe/akka/akka-slf4j_2.10/2.4.0/akka-slf4j_2.10-2.4.0.pom
Downloading: https://oss.sonatype.org/content/repositories/orgspark-project-1113/com/typesafe/akka/akka-slf4j_2.10/2.4.0/akka-slf4j_2.10-2.4.0.pom
Downloading: http://repository.mapr.com/maven/com/typesafe/akka/akka-slf4j_2.10/2.4.0/akka-slf4j_2.10-2.4.0.pom
Downloading: http://maven.twttr.com/com/typesafe/akka/akka-slf4j_2.10/2.4.0/akka-slf4j_2.10-2.4.0.pom
[WARNING] The POM for com.typesafe.akka:akka-slf4j_2.10:jar:2.4.0 is missing, no dependency
information available
Downloading: https://repo1.maven.org/maven2/com/typesafe/akka/akka-testkit_2.10/2.4.0/akka-testkit_2.10-2.4.0.pom
Downloading: https://repository.apache.org/content/repositories/releases/com/typesafe/akka/akka-testkit_2.10/2.4.0/akka-testkit_2.10-2.4.0.pom
Downloading: https://repository.jboss.org/nexus/content/repositories/releases/com/typesafe/akka/akka-testkit_2.10/2.4.0/akka-testkit_2.10-2.4.0.pom
Downloading: https://repo.eclipse.org/content/repositories/paho-releases/com/typesafe/akka/akka-testkit_2.10/2.4.0/akka-testkit_2.10-2.4.0.pom
Downloading: https://repository.cloudera.com/artifactory/cloudera-repos/com/typesafe/akka/akka-testkit_2.10/2.4.0/akka-testkit_2.10-2.4.0.pom
Downloading: https://oss.sonatype.org/content/repositories/orgspark-project-1113/com/typesafe/akka/akka-testkit_2.10/2.4.0/akka-testkit_2.10-2.4.0.pom
Downloading: http://repository.mapr.com/maven/com/typesafe/akka/akka-testkit_2.10/2.4.0/akka-testkit_2.10-2.4.0.pom
Downloading: http://maven.twttr.com/com/typesafe/akka/akka-testkit_2.10/2.4.0/akka-testkit_2.10-2.4.0.pom
[WARNING] The POM for com.typesafe.akka:akka-testkit_2.10:jar:2.4.0 is missing, no dependency
information available
Downloading: https://repo1.maven.org/maven2/org/json4s/json4s-jackson_2.10/3.2.10/json4s-jackson_2.10-3.2.10.pom
Downloaded: https://repo1.maven.org/maven2/org/json4s/json4s-jackson_2.10/3.2.10/json4s-jackson_2.10-3.2.10.pom
(3 KB at 21.8 KB/sec)
Downloading: https://repo1.maven.org/maven2/org/json4s/json4s-core_2.10/3.2.10/json4s-core_2.10-3.2.10.pom
Downloaded: https://repo1.maven.org/maven2/org/json4s/json4s-core_2.10/3.2.10/json4s-core_2.10-3.2.10.pom
(3 KB at 40.1 KB/sec)
Downloading: https://repo1.maven.org/maven2/org/json4s/json4s-ast_2.10/3.2.10/json4s-ast_2.10-3.2.10.pom
Downloaded: https://repo1.maven.org/maven2/org/json4s/json4s-ast_2.10/3.2.10/json4s-ast_2.10-3.2.10.pom
(2 KB at 32.2 KB/sec)
Downloading: https://repo1.maven.org/maven2/org/scala-lang/scalap/2.10.4/scalap-2.10.4.pom
Downloaded: https://repo1.maven.org/maven2/org/scala-lang/scalap/2.10.4/scalap-2.10.4.pom
(2 KB at 30.4 KB/sec)
Downloading: https://repo1.maven.org/maven2/org/scala-lang/scala-compiler/2.10.4/scala-compiler-2.10.4.pom
Downloaded: https://repo1.maven.org/maven2/org/scala-lang/scala-compiler/2.10.4/scala-compiler-2.10.4.pom
(3 KB at 35.1 KB/sec)
Downloading: https://repo1.maven.org/maven2/com/fasterxml/jackson/module/jackson-module-scala_2.10/2.4.4/jackson-module-scala_2.10-2.4.4.pom
Downloaded: https://repo1.maven.org/maven2/com/fasterxml/jackson/module/jackson-module-scala_2.10/2.4.4/jackson-module-scala_2.10-2.4.4.pom
(5 KB at 71.9 KB/sec)
Downloading: https://repo1.maven.org/maven2/org/scalacheck/scalacheck_2.10/1.11.3/scalacheck_2.10-1.11.3.pom
Downloaded: https://repo1.maven.org/maven2/org/scalacheck/scalacheck_2.10/1.11.3/scalacheck_2.10-1.11.3.pom
(2 KB at 24.7 KB/sec)
Downloading: https://repo1.maven.org/maven2/com/twitter/chill_2.10/0.5.0/chill_2.10-0.5.0.jar
Downloading: https://repo1.maven.org/maven2/org/apache/hadoop/hadoop-client/2.2.0/hadoop-client-2.2.0.jar
Downloading: https://repo1.maven.org/maven2/org/apache/hadoop/hadoop-common/2.2.0/hadoop-common-2.2.0.jar
Downloading: https://repo1.maven.org/maven2/org/apache/hadoop/hadoop-auth/2.2.0/hadoop-auth-2.2.0.jar
Downloading: https://repo1.maven.org/maven2/org/apache/hadoop/hadoop-hdfs/2.2.0/hadoop-hdfs-2.2.0.jar
Downloaded: https://repo1.maven.org/maven2/org/apache/hadoop/hadoop-client/2.2.0/hadoop-client-2.2.0.jar
(3 KB at 36.2 KB/sec)
Downloading: https://repo1.maven.org/maven2/org/apache/hadoop/hadoop-mapreduce-client-app/2.2.0/hadoop-mapreduce-client-app-2.2.0.jar
Downloaded: https://repo1.maven.org/maven2/org/apache/hadoop/hadoop-auth/2.2.0/hadoop-auth-2.2.0.jar
(49 KB at 244.1 KB/sec)
Downloading: https://repo1.maven.org/maven2/org/apache/hadoop/hadoop-mapreduce-client-common/2.2.0/hadoop-mapreduce-client-common-2.2.0.jar
Downloaded: https://repo1.maven.org/maven2/com/twitter/chill_2.10/0.5.0/chill_2.10-0.5.0.jar
(216 KB at 717.1 KB/sec)
Downloading: https://repo1.maven.org/maven2/org/apache/hadoop/hadoop-yarn-client/2.2.0/hadoop-yarn-client-2.2.0.jar
Downloaded: https://repo1.maven.org/maven2/org/apache/hadoop/hadoop-yarn-client/2.2.0/hadoop-yarn-client-2.2.0.jar
(93 KB at 199.4 KB/sec)
Downloading: https://repo1.maven.org/maven2/com/sun/jersey/jersey-test-framework/jersey-test-framework-grizzly2/1.9/jersey-test-framework-grizzly2-1.9.jar
Downloaded: https://repo1.maven.org/maven2/com/sun/jersey/jersey-test-framework/jersey-test-framework-grizzly2/1.9/jersey-test-framework-grizzly2-1.9.jar
(13 KB at 23.5 KB/sec)
Downloading: https://repo1.maven.org/maven2/com/sun/jersey/jersey-test-framework/jersey-test-framework-core/1.9/jersey-test-framework-core-1.9.jar
Downloaded: https://repo1.maven.org/maven2/com/sun/jersey/jersey-test-framework/jersey-test-framework-core/1.9/jersey-test-framework-core-1.9.jar
(28 KB at 44.3 KB/sec)
Downloading: https://repo1.maven.org/maven2/javax/servlet/javax.servlet-api/3.0.1/javax.servlet-api-3.0.1.jar
Downloaded: https://repo1.maven.org/maven2/org/apache/hadoop/hadoop-mapreduce-client-app/2.2.0/hadoop-mapreduce-client-app-2.2.0.jar
(471 KB at 683.2 KB/sec)
Downloading: https://repo1.maven.org/maven2/com/sun/jersey/jersey-grizzly2/1.9/jersey-grizzly2-1.9.jar
Downloaded: https://repo1.maven.org/maven2/com/sun/jersey/jersey-grizzly2/1.9/jersey-grizzly2-1.9.jar
(18 KB at 22.5 KB/sec)
Downloading: https://repo1.maven.org/maven2/org/glassfish/grizzly/grizzly-http/2.1.2/grizzly-http-2.1.2.jar
Downloaded: https://repo1.maven.org/maven2/javax/servlet/javax.servlet-api/3.0.1/javax.servlet-api-3.0.1.jar
(84 KB at 108.4 KB/sec)
Downloading: https://repo1.maven.org/maven2/org/glassfish/grizzly/grizzly-framework/2.1.2/grizzly-framework-2.1.2.jar
Downloaded: https://repo1.maven.org/maven2/org/apache/hadoop/hadoop-mapreduce-client-common/2.2.0/hadoop-mapreduce-client-common-2.2.0.jar
(641 KB at 776.0 KB/sec)
Downloading: https://repo1.maven.org/maven2/org/glassfish/gmbal/gmbal-api-only/3.0.0-b023/gmbal-api-only-3.0.0-b023.jar
Downloaded: https://repo1.maven.org/maven2/org/glassfish/gmbal/gmbal-api-only/3.0.0-b023/gmbal-api-only-3.0.0-b023.jar
(22 KB at 23.9 KB/sec)
Downloading: https://repo1.maven.org/maven2/org/glassfish/external/management-api/3.0.0-b012/management-api-3.0.0-b012.jar
Downloaded: https://repo1.maven.org/maven2/org/glassfish/external/management-api/3.0.0-b012/management-api-3.0.0-b012.jar
(42 KB at 42.4 KB/sec)
Downloading: https://repo1.maven.org/maven2/org/glassfish/grizzly/grizzly-http-server/2.1.2/grizzly-http-server-2.1.2.jar
Downloaded: https://repo1.maven.org/maven2/org/glassfish/grizzly/grizzly-http/2.1.2/grizzly-http-2.1.2.jar
(248 KB at 234.0 KB/sec)
Downloading: https://repo1.maven.org/maven2/org/glassfish/grizzly/grizzly-rcm/2.1.2/grizzly-rcm-2.1.2.jar
Downloaded: https://repo1.maven.org/maven2/org/glassfish/grizzly/grizzly-rcm/2.1.2/grizzly-rcm-2.1.2.jar
(8 KB at 7.1 KB/sec)
Downloading: https://repo1.maven.org/maven2/org/glassfish/grizzly/grizzly-http-servlet/2.1.2/grizzly-http-servlet-2.1.2.jar
Downloaded: https://repo1.maven.org/maven2/org/glassfish/grizzly/grizzly-http-server/2.1.2/grizzly-http-server-2.1.2.jar
(194 KB at 166.3 KB/sec)
Downloading: https://repo1.maven.org/maven2/org/glassfish/javax.servlet/3.1/javax.servlet-3.1.jar
Downloaded: https://repo1.maven.org/maven2/org/glassfish/javax.servlet/3.1/javax.servlet-3.1.jar
(82 KB at 63.7 KB/sec)
Downloading: https://repo1.maven.org/maven2/org/apache/hadoop/hadoop-yarn-server-common/2.2.0/hadoop-yarn-server-common-2.2.0.jar
Downloaded: https://repo1.maven.org/maven2/org/glassfish/grizzly/grizzly-framework/2.1.2/grizzly-framework-2.1.2.jar
(675 KB at 486.9 KB/sec)
Downloading: https://repo1.maven.org/maven2/org/apache/hadoop/hadoop-mapreduce-client-shuffle/2.2.0/hadoop-mapreduce-client-shuffle-2.2.0.jar
Downloaded: https://repo1.maven.org/maven2/org/glassfish/grizzly/grizzly-http-servlet/2.1.2/grizzly-http-servlet-2.1.2.jar
(330 KB at 237.2 KB/sec)
Downloading: https://repo1.maven.org/maven2/org/apache/hadoop/hadoop-yarn-api/2.2.0/hadoop-yarn-api-2.2.0.jar
Downloaded: https://repo1.maven.org/maven2/org/apache/hadoop/hadoop-mapreduce-client-shuffle/2.2.0/hadoop-mapreduce-client-shuffle-2.2.0.jar
(22 KB at 14.5 KB/sec)
Downloading: https://repo1.maven.org/maven2/org/apache/hadoop/hadoop-mapreduce-client-core/2.2.0/hadoop-mapreduce-client-core-2.2.0.jar
Downloaded: https://repo1.maven.org/maven2/org/apache/hadoop/hadoop-yarn-server-common/2.2.0/hadoop-yarn-server-common-2.2.0.jar
(172 KB at 115.1 KB/sec)
Downloading: https://repo1.maven.org/maven2/org/apache/hadoop/hadoop-yarn-common/2.2.0/hadoop-yarn-common-2.2.0.jar
Downloaded: https://repo1.maven.org/maven2/org/apache/hadoop/hadoop-yarn-common/2.2.0/hadoop-yarn-common-2.2.0.jar
(1272 KB at 590.7 KB/sec)
Downloading: https://repo1.maven.org/maven2/org/apache/hadoop/hadoop-mapreduce-client-jobclient/2.2.0/hadoop-mapreduce-client-jobclient-2.2.0.jar
Downloaded: https://repo1.maven.org/maven2/org/apache/hadoop/hadoop-common/2.2.0/hadoop-common-2.2.0.jar
(2672 KB at 1227.1 KB/sec)
Downloading: https://repo1.maven.org/maven2/org/apache/hadoop/hadoop-annotations/2.2.0/hadoop-annotations-2.2.0.jar
Downloaded: https://repo1.maven.org/maven2/org/apache/hadoop/hadoop-mapreduce-client-jobclient/2.2.0/hadoop-mapreduce-client-jobclient-2.2.0.jar
(35 KB at 15.4 KB/sec)
Downloading: https://repo1.maven.org/maven2/org/apache/spark/spark-launcher_2.10/1.5.2/spark-launcher_2.10-1.5.2.jar
Downloaded: https://repo1.maven.org/maven2/org/apache/hadoop/hadoop-annotations/2.2.0/hadoop-annotations-2.2.0.jar
(17 KB at 7.3 KB/sec)
Downloading: https://repo1.maven.org/maven2/org/apache/spark/spark-network-common_2.10/1.5.2/spark-network-common_2.10-1.5.2.jar
Downloaded: https://repo1.maven.org/maven2/org/apache/hadoop/hadoop-yarn-api/2.2.0/hadoop-yarn-api-2.2.0.jar
(1132 KB at 503.9 KB/sec)
Downloading: https://repo1.maven.org/maven2/org/apache/spark/spark-network-shuffle_2.10/1.5.2/spark-network-shuffle_2.10-1.5.2.jar
Downloaded: https://repo1.maven.org/maven2/org/apache/spark/spark-launcher_2.10/1.5.2/spark-launcher_2.10-1.5.2.jar
(43 KB at 18.2 KB/sec)
Downloading: https://repo1.maven.org/maven2/org/apache/spark/spark-unsafe_2.10/1.5.2/spark-unsafe_2.10-1.5.2.jar
Downloaded: https://repo1.maven.org/maven2/org/apache/spark/spark-network-shuffle_2.10/1.5.2/spark-network-shuffle_2.10-1.5.2.jar
(49 KB at 20.6 KB/sec)
Downloading: https://repo1.maven.org/maven2/net/java/dev/jets3t/jets3t/0.7.1/jets3t-0.7.1.jar
Downloaded: https://repo1.maven.org/maven2/net/java/dev/jets3t/jets3t/0.7.1/jets3t-0.7.1.jar
(369 KB at 144.2 KB/sec)
Downloading: https://repo1.maven.org/maven2/com/typesafe/akka/akka-remote_2.10/2.4.0/akka-remote_2.10-2.4.0.jar
Downloaded: https://repo1.maven.org/maven2/org/apache/hadoop/hadoop-mapreduce-client-core/2.2.0/hadoop-mapreduce-client-core-2.2.0.jar
(1421 KB at 552.7 KB/sec)
Downloading: https://repo1.maven.org/maven2/com/typesafe/akka/akka-slf4j_2.10/2.4.0/akka-slf4j_2.10-2.4.0.jar
Downloading: https://repo1.maven.org/maven2/com/typesafe/akka/akka-testkit_2.10/2.4.0/akka-testkit_2.10-2.4.0.jar
Downloading: https://repo1.maven.org/maven2/org/json4s/json4s-jackson_2.10/3.2.10/json4s-jackson_2.10-3.2.10.jar
Downloaded: https://repo1.maven.org/maven2/org/apache/spark/spark-unsafe_2.10/1.5.2/spark-unsafe_2.10-1.5.2.jar
(43 KB at 16.0 KB/sec)
Downloading: https://repo1.maven.org/maven2/org/json4s/json4s-core_2.10/3.2.10/json4s-core_2.10-3.2.10.jar
Downloading: https://repo1.maven.org/maven2/org/json4s/json4s-ast_2.10/3.2.10/json4s-ast_2.10-3.2.10.jar
Downloaded: https://repo1.maven.org/maven2/org/json4s/json4s-jackson_2.10/3.2.10/json4s-jackson_2.10-3.2.10.jar
(40 KB at 14.0 KB/sec)
Downloading: https://repo1.maven.org/maven2/org/scala-lang/scalap/2.10.4/scalap-2.10.4.jar
Downloaded: https://repo1.maven.org/maven2/org/apache/hadoop/hadoop-hdfs/2.2.0/hadoop-hdfs-2.2.0.jar
(5120 KB at 1783.8 KB/sec)
Downloading: https://repo1.maven.org/maven2/org/scala-lang/scala-compiler/2.10.4/scala-compiler-2.10.4.jar
Downloaded: https://repo1.maven.org/maven2/org/json4s/json4s-ast_2.10/3.2.10/json4s-ast_2.10-3.2.10.jar
(82 KB at 28.2 KB/sec)
Downloading: https://repo1.maven.org/maven2/com/fasterxml/jackson/module/jackson-module-scala_2.10/2.4.4/jackson-module-scala_2.10-2.4.4.jar
Downloaded: https://repo1.maven.org/maven2/org/json4s/json4s-core_2.10/3.2.10/json4s-core_2.10-3.2.10.jar
(571 KB at 189.1 KB/sec)
Downloading: https://repo1.maven.org/maven2/org/scalacheck/scalacheck_2.10/1.11.3/scalacheck_2.10-1.11.3.jar
Downloaded: https://repo1.maven.org/maven2/org/scala-lang/scalap/2.10.4/scalap-2.10.4.jar
(834 KB at 260.8 KB/sec)
Downloaded: https://repo1.maven.org/maven2/com/fasterxml/jackson/module/jackson-module-scala_2.10/2.4.4/jackson-module-scala_2.10-2.4.4.jar
(537 KB at 154.6 KB/sec)
Downloaded: https://repo1.maven.org/maven2/org/apache/spark/spark-network-common_2.10/1.5.2/spark-network-common_2.10-1.5.2.jar
(2276 KB at 622.0 KB/sec)
Downloaded: https://repo1.maven.org/maven2/org/scalacheck/scalacheck_2.10/1.11.3/scalacheck_2.10-1.11.3.jar
(864 KB at 235.7 KB/sec)
Downloaded: https://repo1.maven.org/maven2/org/scala-lang/scala-compiler/2.10.4/scala-compiler-2.10.4.jar
(14108 KB at 1201.0 KB/sec)
Downloading: https://repository.apache.org/content/repositories/releases/com/typesafe/akka/akka-remote_2.10/2.4.0/akka-remote_2.10-2.4.0.jar
Downloading: https://repository.apache.org/content/repositories/releases/com/typesafe/akka/akka-slf4j_2.10/2.4.0/akka-slf4j_2.10-2.4.0.jar
Downloading: https://repository.apache.org/content/repositories/releases/com/typesafe/akka/akka-testkit_2.10/2.4.0/akka-testkit_2.10-2.4.0.jar
Downloading: https://repository.jboss.org/nexus/content/repositories/releases/com/typesafe/akka/akka-remote_2.10/2.4.0/akka-remote_2.10-2.4.0.jar
Downloading: https://repository.jboss.org/nexus/content/repositories/releases/com/typesafe/akka/akka-slf4j_2.10/2.4.0/akka-slf4j_2.10-2.4.0.jar
Downloading: https://repository.jboss.org/nexus/content/repositories/releases/com/typesafe/akka/akka-testkit_2.10/2.4.0/akka-testkit_2.10-2.4.0.jar
Downloading: https://repo.eclipse.org/content/repositories/paho-releases/com/typesafe/akka/akka-remote_2.10/2.4.0/akka-remote_2.10-2.4.0.jar
Downloading: https://repo.eclipse.org/content/repositories/paho-releases/com/typesafe/akka/akka-slf4j_2.10/2.4.0/akka-slf4j_2.10-2.4.0.jar
Downloading: https://repo.eclipse.org/content/repositories/paho-releases/com/typesafe/akka/akka-testkit_2.10/2.4.0/akka-testkit_2.10-2.4.0.jar
Downloading: https://repository.cloudera.com/artifactory/cloudera-repos/com/typesafe/akka/akka-remote_2.10/2.4.0/akka-remote_2.10-2.4.0.jar
Downloading: https://repository.cloudera.com/artifactory/cloudera-repos/com/typesafe/akka/akka-slf4j_2.10/2.4.0/akka-slf4j_2.10-2.4.0.jar
Downloading: https://repository.cloudera.com/artifactory/cloudera-repos/com/typesafe/akka/akka-testkit_2.10/2.4.0/akka-testkit_2.10-2.4.0.jar
Downloading: https://oss.sonatype.org/content/repositories/orgspark-project-1113/com/typesafe/akka/akka-remote_2.10/2.4.0/akka-remote_2.10-2.4.0.jar
Downloading: https://oss.sonatype.org/content/repositories/orgspark-project-1113/com/typesafe/akka/akka-slf4j_2.10/2.4.0/akka-slf4j_2.10-2.4.0.jar
Downloading: https://oss.sonatype.org/content/repositories/orgspark-project-1113/com/typesafe/akka/akka-testkit_2.10/2.4.0/akka-testkit_2.10-2.4.0.jar
Downloading: http://repository.mapr.com/maven/com/typesafe/akka/akka-remote_2.10/2.4.0/akka-remote_2.10-2.4.0.jar
Downloading: http://repository.mapr.com/maven/com/typesafe/akka/akka-slf4j_2.10/2.4.0/akka-slf4j_2.10-2.4.0.jar
Downloading: http://repository.mapr.com/maven/com/typesafe/akka/akka-testkit_2.10/2.4.0/akka-testkit_2.10-2.4.0.jar
Downloading: http://maven.twttr.com/com/typesafe/akka/akka-remote_2.10/2.4.0/akka-remote_2.10-2.4.0.jar
Downloading: http://maven.twttr.com/com/typesafe/akka/akka-testkit_2.10/2.4.0/akka-testkit_2.10-2.4.0.jar
Downloading: http://maven.twttr.com/com/typesafe/akka/akka-slf4j_2.10/2.4.0/akka-slf4j_2.10-2.4.0.jar
[INFO] ------------------------------------------------------------------------
[INFO] Reactor Summary:
[INFO]
[INFO] Spark Project Parent POM ........................... SUCCESS [ 17.154 s]
[INFO] Spark Project Core ................................. FAILURE [ 26.235 s]
[INFO] Spark Project Bagel ................................ SKIPPED
[INFO] Spark Project GraphX ............................... SKIPPED
[INFO] Spark Project ML Library ........................... SKIPPED
[INFO] Spark Project Tools ................................ SKIPPED
[INFO] Spark Project Networking ........................... SKIPPED
[INFO] Spark Project Shuffle Streaming Service ............ SKIPPED
[INFO] Spark Project Streaming ............................ SKIPPED
[INFO] Spark Project Unsafe ............................... SKIPPED
[INFO] Spark Project Assembly ............................. SKIPPED
[INFO] Spark Project External Twitter ..................... SKIPPED
[INFO] Spark Project External Flume ....................... SKIPPED
[INFO] Spark Project External Flume Sink .................. SKIPPED
[INFO] Spark Project External Flume Assembly .............. SKIPPED
[INFO] Spark Project REPL ................................. SKIPPED
[INFO] Spark Project Launcher ............................. SKIPPED
[INFO] Spark Project External Kafka ....................... SKIPPED
[INFO] Spark Project External Kafka Assembly .............. SKIPPED
[INFO] ------------------------------------------------------------------------
[INFO] BUILD FAILURE
[INFO] ------------------------------------------------------------------------
[INFO] Total time: 44.339 s
[INFO] Finished at: 2015-12-01T14:24:33+00:00
[INFO] Final Memory: 27M/317M
[INFO] ------------------------------------------------------------------------
[ERROR] Failed to execute goal on project spark-core_2.11: Could not resolve dependencies
for project org.apache.spark:spark-core_2.11:jar:1.5.2: The following artifacts could nolved:
com.typesafe.akka:akka-remote_2.10:jar:2.4.0, com.typesafe.akka:akka-slf4j_2.10:jar:2.4.0,
com.typesafe.akka:akka-testkit_2.10:jar:2.4.0: Could not find artifact com.type:akka-remote_2.10:jar:2.4.0
in central (https://repo1.maven.org/maven2) -> [Help 1]




From: Ted Yu [mailto:yuzhihong@gmail.com]
Sent: 01 December 2015 15:19
To: Boavida, Rodrigo <Rodrigo.Boavida@Aspect.com>
Cc: user@spark.apache.org
Subject: Re: Scala 2.11 and Akka 2.4.0

I don't see 2.4.0 release under:
http://mvnrepository.com/artifact/com.typesafe.akka/akka-remote_2.10

Probably that was the cause for the 'Could not find artifact' error.

On Tue, Dec 1, 2015 at 7:03 AM, Boavida, Rodrigo <Rodrigo.Boavida@aspect.com<mailto:Rodrigo.Boavida@aspect.com>>
wrote:
Hi Ted,

Thanks for getting back to me and for the suggestion.

Running a 'mvn dependency:tree' I get the following:

[ERROR] Failed to execute goal on project spark-core_2.11: Could not resolve dependencies
for project org.apache.spark:spark-core_2.11:jar:1.5.2: The following artifacts could not
be resolved: com.typesafe.akka:akka-remote_2.10:jar:2.4.0, com.typesafe.akka:akka-slf4j_2.10:jar:2.4.0,
com.typesafe.akka:akka-testkit_2.10:jar:2.4.0: Could not find artifact com.typesafe.akka:akka-remote_2.10:jar:2.4.0
in central (https://repo1.maven.org/maven2) -> [Help 1]

So it seems somehow it's still pulling some 2.10 dependencies. Do you think this could be
the cause for the observed problem?

tnks,
Rod

-----Original Message-----
From: Ted Yu [mailto:yuzhihong@gmail.com<mailto:yuzhihong@gmail.com>]
Sent: 01 December 2015 14:13
To: Boavida, Rodrigo <Rodrigo.Boavida@Aspect.com<mailto:Rodrigo.Boavida@Aspect.com>>
Cc: user@spark.apache.org<mailto:user@spark.apache.org>
Subject: Re: Scala 2.11 and Akka 2.4.0

Have you run 'mvn dependency:tree' and examined the output ?

There should be some hint.

Cheers

> On Dec 1, 2015, at 5:32 AM, RodrigoB <rodrigo.boavida@aspect.com<mailto:rodrigo.boavida@aspect.com>>
wrote:
>
> Hi,
>
> I'm currently trying to build spark with Scala 2.11 and Akka 2.4.0.
> I've changed the main pom.xml files to corresponding akka version and
> am getting the following exception when starting the master on standalone:
>
> Exception Details:
>  Location:
>    akka/dispatch/Mailbox.processAllSystemMessages()V @152: getstatic
>  Reason:
>    Type top (current frame, locals[9]) is not assignable to
> 'akka/dispatch/sysmsg/SystemMessage' (stack map, locals[9])  Current
> Frame:
>    bci: @131
>    flags: { }
>    locals: { 'akka/dispatch/Mailbox',
> 'java/lang/InterruptedException',
> 'akka/dispatch/sysmsg/SystemMessage', top, 'akka/dispatch/Mailbox', 'java/lang/Throwable',
'java/lang/Throwable' }
>    stack: { integer }
>  Stackmap Frame:
>    bci: @152
>    flags: { }
>    locals: { 'akka/dispatch/Mailbox',
> 'java/lang/InterruptedException',
> 'akka/dispatch/sysmsg/SystemMessage', top, 'akka/dispatch/Mailbox',
> 'java/lang/Throwable', 'java/lang/Throwable', top, top, 'akka/dispatch/sysmsg/SystemMessage'
}
>    stack: { }
>  Bytecode:
>    0x0000000: 014c 2ab2 0132 b601 35b6 0139 4db2 013e
>    0x0000010: 2cb6 0142 9900 522a b600 c69a 004b 2c4e
>    0x0000020: b201 3e2c b601 454d 2db9 0148 0100 2ab6
>    0x0000030: 0052 2db6 014b b801 0999 000e bb00 e759
>    0x0000040: 1301 4db7 010f 4cb2 013e 2cb6 0150 99ff
>    0x0000050: bf2a b600 c69a ffb8 2ab2 0132 b601 35b6
>    0x0000060: 0139 4da7 ffaa 2ab6 0052 b600 56b6 0154
>    0x0000070: b601 5a3a 04a7 0091 3a05 1905 3a06 1906
>    0x0000080: c100 e799 0015 1906 c000 e73a 0719 074c
>    0x0000090: b200 f63a 08a7 0071 b201 5f19 06b6 0163
>    0x00000a0: 3a0a 190a b601 6899 0006 1905 bf19 0ab6
>    0x00000b0: 016c c000 df3a 0b2a b600 52b6 0170 b601
>    0x00000c0: 76bb 000f 5919 0b2a b600 52b6 017a b601
>    0x00000d0: 80b6 0186 2ab6 018a bb01 8c59 b701 8e13
>    0x00000e0: 0190 b601 9419 09b6 0194 1301 96b6 0194
>    0x00000f0: 190b b601 99b6 0194 b601 9ab7 019d b601
>    0x0000100: a3b2 00f6 3a08 b201 3e2c b601 4299 0026
>    0x0000110: 2c3a 09b2 013e 2cb6 0145 4d19 09b9 0148
>    0x0000120: 0100 1904 2ab6 0052 b601 7a19 09b6 01a7
>    0x0000130: a7ff d62b c600 09b8 0109 572b bfb1  Exception Handler
> Table:
>    bci [290, 307] => handler: 120
>  Stackmap Table:
>    append_frame(@13,Object[#231],Object[#177])
>    append_frame(@71,Object[#177])
>    chop_frame(@102,1)
>
> full_frame(@120,{Object[#2],Object[#231],Object[#177],Top,Object[#2],O
> bject[#177]},{Object[#223]})
>
> full_frame(@152,{Object[#2],Object[#231],Object[#177],Top,Object[#2],Object[#223],Object[#223],Top,Top,Object[#177]},{})
>    append_frame(@173,Object[#357])
>
> full_frame(@262,{Object[#2],Object[#231],Object[#177],Top,Object[#2]},{})
>    same_frame(@307)
>    same_frame(@317)
>   at akka.dispatch.Mailboxes.<init>(Mailboxes.scala:33)
>        at akka.actor.ActorSystemImpl.<init>(ActorSystem.scala:635)
>        at akka.actor.ActorSystem$.apply(ActorSystem.scala:143)
>        at akka.actor.ActorSystem$.apply(ActorSystem.scala:120)
>        at
> org.apache.spark.util.AkkaUtils$.org$apache$spark$util$AkkaUtils$$doCreateActorSystem(AkkaUtils.scala:121)
>        at
> org.apache.spark.util.AkkaUtils$$anonfun$1.apply(AkkaUtils.scala:53)
>        at
> org.apache.spark.util.AkkaUtils$$anonfun$1.apply(AkkaUtils.scala:52)
>        at
> org.apache.spark.util.Utils$$anonfun$startServiceOnPort$1.apply$mcVI$sp(Utils.scala:1920)
>        at scala.collection.immutable.Range.foreach$mVc$sp(Range.scala:166)
>        at org.apache.spark.util.Utils$.startServiceOnPort(Utils.scala:1911)
>        at
> org.apache.spark.util.AkkaUtils$.createActorSystem(AkkaUtils.scala:55)
>        at
> org.apache.spark.rpc.akka.AkkaRpcEnvFactory.create(AkkaRpcEnv.scala:253)
>        at org.apache.spark.rpc.RpcEnv$.create(RpcEnv.scala:53)
>        at
> org.apache.spark.deploy.master.Master$.startRpcEnvAndEndpoint(Master.scala:1074)
>        at org.apache.spark.deploy.master.Master$.main(Master.scala:1058)
>        at org.apache.spark.deploy.master.Master.main(Master.scala)
>
> ---------------
>
> Has anyone encountered this problem before? Seems to be related with a
> version mismatch at some level with the Akka mailbox. I would very
> much appreciate any comments.
>
> tnks,
> Rod
>
>
>
>
>
> --
> View this message in context:
> http://apache-spark-user-list.1001560.n3.nabble.com/Scala-2-11-and-Akk
> a-2-4-0-tp25535.html Sent from the Apache Spark User List mailing list
> archive at Nabble.com.
>
> ---------------------------------------------------------------------
> To unsubscribe, e-mail: user-unsubscribe@spark.apache.org<mailto:user-unsubscribe@spark.apache.org>
For
> additional commands, e-mail: user-help@spark.apache.org<mailto:user-help@spark.apache.org>
>
This email (including any attachments) is proprietary to Aspect Software, Inc. and may contain
information that is confidential. If you have received this message in error, please do not
read, copy or forward this message. Please notify the sender immediately, delete it from your
system and destroy any copies. You may not further disclose or distribute this email or its
attachments.

This email (including any attachments) is proprietary to Aspect Software, Inc. and may contain
information that is confidential. If you have received this message in error, please do not
read, copy or forward this message. Please notify the sender immediately, delete it from your
system and destroy any copies. You may not further disclose or distribute this email or its
attachments.
Mime
View raw message