stratos-dev mailing list archives

Site index · List index
Message view « Date » · « Thread »
Top « Date » · « Thread »
From Gayan Gunarathne <gay...@wso2.com>
Subject Build failure in latest code in stratos-4.1.x branch
Date Sun, 20 Sep 2015 07:06:49 GMT
I am getting the following compilation failure in latest code in
the stratos-4.1.x branch.Seems we are not properly update the Kubernetes
client abstract live test.


[ERROR] COMPILATION ERROR :
[INFO] -------------------------------------------------------------
[ERROR]
/home/gayan/workspace/GITHUB/apache/stratos/components/org.apache.stratos.kubernetes.client/src/test/java/org/apache/stratos/kubernetes/client/live/AbstractLiveTest.java:[133,14]
error: method createPod in class KubernetesApiClient cannot be applied to
given types;

[ERROR]  actual and formal argument lists differ in length
/home/gayan/workspace/GITHUB/apache/stratos/components/org.apache.stratos.kubernetes.client/src/test/java/org/apache/stratos/kubernetes/client/live/AbstractLiveTest.java:[205,14]
error: method createService in class KubernetesApiClient cannot be applied
to given types;


Thank,
Gayan


-- 

Gayan Gunarathne
Technical Lead, WSO2 Inc. (http://wso2.com)
Committer & PMC Member, Apache Stratos
email : gayang@wso2.com  | mobile : +94 775030545 <%2B94%20766819985>

Mime
View raw message