stratos-dev mailing list archives

Site index · List index
Message view « Date » · « Thread »
Top « Date » · « Thread »
From Rajkumar Rajaratnam <rajkum...@wso2.com>
Subject Re: Jenkins build became unstable: Stratos-41x-Nightly-Build #64
Date Wed, 02 Dec 2015 05:42:22 GMT
Application didn't become active in Metadata service test case. Gayan
triggered another build and it succeeded. However, I am will check on this
intermittent failure.


Tests run: 32, Failures: 1, Errors: 0, Skipped: 6, Time elapsed: 1,017.86
sec <<< FAILURE! - in TestSuite
deployApplications(org.apache.stratos.integration.tests.application.MetadataServiceTestCase)
Time elapsed: 300.767 sec  <<< FAILURE!
org.testng.internal.thread.ThreadExecutionException:
org.testng.internal.InvokeMethodRunnable$TestNGRuntimeException:
java.lang.AssertionError: Application status did not change to Active:
[application-id] application-metadata-service-test-1 expected:<Active> but
was:<Inactive>
    at
org.apache.stratos.integration.tests.application.MetadataServiceTestCase.deployApplications(MetadataServiceTestCase.java:154)


On Wed, Dec 2, 2015 at 6:31 AM, Apache Jenkins Server <
jenkins@builds.apache.org> wrote:

> See <https://builds.apache.org/job/Stratos-41x-Nightly-Build/64/changes>
>
>


-- 
Rajkumar Rajaratnam
Committer & PMC Member, Apache Stratos
Software Engineer, WSO2

Mobile : +94777568639
Blog : rajkumarr.com

Mime
View raw message