stratos-dev mailing list archives

Site index · List index
Message view « Date » · « Thread »
Top « Date » · « Thread »
From Chamila De Alwis <chami...@wso2.com>
Subject Re: Build failed in Jenkins: stratos #426
Date Tue, 22 Dec 2015 10:32:13 GMT
Build passes locally with a clean repo. Not sure why this failed on
Jenkins.


Regards,
Chamila de Alwis
Committer and PMC Member - Apache Stratos
Software Engineer | WSO2 | +94772207163
Blog: code.chamiladealwis.com



On Tue, Dec 22, 2015 at 11:47 AM, Chamila De Alwis <chamilad@wso2.com>
wrote:

>
> On Tue, Dec 22, 2015 at 4:06 AM, <gmcdonald@apache.org> wrote:
>
>> [ERROR] Failed to execute goal
>> org.apache.maven.plugins:maven-compiler-plugin:2.3.1:testCompile
>> (default-testCompile) on project stratos-test-integration: Compilation
>> failure: Compilation failure:
>> [ERROR] error: error reading
>> /x1/jenkins/jenkins-master/jenkins-home/maven-repositories/0/org/apache/xerces/xml-apis/2.9.1/xml-apis-2.9.1.jar;
>> error in opening zip file
>> [ERROR] error: error reading
>> /x1/jenkins/jenkins-master/jenkins-home/maven-repositories/0/org/apache/xerces/xercesImpl/2.9.1/xercesImpl-2.9.1.jar;
>> error in opening zip file
>> [ERROR] error: error reading
>> /x1/jenkins/jenkins-master/jenkins-home/maven-repositories/0/org/apache/xerces/resolver/2.9.1/resolver-2.9.1.jar;
>> error in opening zip file
>> [ERROR] error: error reading
>> /x1/jenkins/jenkins-master/jenkins-home/maven-repositories/0/org/apache/xerces/serializer/2.9.1/serializer-2.9.1.jar;
>> error in opening zip file
>> [ERROR] -> [Help 1]
>>
>
> Seems like these zip files are corrupt (server down?). My local build
> passed before pushing. Building locally again with a clean repo.
>
>
> Regards,
> Chamila de Alwis
> Committer and PMC Member - Apache Stratos
> Software Engineer | WSO2 | +94772207163
> Blog: code.chamiladealwis.com
>
>
>

Mime
View raw message