stratos-dev mailing list archives

Site index · List index
Message view « Date » · « Thread »
Top « Date » · « Thread »
From gmcdon...@apache.org
Subject Build failed in Jenkins: stratos #430
Date Thu, 28 Jan 2016 22:36:30 GMT
See <https://analysis.apache.org/jenkins/job/stratos/430/changes>

Changes:

[chamila] Kubernetes - Allow imagePullSecrets to be passed to Pod definition

[chamila] Kubernetes - Image Pull Secrets moved to Cartridge

[chamila] Kubernetes - pullPolicy can be defined through the Cartridge definition

------------------------------------------
[...truncated 6626 lines...]
[JENKINS] Archiving disabled
[JENKINS] Archiving disabled
[JENKINS] Archiving disabled
[JENKINS] Archiving disabled
[JENKINS] Archiving disabled
[JENKINS] Archiving disabled
[JENKINS] Archiving disabled
[JENKINS] Archiving disabled
[JENKINS] Archiving disabled
[JENKINS] Archiving disabled
[JENKINS] Archiving disabled
[JENKINS] Archiving disabled
[JENKINS] Archiving disabled
[JENKINS] Archiving disabled
[JENKINS] Archiving disabled
[JENKINS] Archiving disabled
[JENKINS] Archiving disabled
[JENKINS] Archiving disabled
[JENKINS] Archiving disabled
[JENKINS] Archiving disabled
[JENKINS] Archiving disabled
[JENKINS] Archiving disabled
[JENKINS] Archiving disabled
[JENKINS] Archiving disabled
[JENKINS] Archiving disabled
[JENKINS] Archiving disabled
[JENKINS] Archiving disabled
[JENKINS] Archiving disabled
[JENKINS] Archiving disabled
[JENKINS] Archiving disabled
[JENKINS] Archiving disabled
[JENKINS] Archiving disabled
[JENKINS] Archiving disabled
[JENKINS] Archiving disabled
[JENKINS] Archiving disabled
[JENKINS] Archiving disabled
[JENKINS] Archiving disabled
[JENKINS] Archiving disabled
[JENKINS] Archiving disabled
[JENKINS] Archiving disabled
[JENKINS] Archiving disabled
[JENKINS] Archiving disabled
[JENKINS] Archiving disabled
[JENKINS] Archiving disabled
[JENKINS] Archiving disabled
[JENKINS] Archiving disabled
[JENKINS] Archiving disabled
[JENKINS] Archiving disabled
[JENKINS] Archiving disabled
[JENKINS] Archiving disabled
[JENKINS] Archiving disabled
[JENKINS] Archiving disabled
[JENKINS] Archiving disabled
[JENKINS] Archiving disabled
[JENKINS] Archiving disabled
[JENKINS] Archiving disabled
[JENKINS] Archiving disabled
[JENKINS] Archiving disabled
[JENKINS] Archiving disabled
[JENKINS] Archiving disabled
[JENKINS] Archiving disabled
[JENKINS] Archiving disabled
[JENKINS] Archiving disabled
[JENKINS] Archiving disabled
[JENKINS] Archiving disabled
[JENKINS] Archiving disabled
[JENKINS] Archiving disabled
[JENKINS] Archiving disabled
[JENKINS] Archiving disabled
[JENKINS] Archiving disabled
[JENKINS] Archiving disabled
[JENKINS] Archiving disabled
[JENKINS] Archiving disabled
[JENKINS] Archiving disabled
[JENKINS] Archiving disabled
[JENKINS] Archiving disabled
[JENKINS] Archiving disabled
[JENKINS] Archiving disabled
[JENKINS] Archiving disabled
[JENKINS] Archiving disabled
[JENKINS] Archiving disabled
[JENKINS] Archiving disabled
[JENKINS] Archiving disabled
[JENKINS] Archiving disabled
[JENKINS] Archiving disabled
[JENKINS] Archiving disabled
[JENKINS] Archiving disabled
[JENKINS] Archiving disabled
[JENKINS] Archiving disabled
[JENKINS] Archiving disabled
[JENKINS] Archiving disabled
[JENKINS] Archiving disabled
[JENKINS] Archiving disabled
[JENKINS] Archiving disabled
[JENKINS] Archiving disabled
[JENKINS] Archiving disabled
[JENKINS] Archiving disabled
[JENKINS] Archiving disabled
[JENKINS] Archiving disabled
[JENKINS] Archiving disabled
[JENKINS] Archiving disabled[INFO] ------------------------------------------------------------------------
[INFO] Reactor Summary:
[INFO] 
[INFO] Apache Stratos .................................... SUCCESS [ 13.571 s]
[INFO] Apache Stratos - Dependent Projects ............... SUCCESS [  2.901 s]
[INFO] Guice ............................................. SUCCESS [  7.899 s]
[INFO] Google Guice - Extensions - MultiBindings ......... SUCCESS [  2.184 s]
[INFO] Guice Assistedinject .............................. SUCCESS [  1.365 s]
[INFO] 99soft :: Rocoto .................................. SUCCESS [  2.703 s]
[INFO] sshj .............................................. SUCCESS [  1.627 s]
[INFO] Apache Stratos - jclouds Dependent Projects ....... SUCCESS [  0.607 s]
[INFO] Apache Stratos - Dependent Projects ............... SUCCESS [  0.423 s]
[INFO] jclouds Google Cloud Core ......................... SUCCESS [  3.423 s]
[INFO] jclouds Google Compute Engine provider ............ SUCCESS [  9.277 s]
[INFO] jclouds Google Cloud Storage provider ............. SUCCESS [  2.270 s]
[INFO] jclouds OAuth Core ................................ SUCCESS [  1.353 s]
[INFO] jclouds Amazon EC2 provider ....................... SUCCESS [ 45.812 s]
[INFO] jclouds Components Core ........................... SUCCESS [  5.019 s]
[INFO] jclouds Components blobstore ...................... SUCCESS [  3.664 s]
[INFO] jclouds Components bouncycastle ................... SUCCESS [  1.531 s]
[INFO] jclouds Components compute ........................ SUCCESS [ 11.067 s]
[INFO] jclouds Components enterprise ..................... SUCCESS [  2.733 s]
[INFO] jclouds Components joda ........................... SUCCESS [  1.554 s]
[INFO] jclouds Components netty .......................... SUCCESS [  1.166 s]
[INFO] jclouds Components sshj ........................... SUCCESS [  2.111 s]
[INFO] jclouds OpenStack Components Core ................. SUCCESS [  1.290 s]
[INFO] jclouds openstack-keystone api .................... SUCCESS [  2.919 s]
[INFO] jclouds openstack-neutron api ..................... SUCCESS [  2.402 s]
[INFO] Apache jclouds :: OpenStack :: Nova API ........... SUCCESS [  3.920 s]
[INFO] jclouds sts api ................................... SUCCESS [  1.798 s]
[INFO] jclouds cloudstack core ........................... SUCCESS [  4.766 s]
[INFO] jclouds ec2 api ................................... SUCCESS [  3.666 s]
[INFO] WSO2 Carbon - UI .................................. SUCCESS [ 45.223 s]
[INFO] Fabric8 ........................................... SUCCESS [  0.826 s]
[INFO] Fabric8 :: Kubernetes API ......................... SUCCESS [ 25.573 s]
[INFO] Apache Stratos - Service Stubs .................... SUCCESS [  0.954 s]
[INFO] Apache Stratos - Cloud Controller Service Stub .... SUCCESS [ 26.862 s]
[INFO] Apache Stratos - Manager Service Stub ............. SUCCESS [ 12.248 s]
[INFO] Apache Stratos - Autoscaler Service Stub .......... SUCCESS [ 17.803 s]
[INFO] Apache Stratos - Components ....................... SUCCESS [  0.547 s]
[INFO] Apache Stratos - Common ........................... SUCCESS [ 14.133 s]
[INFO] Apache Stratos - Messaging ........................ SUCCESS [ 20.180 s]
[INFO] Apache Stratos - Autoscaler ....................... SUCCESS [ 31.819 s]
[INFO] Apache Stratos - Kubernetes API Java Client ....... SUCCESS [  6.949 s]
[INFO] Apache Stratos - Mock IaaS ........................ SUCCESS [  7.221 s]
[INFO] Apache Stratos - Mock IaaS API Client ............. SUCCESS [  9.142 s]
[INFO] Apache Stratos - Cloud Controller ................. SUCCESS [ 14.898 s]
[INFO] Apache Stratos - Manager .......................... SUCCESS [ 11.110 s]
[INFO] Apache Stratos - CLI .............................. SUCCESS [  9.950 s]
[INFO] Apache Stratos - Python Cartridge Agent ........... SUCCESS [  2.527 s]
[INFO] Apache Stratos - Python CLI ....................... SUCCESS [  1.879 s]
[INFO] Apache Stratos - Cartridge Agent .................. SUCCESS [  6.925 s]
[INFO] Apache Stratos - Load Balancer - Common ........... SUCCESS [ 12.912 s]
[INFO] Apache Stratos - Load Balancer .................... SUCCESS [ 21.190 s]
[INFO] Apache Stratos - Load Balancer - Extension API .... SUCCESS [  3.994 s]
[INFO] Apache Stratos - RESTful admin service module ..... SUCCESS [ 25.244 s]
[INFO] Apache Stratos - Cloud Manager UI styles .......... SUCCESS [  8.644 s]
[INFO] Apache Stratos - Custom Handlers .................. SUCCESS [ 11.398 s]
[INFO] Apache Stratos - Metadata Service ................. SUCCESS [ 13.513 s]
[INFO] Apache Stratos - Metadata Client .................. SUCCESS [  5.463 s]
[INFO] Apache Stratos - Mock IaaS API .................... SUCCESS [  4.363 s]
[INFO] Apache Stratos - Extensions ....................... SUCCESS [  0.527 s]
[INFO] Apache Stratos - CEP Extensions ................... SUCCESS [  0.503 s]
[INFO] Apache Stratos - CEP Extensions ................... SUCCESS [  8.014 s]
[INFO] Apache Stratos - CEP Extensions ................... SUCCESS [  4.349 s]
[INFO] Apache Stratos - CEP Extension .................... SUCCESS [  7.129 s]
[INFO] Apache Stratos - Load Balancer Extensions ......... SUCCESS [  0.492 s]
[INFO] Apache Stratos - HAProxy Extension ................ SUCCESS [ 14.209 s]
[INFO] Apache Stratos - Nginx Extension .................. SUCCESS [ 21.708 s]
[INFO] Apache Stratos - LVS Extension .................... SUCCESS [ 12.403 s]
[INFO] Apache Stratos - AWS LB Extension ................. SUCCESS [01:14 min]
[INFO] Apache Stratos - DAS Extension .................... SUCCESS [  4.944 s]
[INFO] Apache Stratos - Metering Service CApps ........... SUCCESS [  6.214 s]
[INFO] Apache Stratos - Monitoring Service CApps ......... SUCCESS [  6.262 s]
[INFO] Apache Stratos - DAS Extension .................... SUCCESS [  1.689 s]
[INFO] Apache Stratos - DAS Extension .................... SUCCESS [  1.051 s]
[INFO] Apache Stratos - Features ......................... SUCCESS [  2.215 s]
[INFO] Apache Stratos - Load Balancer Features ........... SUCCESS [  0.571 s]
[INFO] Apache Stratos - Load Balancer - Management Feature  SUCCESS [  4.068 s]
[INFO] Apache Stratos - Load Balancer - Common Feature ... SUCCESS [  0.638 s]
[INFO] Apache Stratos - Autoscaler Features .............. SUCCESS [  0.584 s]
[INFO] Apache Stratos - Autoscaler Feature ............... SUCCESS [  4.256 s]
[INFO] Apache Stratos - Mock IaaS Features ............... SUCCESS [  0.561 s]
[INFO] Apache Stratos - Mock IaaS API Feature ............ SUCCESS [  5.915 s]
[INFO] Apache Stratos - Cloud Controller Features ........ SUCCESS [  5.345 s]
[INFO] Apache Stratos - Cloud Controller Feature ......... SUCCESS [ 12.256 s]
[INFO] Apache Stratos - Manager Features Aggregator Module  SUCCESS [  0.686 s]

[INFO] Apache Stratos - Stratos Management Aggregator Module  SUCCESS [  0.831 s]
[INFO] Apache Stratos - Management Core Feature .......... SUCCESS [  3.804 s]
[INFO] Apache Stratos - Management Composite Feature ..... SUCCESS [  1.464 s]
[INFO] Apache Stratos - RESTful admin services feature ... SUCCESS [  0.976 s]
[INFO] Apache Stratos - stratos manager admin theme ...... SUCCESS [  0.582 s]
[INFO] Apache Stratos - Meta Data Service feature ........ SUCCESS [  3.614 s]
[INFO] Apache Stratos - Metadata client Feature .......... SUCCESS [  0.818 s]
[INFO] Apache Stratos - Messaging Module ................. SUCCESS [  0.866 s]
[INFO] Apache Stratos - Messaging Feature ................ SUCCESS [  0.751 s]
[INFO] Apache Stratos - Common Features .................. SUCCESS [  0.898 s]
[INFO] Apache Stratos - Common Server Feature ............ SUCCESS [  1.371 s]
[INFO] Apache Stratos - Custom Handlers Feature .......... SUCCESS [  1.703 s]
[INFO] Apache Stratos - Common Composite Feature ......... SUCCESS [  0.906 s]
[INFO] Apache Stratos - CEP Features ..................... SUCCESS [  0.454 s]
[INFO] Apache Stratos - Event Processor Server Feature ... SUCCESS [  1.027 s]
[INFO] Apache Stratos - Event Processor Aggregator Feature  SUCCESS [  2.073 s]
[INFO] Apache Stratos - Products ......................... SUCCESS [  0.576 s]
[INFO] Apache Stratos - Python Cartridge Agent Product ... SUCCESS [  0.527 s]
[INFO] Apache Stratos - Python Cartridge Agent ........... SUCCESS [  3.880 s]
[INFO] Apache Stratos - Python Cartridge Agent Integration Aggregator  SUCCESS [  2.052 s]
[INFO] Apache Stratos - PCA - Integration Common Module .. SUCCESS [  8.770 s]
[INFO] Apache Stratos - PCA - Integration Tests .......... SUCCESS [  7.267 s]
[INFO] Apache Stratos - Cartridge Agent Product .......... SUCCESS [  0.594 s]
[INFO] Apache Stratos - Java Cartridge Agent Distribution  SUCCESS [ 12.857 s]
[INFO] Apache Stratos - Python CLI Product ............... SUCCESS [  0.530 s]
[INFO] Apache Stratos - Python CLI ....................... SUCCESS [  0.739 s]
[INFO] Apache Stratos - CLI Product ...................... SUCCESS [  0.570 s]
[INFO] Apache Stratos - CLI .............................. SUCCESS [ 21.164 s]
[INFO] Apache Stratos - Load Balancer Product ............ SUCCESS [  4.740 s]
[INFO] Apache Stratos - Load Balancer - P2 Profile Generation  SUCCESS [ 59.411 s]
[INFO] Apache Stratos - Load Balancer - Distribution ..... SUCCESS [ 30.187 s]
[INFO] Apache Stratos - Product .......................... SUCCESS [  4.716 s]
[INFO] Apache Stratos - Profile Generation ............... SUCCESS [08:35 min]
[INFO] Apache Stratos - Distribution ..................... SUCCESS [01:51 min]
[INFO] Apache Stratos - Integration Aggregation Module ... SUCCESS [  1.433 s]
[INFO] Apache Stratos - Integration Common Module ........ SUCCESS [02:28 min]
[INFO] Apache Stratos - Integration Tests ................ FAILURE [ 23.264 s]
[INFO] ------------------------------------------------------------------------
[INFO] BUILD FAILURE
[INFO] ------------------------------------------------------------------------
[INFO] Total time: 31:30 min
[INFO] Finished at: 2016-01-28T22:35:33+00:00
[INFO] Final Memory: 693M/1282M
[INFO] ------------------------------------------------------------------------
[ERROR] Failed to execute goal org.apache.maven.plugins:maven-compiler-plugin:2.3.1:testCompile
(default-testCompile) on project stratos-test-integration: Compilation failure: Compilation
failure:
[ERROR] error: error reading /x1/jenkins/jenkins-master/jenkins-home/maven-repositories/0/org/apache/xerces/xml-apis/2.9.1/xml-apis-2.9.1.jar;
error in opening zip file
[ERROR] error: error reading /x1/jenkins/jenkins-master/jenkins-home/maven-repositories/0/org/apache/xerces/xercesImpl/2.9.1/xercesImpl-2.9.1.jar;
error in opening zip file
[ERROR] error: error reading /x1/jenkins/jenkins-master/jenkins-home/maven-repositories/0/org/apache/xerces/resolver/2.9.1/resolver-2.9.1.jar;
error in opening zip file
[ERROR] error: error reading /x1/jenkins/jenkins-master/jenkins-home/maven-repositories/0/org/apache/xerces/serializer/2.9.1/serializer-2.9.1.jar;
error in opening zip file
[ERROR] -> [Help 1]
[ERROR] 
[ERROR] To see the full stack trace of the errors, re-run Maven with the -e switch.
[ERROR] Re-run Maven using the -X switch to enable full debug logging.
[ERROR] 
[ERROR] For more information about the errors and possible solutions, please read the following
articles:
[ERROR] [Help 1] http://cwiki.apache.org/confluence/display/MAVEN/MojoFailureException
[ERROR] 
[ERROR] After correcting the problems, you can resume the build with the command
[ERROR]   mvn <goals> -rf :stratos-test-integration
Sending e-mails to: dev@stratos.apache.org
Skipping sonar analysis due to bad build status FAILURE

Mime
View raw message