stratos-dev mailing list archives

Site index · List index
Message view « Date » · « Thread »
Top « Date » · « Thread »
From gmcdon...@apache.org
Subject Build failed in Jenkins: stratos » Apache Stratos - Integration Tests #430
Date Thu, 28 Jan 2016 22:35:45 GMT
See <https://analysis.apache.org/jenkins/job/stratos/org.apache.stratos$stratos-test-integration/430/>

------------------------------------------
[INFO]                                                                         
[INFO] ------------------------------------------------------------------------
[INFO] Building Apache Stratos - Integration Tests 4.1.5-SNAPSHOT
[INFO] ------------------------------------------------------------------------
[INFO] 
[INFO] --- maven-clean-plugin:2.4.1:clean (default-clean) @ stratos-test-integration ---
[INFO] Deleting <https://analysis.apache.org/jenkins/job/stratos/org.apache.stratos$stratos-test-integration/ws/target>
[INFO] 
[INFO] --- maven-enforcer-plugin:1.3.1:enforce (enforce) @ stratos-test-integration ---
[INFO] 
[INFO] --- incremental-build-plugin:1.3:incremental-build (default) @ stratos-test-integration
---
[INFO] Verifying module descriptor ...
[INFO] Pom descriptor modification detected.
[INFO] Deleting <https://analysis.apache.org/jenkins/job/stratos/org.apache.stratos$stratos-test-integration/ws/target>
[INFO] 
[INFO] --- maven-remote-resources-plugin:1.4:process (default) @ stratos-test-integration
---
[WARNING] Invalid project model for artifact [bcprov-jdk14:bouncycastle:140]. It will be ignored
by the remote resources Mojo.
[WARNING] Invalid project model for artifact [opensaml1:org.opensaml:1.1]. It will be ignored
by the remote resources Mojo.
[WARNING] Invalid project model for artifact [bcprov-ext-jdk15:org.bouncycastle:1.40]. It
will be ignored by the remote resources Mojo.
[INFO] 
[INFO] --- maven-resources-plugin:2.7:resources (default-resources) @ stratos-test-integration
---
[INFO] Using 'UTF-8' encoding to copy filtered resources.
[INFO] skip non existing resourceDirectory <https://analysis.apache.org/jenkins/job/stratos/org.apache.stratos$stratos-test-integration/ws/src/main/resources>
[INFO] Copying 3 resources
[INFO] 
[INFO] --- maven-compiler-plugin:2.3.1:compile (default-compile) @ stratos-test-integration
---
[INFO] No sources to compile
[INFO] 
[INFO] --- maven-dependency-plugin:2.10:copy-dependencies (copy-jacoco­dependencies) @ stratos-test-integration
---
[INFO] Copying org.jacoco.agent-0.7.4.201502262128.jar to <https://analysis.apache.org/jenkins/job/stratos/org.apache.stratos$stratos-test-integration/ws/target/jacoco/org.jacoco.agent-0.7.4.201502262128.jar>
[INFO] 
[INFO] --- maven-dependency-plugin:2.10:copy-dependencies (copy-secVerifier) @ stratos-test-integration
---
[INFO] Copying SecVerifier-4.2.0.aar to <https://analysis.apache.org/jenkins/job/stratos/org.apache.stratos$stratos-test-integration/ws/target/security-verifier/SecVerifier.aar>
[INFO] 
[INFO] --- maven-resources-plugin:2.7:testResources (default-testResources) @ stratos-test-integration
---
[INFO] Using 'UTF-8' encoding to copy filtered resources.
[INFO] Copying 173 resources
[INFO] Copying 3 resources
[INFO] 
[INFO] --- maven-compiler-plugin:2.3.1:testCompile (default-testCompile) @ stratos-test-integration
---
[INFO] Compiling 24 source files to <https://analysis.apache.org/jenkins/job/stratos/org.apache.stratos$stratos-test-integration/ws/target/test-classes>
[INFO] -------------------------------------------------------------
[ERROR] COMPILATION ERROR : 
[INFO] -------------------------------------------------------------
[ERROR] error: error reading /x1/jenkins/jenkins-master/jenkins-home/maven-repositories/0/org/apache/xerces/xml-apis/2.9.1/xml-apis-2.9.1.jar;
error in opening zip file
[ERROR] error: error reading /x1/jenkins/jenkins-master/jenkins-home/maven-repositories/0/org/apache/xerces/xercesImpl/2.9.1/xercesImpl-2.9.1.jar;
error in opening zip file
[ERROR] error: error reading /x1/jenkins/jenkins-master/jenkins-home/maven-repositories/0/org/apache/xerces/resolver/2.9.1/resolver-2.9.1.jar;
error in opening zip file
[ERROR] error: error reading /x1/jenkins/jenkins-master/jenkins-home/maven-repositories/0/org/apache/xerces/serializer/2.9.1/serializer-2.9.1.jar;
error in opening zip file
[INFO] 4 errors 
[INFO] -------------------------------------------------------------
[JENKINS] Archiving disabled

Mime
View raw message