struts-issues mailing list archives

Site index · List index
Message view « Date » · « Thread »
Top « Date » · « Thread »
From "Martin Gainty (JIRA)" <j...@apache.org>
Subject [jira] Created: (WW-3243) 113 surefire failures for 2.1.7
Date Thu, 10 Sep 2009 15:59:33 GMT
113 surefire failures for 2.1.7
-------------------------------

                 Key: WW-3243
                 URL: https://issues.apache.org/struts/browse/WW-3243
             Project: Struts 2
          Issue Type: Bug
    Affects Versions: 2.1.7
         Environment: struts-2.1.7\current\struts2>mvn -e -X install > errors.lst
            Reporter: Martin Gainty


Running org.apache.struts2.views.jsp.ui.TokenTagTest
Tests run: 12, Failures: 1, Errors: 0, Skipped: 11, Time elapsed: 0.219 sec <<< FAILURE!
Running org.apache.struts2.views.jsp.ui.OptGroupTest
Tests run: 12, Failures: 1, Errors: 0, Skipped: 11, Time elapsed: 0.016 sec <<< FAILURE!
Running org.apache.struts2.views.jsp.ui.AnchorTest
Tests run: 9, Failures: 1, Errors: 0, Skipped: 8, Time elapsed: 0.031 sec <<< FAILURE!
Running org.apache.struts2.config.SettingsTest
Tests run: 9, Failures: 1, Errors: 0, Skipped: 8, Time elapsed: 0.015 sec <<< FAILURE!
Running org.apache.struts2.dispatcher.FilterTest
Tests run: 6, Failures: 1, Errors: 0, Skipped: 5, Time elapsed: 0.016 sec <<< FAILURE!
Running org.apache.struts2.views.jsp.SortIteratorTagTest
Tests run: 15, Failures: 1, Errors: 0, Skipped: 14, Time elapsed: 0.016 sec <<< FAILURE!
Running org.apache.struts2.dispatcher.HttpHeaderResultTest
Tests run: 18, Failures: 1, Errors: 0, Skipped: 17, Time elapsed: 0.015 sec <<< FAILURE!
Running org.apache.struts2.dispatcher.SessionMapTest
Tests run: 10, Failures: 0, Errors: 0, Skipped: 0, Time elapsed: 0.172 sec
Running org.apache.struts2.views.jsp.PropertyTagTest
Tests run: 18, Failures: 1, Errors: 0, Skipped: 17, Time elapsed: 0.031 sec <<< FAILURE!
Running org.apache.struts2.interceptor.validation.JSONValidationInterceptorTest
Tests run: 6, Failures: 1, Errors: 0, Skipped: 5, Time elapsed: 0.016 sec <<< FAILURE!
Running org.apache.struts2.views.jsp.ui.DivTest
Tests run: 9, Failures: 1, Errors: 0, Skipped: 8, Time elapsed: 0.016 sec <<< FAILURE!
Running org.apache.struts2.RequestUtilsTest
Tests run: 5, Failures: 0, Errors: 0, Skipped: 0, Time elapsed: 0.047 sec
Running org.apache.struts2.interceptor.MessageStoreInterceptorTest
Tests run: 18, Failures: 1, Errors: 0, Skipped: 17, Time elapsed: 0.015 sec <<< FAILURE!
Running org.apache.struts2.views.jsp.DynAttribsTest
Tests run: 2, Failures: 1, Errors: 0, Skipped: 1, Time elapsed: 0.016 sec <<< FAILURE!
Running org.apache.struts2.views.jsp.IteratorTagTest
Tests run: 96, Failures: 2, Errors: 0, Skipped: 94, Time elapsed: 0.031 sec <<< FAILURE!
Running org.apache.struts2.dispatcher.ng.StrutsPrepareAndExecuteFilterIntegrationTest
SEVERE:   [05:30.859] Dispatcher initialization failed
SEVERE:   [05:30.953] Dispatcher initialization failed
SEVERE:   [05:31.031] Dispatcher initialization failed
SEVERE:   [05:31.156] Dispatcher initialization failed
SEVERE:   [05:31.218] Dispatcher initialization failed
SEVERE:   [05:31.265] Dispatcher initialization failed
Tests run: 6, Failures: 6, Errors: 0, Skipped: 0, Time elapsed: 0.719 sec <<< FAILURE!
Running org.apache.struts2.views.jsp.ui.FileTest
Tests run: 9, Failures: 1, Errors: 0, Skipped: 8, Time elapsed: 0.015 sec <<< FAILURE!
Running org.apache.struts2.interceptor.validation.AnnotationValidationInterceptorTest
Tests run: 12, Failures: 1, Errors: 0, Skipped: 11, Time elapsed: 0.016 sec <<< FAILURE!
Running org.apache.struts2.dispatcher.ActionContextCleanUpTest
Tests run: 2, Failures: 0, Errors: 0, Skipped: 0, Time elapsed: 0 sec
Running org.apache.struts2.views.jsp.ui.RadioTest
Tests run: 24, Failures: 1, Errors: 0, Skipped: 23, Time elapsed: 0.015 sec <<< FAILURE!
Running org.apache.struts2.dispatcher.DispatcherTest
Tests run: 21, Failures: 1, Errors: 0, Skipped: 20, Time elapsed: 0 sec <<< FAILURE!
Running org.apache.struts2.views.jsp.IfTagTest
Tests run: 20, Failures: 1, Errors: 0, Skipped: 19, Time elapsed: 0.032 sec <<< FAILURE!
Running org.apache.struts2.views.jsp.TextTagTest
Tests run: 45, Failures: 1, Errors: 0, Skipped: 44, Time elapsed: 0.015 sec <<< FAILURE!
Running org.apache.struts2.views.util.ContextUtilTest
Tests run: 27, Failures: 1, Errors: 0, Skipped: 26, Time elapsed: 0.016 sec <<< FAILURE!
Running org.apache.struts2.interceptor.RolesInterceptorTest
Tests run: 6, Failures: 1, Errors: 0, Skipped: 5, Time elapsed: 0.015 sec <<< FAILURE!
Running org.apache.struts2.views.jsp.ui.ActionMessageTagTest
Tests run: 9, Failures: 1, Errors: 0, Skipped: 8, Time elapsed: 0.016 sec <<< FAILURE!
Running org.apache.struts2.interceptor.CookieInterceptorTest
Tests run: 21, Failures: 1, Errors: 0, Skipped: 20, Time elapsed: 0.016 sec <<< FAILURE!
Running org.apache.struts2.util.TokenHelperTest
WARNING:  [05:31.453] Could not find token mapped to token name 
Tests run: 4, Failures: 0, Errors: 0, Skipped: 0, Time elapsed: 0 sec
Running org.apache.struts2.dispatcher.StaticContentLoaderTest
Tests run: 8, Failures: 0, Errors: 0, Skipped: 0, Time elapsed: 0.031 sec
Running org.apache.struts2.interceptor.ServletConfigInterceptorTest
Tests run: 24, Failures: 1, Errors: 0, Skipped: 23, Time elapsed: 0.016 sec <<< FAILURE!
Running org.apache.struts2.dispatcher.FilterDispatcherTest
Tests run: 9, Failures: 1, Errors: 0, Skipped: 8, Time elapsed: 0.015 sec <<< FAILURE!
Running org.apache.struts2.views.jsp.ui.ValidationStylesTest
Tests run: 15, Failures: 2, Errors: 0, Skipped: 13, Time elapsed: 0.016 sec <<< FAILURE!
Running org.apache.struts2.dispatcher.VelocityResultTest
Tests run: 8, Failures: 1, Errors: 0, Skipped: 7, Time elapsed: 0.015 sec <<< FAILURE!
Running org.apache.struts2.views.jsp.IteratorGeneratorTagTest
Tests run: 15, Failures: 1, Errors: 0, Skipped: 14, Time elapsed: 0.016 sec <<< FAILURE!
Running org.apache.struts2.interceptor.ExecuteAndWaitInterceptorTest
Tests run: 18, Failures: 1, Errors: 0, Skipped: 17, Time elapsed: 0.016 sec <<< FAILURE!
Running org.apache.struts2.dispatcher.ng.TwoFilterIntegrationTest
SEVERE:   [05:31.625] Dispatcher initialization failed
SEVERE:   [05:31.734] Dispatcher initialization failed
SEVERE:   [05:31.765] Dispatcher initialization failed
SEVERE:   [05:31.796] Dispatcher initialization failed
SEVERE:   [05:31.843] Dispatcher initialization failed
Tests run: 5, Failures: 5, Errors: 0, Skipped: 0, Time elapsed: 0.265 sec <<< FAILURE!
Running org.apache.struts2.interceptor.FileUploadInterceptorTest
Tests run: 30, Failures: 1, Errors: 0, Skipped: 29, Time elapsed: 0.016 sec <<< FAILURE!
Running org.apache.struts2.views.jsp.ui.OptionTransferSelectTagTest
Tests run: 21, Failures: 1, Errors: 0, Skipped: 20, Time elapsed: 0.031 sec <<< FAILURE!
Running org.apache.struts2.components.FormButtonTest
Tests run: 18, Failures: 1, Errors: 0, Skipped: 17, Time elapsed: 0 sec <<< FAILURE!
Running org.apache.struts2.components.ActionComponentTest
Tests run: 3, Failures: 1, Errors: 0, Skipped: 2, Time elapsed: 0.016 sec <<< FAILURE!
Running org.apache.struts2.views.freemarker.FreeMarkerResultTest
Tests run: 6, Failures: 1, Errors: 0, Skipped: 5, Time elapsed: 0.015 sec <<< FAILURE!
Running org.apache.struts2.views.jsp.ui.CheckboxTest
Tests run: 27, Failures: 1, Errors: 0, Skipped: 26, Time elapsed: 0.016 sec <<< FAILURE!
Running org.apache.struts2.views.jsp.PushTagTest
Tests run: 3, Failures: 1, Errors: 0, Skipped: 2, Time elapsed: 0.016 sec <<< FAILURE!
Running org.apache.struts2.dispatcher.ServletActionRedirectResultTest
Tests run: 9, Failures: 1, Errors: 0, Skipped: 8, Time elapsed: 0 sec <<< FAILURE!
Running org.apache.struts2.dispatcher.mapper.CompositeActionMapperTest
Tests run: 2, Failures: 0, Errors: 0, Skipped: 0, Time elapsed: 0.015 sec
Running org.apache.struts2.views.freemarker.FreemarkerManagerTest
Tests run: 3, Failures: 1, Errors: 0, Skipped: 2, Time elapsed: 0.016 sec <<< FAILURE!
Running org.apache.struts2.util.StrutsUtilTest
Tests run: 39, Failures: 1, Errors: 0, Skipped: 38, Time elapsed: 0.016 sec <<< FAILURE!
Running org.apache.struts2.views.jsp.ui.JspTemplateTest
Tests run: 3, Failures: 1, Errors: 0, Skipped: 2, Time elapsed: 0.015 sec <<< FAILURE!
Running org.apache.struts2.views.jsp.ui.SelectTest
Tests run: 51, Failures: 1, Errors: 0, Skipped: 50, Time elapsed: 0.031 sec <<< FAILURE!
Running org.apache.struts2.dispatcher.StrutsResultSupportTest
Tests run: 9, Failures: 1, Errors: 0, Skipped: 8, Time elapsed: 0 sec <<< FAILURE!
Running org.apache.struts2.components.FormTest
Tests run: 3, Failures: 1, Errors: 0, Skipped: 2, Time elapsed: 0 sec <<< FAILURE!
Running org.apache.struts2.views.jsp.ui.DateTagTest
Tests run: 42, Failures: 1, Errors: 0, Skipped: 41, Time elapsed: 0.031 sec <<< FAILURE!
Running org.apache.struts2.views.jsp.ui.TooltipTest
Tests run: 27, Failures: 2, Errors: 0, Skipped: 25, Time elapsed: 0.016 sec <<< FAILURE!
Running org.apache.struts2.views.jsp.ui.UpDownSelectTagTest
Tests run: 39, Failures: 1, Errors: 0, Skipped: 38, Time elapsed: 0 sec <<< FAILURE!
Running org.apache.struts2.views.jsp.ElseTagTest
Tests run: 6, Failures: 1, Errors: 0, Skipped: 5, Time elapsed: 0.016 sec <<< FAILURE!
Running org.apache.struts2.views.jsp.ui.TextareaTest
Tests run: 9, Failures: 1, Errors: 0, Skipped: 8, Time elapsed: 0.078 sec <<< FAILURE!
Running org.apache.struts2.views.jsp.ui.FieldErrorTagTest
Tests run: 30, Failures: 1, Errors: 0, Skipped: 29, Time elapsed: 0.015 sec <<< FAILURE!
Running org.apache.struts2.views.jsp.ui.DoubleSelectTest
Tests run: 18, Failures: 1, Errors: 0, Skipped: 17, Time elapsed: 0 sec <<< FAILURE!
Running org.apache.struts2.views.jsp.ui.TextfieldTest
Tests run: 27, Failures: 1, Errors: 0, Skipped: 26, Time elapsed: 0.016 sec <<< FAILURE!
Running org.apache.struts2.util.PrefixTrieTest
Tests run: 1, Failures: 0, Errors: 0, Skipped: 0, Time elapsed: 0 sec
Running org.apache.struts2.dispatcher.PlainTextResultTest
Tests run: 6, Failures: 1, Errors: 0, Skipped: 5, Time elapsed: 0.015 sec <<< FAILURE!
Running org.apache.struts2.dispatcher.mapper.Restful2ActionMapperTest
Tests run: 20, Failures: 1, Errors: 0, Skipped: 19, Time elapsed: 0.016 sec <<< FAILURE!
Running org.apache.struts2.views.jsp.ui.HiddenTest
Tests run: 12, Failures: 1, Errors: 0, Skipped: 11, Time elapsed: 0.015 sec <<< FAILURE!
Running org.apache.struts2.views.jsp.AppendIteratorTagTest
Tests run: 6, Failures: 1, Errors: 0, Skipped: 5, Time elapsed: 0.016 sec <<< FAILURE!
Running org.apache.struts2.views.jsp.BeanTagTest
Tests run: 3, Failures: 1, Errors: 0, Skipped: 2, Time elapsed: 0 sec <<< FAILURE!
Running org.apache.struts2.util.CounterTest
Tests run: 3, Failures: 0, Errors: 0, Skipped: 0, Time elapsed: 0 sec
Running org.apache.struts2.views.jsp.ElseIfTagTest
Tests run: 8, Failures: 1, Errors: 0, Skipped: 7, Time elapsed: 0.016 sec <<< FAILURE!
Running org.apache.struts2.views.jsp.ActionTagTest
Tests run: 36, Failures: 1, Errors: 0, Skipped: 35, Time elapsed: 0.015 sec <<< FAILURE!
Running org.apache.struts2.components.PropertyTest
Tests run: 18, Failures: 1, Errors: 0, Skipped: 17, Time elapsed: 0.016 sec <<< FAILURE!
Running org.apache.struts2.views.jsp.ui.FormTagTest
Tests run: 63, Failures: 2, Errors: 0, Skipped: 61, Time elapsed: 0.016 sec <<< FAILURE!
Running org.apache.struts2.views.jsp.ui.ResetTest
Tests run: 18, Failures: 1, Errors: 0, Skipped: 17, Time elapsed: 0.015 sec <<< FAILURE!
Running org.apache.struts2.config.BeanSelectionProviderTest
Tests run: 1, Failures: 0, Errors: 0, Skipped: 0, Time elapsed: 0.016 sec
Running org.apache.struts2.views.xslt.XSLTResultTest
Tests run: 30, Failures: 1, Errors: 0, Skipped: 29, Time elapsed: 0.015 sec <<< FAILURE!
Running org.apache.struts2.views.jsp.ui.ComponentTest
Tests run: 12, Failures: 1, Errors: 0, Skipped: 11, Time elapsed: 0 sec <<< FAILURE!
Running org.apache.struts2.views.jsp.ui.PasswordTest
Tests run: 9, Failures: 1, Errors: 0, Skipped: 8, Time elapsed: 0.016 sec <<< FAILURE!
Running org.apache.struts2.dispatcher.StreamResultTest
Tests run: 24, Failures: 1, Errors: 0, Skipped: 23, Time elapsed: 0.016 sec <<< FAILURE!
Running org.apache.struts2.views.jsp.ui.LabelTest
Tests run: 21, Failures: 1, Errors: 0, Skipped: 20, Time elapsed: 0 sec <<< FAILURE!
Running org.apache.struts2.views.jsp.ui.ActionErrorTagTest
Tests run: 9, Failures: 1, Errors: 0, Skipped: 8, Time elapsed: 0.015 sec <<< FAILURE!
Running org.apache.struts2.views.jsp.SetTagTest
Tests run: 18, Failures: 2, Errors: 0, Skipped: 16, Time elapsed: 0.016 sec <<< FAILURE!
Running org.apache.struts2.util.StrutsTypeConverterTest
Tests run: 4, Failures: 0, Errors: 0, Skipped: 0, Time elapsed: 0 sec
Running org.apache.struts2.views.jsp.URLTagTest
Tests run: 75, Failures: 2, Errors: 0, Skipped: 73, Time elapsed: 0.016 sec <<< FAILURE!
Running org.apache.struts2.interceptor.StrutsConversionErrorInterceptorTest
Tests run: 4, Failures: 1, Errors: 0, Skipped: 3, Time elapsed: 0 sec <<< FAILURE!
Running org.apache.struts2.util.InvocationSessionStoreTest
Tests run: 4, Failures: 1, Errors: 0, Skipped: 3, Time elapsed: 0.016 sec <<< FAILURE!
Running org.apache.struts2.views.util.UrlHelperTest
Tests run: 38, Failures: 1, Errors: 0, Skipped: 37, Time elapsed: 0.015 sec <<< FAILURE!
Running org.apache.struts2.views.jsp.MergeIteratorTagTest
Tests run: 6, Failures: 1, Errors: 0, Skipped: 5, Time elapsed: 0 sec <<< FAILURE!
Running org.apache.struts2.components.template.BaseTemplateEngineTest
dummy resource url=file:/C:/Struts/struts-2.1.7/current/struts2/core/target/test-classes/org/apache/struts2/components/template/dummy.properties
resource file=C:\Struts\struts-2.1.7\current\struts2\core\target\test-classes\org\apache\struts2\components\template\dummy.properties
theme properties dir=C:\Struts\struts-2.1.7\current\struts2\core\target\test-classes\org\apache\struts2\components\template
Tests run: 2, Failures: 0, Errors: 0, Skipped: 0, Time elapsed: 0.016 sec
Running org.apache.struts2.dispatcher.ServletRedirectResultTest
Tests run: 12, Failures: 1, Errors: 0, Skipped: 11, Time elapsed: 0 sec <<< FAILURE!
Running org.apache.struts2.views.jsp.IncludeTagTest
Tests run: 12, Failures: 1, Errors: 0, Skipped: 11, Time elapsed: 0.016 sec <<< FAILURE!
Running org.apache.struts2.views.jsp.ui.ComboBoxTest
Tests run: 18, Failures: 1, Errors: 0, Skipped: 17, Time elapsed: 0.015 sec <<< FAILURE!
Running org.apache.struts2.interceptor.CheckboxInterceptorTest
Tests run: 18, Failures: 1, Errors: 0, Skipped: 17, Time elapsed: 0.016 sec <<< FAILURE!
Running org.apache.struts2.ServletActionContextTest
Tests run: 2, Failures: 0, Errors: 0, Skipped: 0, Time elapsed: 0 sec
Running org.apache.struts2.interceptor.TokenSessionStoreInterceptorTest
Tests run: 10, Failures: 1, Errors: 0, Skipped: 9, Time elapsed: 0.016 sec <<< FAILURE!
Running org.apache.struts2.views.jsp.ui.InputTransferSelectTagTest
Tests run: 3, Failures: 1, Errors: 0, Skipped: 2, Time elapsed: 0.015 sec <<< FAILURE!
Running org.apache.struts2.views.jsp.I18nTagTest
Tests run: 4, Failures: 1, Errors: 0, Skipped: 3, Time elapsed: 0 sec <<< FAILURE!
Running org.apache.struts2.components.UIBeanTest
Tests run: 24, Failures: 1, Errors: 0, Skipped: 23, Time elapsed: 0 sec <<< FAILURE!
Running org.apache.struts2.interceptor.ClearSessionInterceptorTest
Tests run: 3, Failures: 1, Errors: 0, Skipped: 2, Time elapsed: 0.015 sec <<< FAILURE!
Running org.apache.struts2.views.jsp.SubsetIteratorTagTest
Tests run: 18, Failures: 1, Errors: 0, Skipped: 17, Time elapsed: 0.016 sec <<< FAILURE!
Running org.apache.struts2.components.UIComponentTest
Tests run: 60, Failures: 1, Errors: 0, Skipped: 59, Time elapsed: 0.031 sec <<< FAILURE!
Running org.apache.struts2.dispatcher.ServletDispatcherResultTest
Tests run: 6, Failures: 1, Errors: 0, Skipped: 5, Time elapsed: 0 sec <<< FAILURE!
Running org.apache.struts2.views.freemarker.tags.TagModelTest
Tests run: 6, Failures: 1, Errors: 0, Skipped: 5, Time elapsed: 0.016 sec <<< FAILURE!
Running org.apache.struts2.views.jsp.AnchorTagTest
Tests run: 75, Failures: 2, Errors: 0, Skipped: 73, Time elapsed: 0.016 sec <<< FAILURE!
Running org.apache.struts2.util.ContainUtilTest
Tests run: 7, Failures: 0, Errors: 0, Skipped: 0, Time elapsed: 0.015 sec
Running org.apache.struts2.views.util.ResourceUtilTest
Tests run: 1, Failures: 0, Errors: 0, Skipped: 0, Time elapsed: 0 sec
Running org.apache.struts2.views.jsp.ui.HeadTagTest
Tests run: 3, Failures: 1, Errors: 0, Skipped: 2, Time elapsed: 0 sec <<< FAILURE!
Running org.apache.struts2.views.jsp.ui.CheckboxListTest
Tests run: 18, Failures: 1, Errors: 0, Skipped: 17, Time elapsed: 0.016 sec <<< FAILURE!
Running org.apache.struts2.interceptor.CreateSessionInterceptorTest
Tests run: 3, Failures: 1, Errors: 0, Skipped: 2, Time elapsed: 0.015 sec <<< FAILURE!
Running org.apache.struts2.components.ComponentTest
Tests run: 45, Failures: 1, Errors: 0, Skipped: 44, Time elapsed: 0.094 sec <<< FAILURE!
Running org.apache.struts2.views.freemarker.FreemarkerTest
Tests run: 6, Failures: 1, Errors: 0, Skipped: 5, Time elapsed: 0.016 sec <<< FAILURE!
Running org.apache.struts2.interceptor.TokenInterceptorTest
Tests run: 8, Failures: 1, Errors: 0, Skipped: 7, Time elapsed: 0 sec <<< FAILURE!
Running org.apache.struts2.views.TemplateEngineManagerTest
Tests run: 3, Failures: 0, Errors: 0, Skipped: 0, Time elapsed: 0.015 sec
Running org.apache.struts2.dispatcher.mapper.RestfulActionMapperTest
Tests run: 7, Failures: 0, Errors: 0, Skipped: 0, Time elapsed: 0 sec
Running org.apache.struts2.views.jsp.ui.SubmitTest
Tests run: 39, Failures: 1, Errors: 0, Skipped: 38, Time elapsed: 0.016 sec <<< FAILURE!
Running org.apache.struts2.dispatcher.mapper.DefaultActionMapperTest
Tests run: 98, Failures: 1, Errors: 0, Skipped: 97, Time elapsed: 0.031 sec <<< FAILURE!
Running org.apache.struts2.config.LegacyPropertiesConfigurationProviderTest
Tests run: 2, Failures: 0, Errors: 0, Skipped: 0, Time elapsed: 0 sec

Results :

Failed tests: 
  setUp(org.apache.struts2.views.jsp.ui.TokenTagTest)
  setUp(org.apache.struts2.views.jsp.ui.OptGroupTest)
  setUp(org.apache.struts2.views.jsp.ui.AnchorTest)
  setUp(org.apache.struts2.config.SettingsTest)
  setUp(org.apache.struts2.dispatcher.FilterTest)
  setUp(org.apache.struts2.views.jsp.SortIteratorTagTest)
  setUp(org.apache.struts2.dispatcher.HttpHeaderResultTest)
  setUp(org.apache.struts2.views.jsp.PropertyTagTest)
  setUp(org.apache.struts2.interceptor.validation.JSONValidationInterceptorTest)
  setUp(org.apache.struts2.views.jsp.ui.DivTest)
  setUp(org.apache.struts2.interceptor.MessageStoreInterceptorTest)
  setUp(org.apache.struts2.views.jsp.DynAttribsTest)
  setUp(org.apache.struts2.views.jsp.IteratorTagTest)
  tearDown(org.apache.struts2.views.jsp.IteratorTagTest)
  testStaticExecute(org.apache.struts2.dispatcher.ng.StrutsPrepareAndExecuteFilterIntegrationTest)
  testActionMappingLookup(org.apache.struts2.dispatcher.ng.StrutsPrepareAndExecuteFilterIntegrationTest)
  test404(org.apache.struts2.dispatcher.ng.StrutsPrepareAndExecuteFilterIntegrationTest)
  testUriPatternExclusion(org.apache.struts2.dispatcher.ng.StrutsPrepareAndExecuteFilterIntegrationTest)
  testStaticFallthrough(org.apache.struts2.dispatcher.ng.StrutsPrepareAndExecuteFilterIntegrationTest)
  test200(org.apache.struts2.dispatcher.ng.StrutsPrepareAndExecuteFilterIntegrationTest)
  setUp(org.apache.struts2.views.jsp.ui.FileTest)
  setUp(org.apache.struts2.interceptor.validation.AnnotationValidationInterceptorTest)
  setUp(org.apache.struts2.views.jsp.ui.RadioTest)
  setUp(org.apache.struts2.dispatcher.DispatcherTest)
  setUp(org.apache.struts2.views.jsp.IfTagTest)
  setUp(org.apache.struts2.views.jsp.TextTagTest)
  setUp(org.apache.struts2.views.util.ContextUtilTest)
  setUp(org.apache.struts2.interceptor.RolesInterceptorTest)
  setUp(org.apache.struts2.views.jsp.ui.ActionMessageTagTest)
  setUp(org.apache.struts2.interceptor.CookieInterceptorTest)
  setUp(org.apache.struts2.interceptor.ServletConfigInterceptorTest)
  setUp(org.apache.struts2.dispatcher.FilterDispatcherTest)
  setUp(org.apache.struts2.views.jsp.ui.ValidationStylesTest)
  tearDown(org.apache.struts2.views.jsp.ui.ValidationStylesTest)
  setUp(org.apache.struts2.dispatcher.VelocityResultTest)
  setUp(org.apache.struts2.views.jsp.IteratorGeneratorTagTest)
  setUp(org.apache.struts2.interceptor.ExecuteAndWaitInterceptorTest)
  testFilterInMiddle(org.apache.struts2.dispatcher.ng.TwoFilterIntegrationTest)
  test200(org.apache.struts2.dispatcher.ng.TwoFilterIntegrationTest)
  testStaticFallthrough(org.apache.struts2.dispatcher.ng.TwoFilterIntegrationTest)
  test404(org.apache.struts2.dispatcher.ng.TwoFilterIntegrationTest)
  testStaticExecute(org.apache.struts2.dispatcher.ng.TwoFilterIntegrationTest)
  setUp(org.apache.struts2.interceptor.FileUploadInterceptorTest)
  setUp(org.apache.struts2.views.jsp.ui.OptionTransferSelectTagTest)
  setUp(org.apache.struts2.components.FormButtonTest)
  setUp(org.apache.struts2.components.ActionComponentTest)
  setUp(org.apache.struts2.views.freemarker.FreeMarkerResultTest)
  setUp(org.apache.struts2.views.jsp.ui.CheckboxTest)
  setUp(org.apache.struts2.views.jsp.PushTagTest)
  setUp(org.apache.struts2.dispatcher.ServletActionRedirectResultTest)
  setUp(org.apache.struts2.views.freemarker.FreemarkerManagerTest)
  setUp(org.apache.struts2.util.StrutsUtilTest)
  setUp(org.apache.struts2.views.jsp.ui.JspTemplateTest)
  setUp(org.apache.struts2.views.jsp.ui.SelectTest)
  setUp(org.apache.struts2.dispatcher.StrutsResultSupportTest)
  setUp(org.apache.struts2.components.FormTest)
  setUp(org.apache.struts2.views.jsp.ui.DateTagTest)
  setUp(org.apache.struts2.views.jsp.ui.TooltipTest)
  tearDown(org.apache.struts2.views.jsp.ui.TooltipTest)
  setUp(org.apache.struts2.views.jsp.ui.UpDownSelectTagTest)
  setUp(org.apache.struts2.views.jsp.ElseTagTest)
  setUp(org.apache.struts2.views.jsp.ui.TextareaTest)
  setUp(org.apache.struts2.views.jsp.ui.FieldErrorTagTest)
  setUp(org.apache.struts2.views.jsp.ui.DoubleSelectTest)
  setUp(org.apache.struts2.views.jsp.ui.TextfieldTest)
  setUp(org.apache.struts2.dispatcher.PlainTextResultTest)
  setUp(org.apache.struts2.dispatcher.mapper.Restful2ActionMapperTest)
  setUp(org.apache.struts2.views.jsp.ui.HiddenTest)
  setUp(org.apache.struts2.views.jsp.AppendIteratorTagTest)
  setUp(org.apache.struts2.views.jsp.BeanTagTest)
  setUp(org.apache.struts2.views.jsp.ElseIfTagTest)
  setUp(org.apache.struts2.views.jsp.ActionTagTest)
  setUp(org.apache.struts2.components.PropertyTest)
  setUp(org.apache.struts2.views.jsp.ui.FormTagTest)
  tearDown(org.apache.struts2.views.jsp.ui.FormTagTest)
  setUp(org.apache.struts2.views.jsp.ui.ResetTest)
  setUp(org.apache.struts2.views.xslt.XSLTResultTest)
  setUp(org.apache.struts2.views.jsp.ui.ComponentTest)
  setUp(org.apache.struts2.views.jsp.ui.PasswordTest)
  setUp(org.apache.struts2.dispatcher.StreamResultTest)
  setUp(org.apache.struts2.views.jsp.ui.LabelTest)
  setUp(org.apache.struts2.views.jsp.ui.ActionErrorTagTest)
  setUp(org.apache.struts2.views.jsp.SetTagTest)
  tearDown(org.apache.struts2.views.jsp.SetTagTest)
  setUp(org.apache.struts2.views.jsp.URLTagTest)
  tearDown(org.apache.struts2.views.jsp.URLTagTest)
  setUp(org.apache.struts2.interceptor.StrutsConversionErrorInterceptorTest)
  setUp(org.apache.struts2.util.InvocationSessionStoreTest)
  setUp(org.apache.struts2.views.util.UrlHelperTest)
  setUp(org.apache.struts2.views.jsp.MergeIteratorTagTest)
  setUp(org.apache.struts2.dispatcher.ServletRedirectResultTest)
  setUp(org.apache.struts2.views.jsp.IncludeTagTest)
  setUp(org.apache.struts2.views.jsp.ui.ComboBoxTest)
  setUp(org.apache.struts2.interceptor.CheckboxInterceptorTest)
  setUp(org.apache.struts2.interceptor.TokenSessionStoreInterceptorTest)
  setUp(org.apache.struts2.views.jsp.ui.InputTransferSelectTagTest)
  setUp(org.apache.struts2.views.jsp.I18nTagTest)
  setUp(org.apache.struts2.components.UIBeanTest)
  setUp(org.apache.struts2.interceptor.ClearSessionInterceptorTest)
  setUp(org.apache.struts2.views.jsp.SubsetIteratorTagTest)
  setUp(org.apache.struts2.components.UIComponentTest)
  setUp(org.apache.struts2.dispatcher.ServletDispatcherResultTest)
  setUp(org.apache.struts2.views.freemarker.tags.TagModelTest)
  setUp(org.apache.struts2.views.jsp.AnchorTagTest)
  tearDown(org.apache.struts2.views.jsp.AnchorTagTest)
  setUp(org.apache.struts2.views.jsp.ui.HeadTagTest)
  setUp(org.apache.struts2.views.jsp.ui.CheckboxListTest)
  setUp(org.apache.struts2.interceptor.CreateSessionInterceptorTest)
  setUp(org.apache.struts2.components.ComponentTest)
  setUp(org.apache.struts2.views.freemarker.FreemarkerTest)
  setUp(org.apache.struts2.interceptor.TokenInterceptorTest)
  setUp(org.apache.struts2.views.jsp.ui.SubmitTest)
  setUp(org.apache.struts2.dispatcher.mapper.DefaultActionMapperTest)

Tests run: 1940, Failures: 113, Errors: 0, Skipped: 1763

generally accepted rules:
new feature requires regression test (prove that your new feature/patch does not breaking
existing functionality)
new unit test created (use the above surefire tests as a template)
integration test must pass (especially for core components such as dispatcher, change of mapping
and Filters)

not  ready for commercial deployment OR GA status



-- 
This message is automatically generated by JIRA.
-
You can reply to this email to add a comment to the issue online.


Mime
View raw message