subversion-notifications mailing list archives

Site index · List index
Message view « Date » · « Thread »
Top « Date » · « Thread »
From Apache Hudson Server <hud...@hudson.zones.apache.org>
Subject Build failed in Hudson: subversion-trunk-solaris #139
Date Mon, 04 Jan 2010 20:10:48 GMT
See <http://hudson.zones.apache.org/hudson/job/subversion-trunk-solaris/139/changes>

Changes:

[stsp] In svn patch, make sure every hunk is either applied or rejected.
Previously, hunks matching very late could cause subsequent hunks
to be ignored silently, because matching hunks and writing the patched
result was done in a single pass. This is now done in two separate passes.

Also simplify the code a bit, both by small refactorings and by using
the new stream seek API.

* subversion/libsvn_client/patch.c
  (hunk_info_t): New type. Associates a hunk with the number of the
   line where the hunk matches.
  (patch_target_t): Add LINES, MATCHED_HUNKS, and POOL fields.
  (init_patch_target): Initialise above mentioned new fields.
  (read_line, seek_to_line): New functions.
  (match_hunk, copy_lines_to_target): Use above new helpers rather
   than svn_stream_readline() and svn_io_file_seek().
  (scan_for_match): Remove the MATCHED output parameter, it is redundant
   since MATCHED_LINE can encode the same information. Put matched hunks
   into TARGET->MATCHED_HUNKS. Do not allow hunks to match at overlapping
   line ranges. Use read_line() helper rather than svn_stream_readline().
  (determine_hunk_line): Rename to ...
  (get_hunk_info): ... this, and make it return a hunk_info_t object
   rather than a line number. Scan the entire file for possible matches
   if a hunk does not match at the desired offset. Previously, only
   lines not written to the patched result yet were scanned. Prefer early
   matches over later ones because this happens to be more efficient and
   duplicate matches are ambiguous anyway. Use seek_to_line() helper rather
   than svn_io_file_seek().
  (skip_lines_from_target): Remove, superseeded by seeking.
  (apply_one_hunk): Stop matching hunks here, just apply them by copying
   them to the patched result. Acccept a hunk_info_t rather than a hunk,
   and track parameter changes copy_lines_to_target(), reject_hunk(), and
   copy_hunk_text(). 
  (apply_one_patch): Do hunk matching and application in two separate steps.

------------------------------------------
[...truncated 4734 lines...]
subversion/tests/libsvn_subr/translate-test.c:1309: warning: (near initialization for `test_funcs[16].wip')
subversion/tests/libsvn_subr/translate-test.c:1311: warning: missing initializer
subversion/tests/libsvn_subr/translate-test.c:1311: warning: (near initialization for `test_funcs[17].wip')
subversion/tests/libsvn_subr/translate-test.c:1313: warning: missing initializer
subversion/tests/libsvn_subr/translate-test.c:1313: warning: (near initialization for `test_funcs[18].wip')
subversion/tests/libsvn_subr/translate-test.c:1315: warning: missing initializer
subversion/tests/libsvn_subr/translate-test.c:1315: warning: (near initialization for `test_funcs[19].wip')
subversion/tests/libsvn_subr/translate-test.c:1317: warning: missing initializer
subversion/tests/libsvn_subr/translate-test.c:1317: warning: (near initialization for `test_funcs[20].wip')
subversion/tests/libsvn_subr/translate-test.c:1319: warning: missing initializer
subversion/tests/libsvn_subr/translate-test.c:1319: warning: (near initialization for `test_funcs[21].wip')
subversion/tests/libsvn_subr/translate-test.c:1322: warning: missing initializer
subversion/tests/libsvn_subr/translate-test.c:1322: warning: (near initialization for `test_funcs[22].wip')
subversion/tests/libsvn_subr/translate-test.c:1324: warning: missing initializer
subversion/tests/libsvn_subr/translate-test.c:1324: warning: (near initialization for `test_funcs[23].wip')
subversion/tests/libsvn_subr/translate-test.c:1326: warning: missing initializer
subversion/tests/libsvn_subr/translate-test.c:1326: warning: (near initialization for `test_funcs[24].wip')
subversion/tests/libsvn_subr/translate-test.c:1328: warning: missing initializer
subversion/tests/libsvn_subr/translate-test.c:1328: warning: (near initialization for `test_funcs[25].wip')
subversion/tests/libsvn_subr/translate-test.c:1330: warning: missing initializer
subversion/tests/libsvn_subr/translate-test.c:1330: warning: (near initialization for `test_funcs[26].wip')
subversion/tests/libsvn_subr/translate-test.c:1332: warning: missing initializer
subversion/tests/libsvn_subr/translate-test.c:1332: warning: (near initialization for `test_funcs[27].wip')
subversion/tests/libsvn_subr/translate-test.c:1335: warning: missing initializer
subversion/tests/libsvn_subr/translate-test.c:1335: warning: (near initialization for `test_funcs[28].wip')
subversion/tests/libsvn_subr/translate-test.c:1337: warning: missing initializer
subversion/tests/libsvn_subr/translate-test.c:1337: warning: (near initialization for `test_funcs[29].wip')
subversion/tests/libsvn_subr/translate-test.c:1339: warning: missing initializer
subversion/tests/libsvn_subr/translate-test.c:1339: warning: (near initialization for `test_funcs[30].wip')
subversion/tests/libsvn_subr/translate-test.c:1341: warning: missing initializer
subversion/tests/libsvn_subr/translate-test.c:1341: warning: (near initialization for `test_funcs[31].wip')
subversion/tests/libsvn_subr/translate-test.c:1343: warning: missing initializer
subversion/tests/libsvn_subr/translate-test.c:1343: warning: (near initialization for `test_funcs[32].wip')
subversion/tests/libsvn_subr/translate-test.c:1345: warning: missing initializer
subversion/tests/libsvn_subr/translate-test.c:1345: warning: (near initialization for `test_funcs[33].wip')
subversion/tests/libsvn_subr/translate-test.c:1347: warning: missing initializer
subversion/tests/libsvn_subr/translate-test.c:1347: warning: (near initialization for `test_funcs[34].wip')
subversion/tests/libsvn_subr/translate-test.c:1350: warning: missing initializer
subversion/tests/libsvn_subr/translate-test.c:1350: warning: (near initialization for `test_funcs[35].wip')
subversion/tests/libsvn_subr/translate-test.c:1352: warning: missing initializer
subversion/tests/libsvn_subr/translate-test.c:1352: warning: (near initialization for `test_funcs[36].wip')
subversion/tests/libsvn_subr/translate-test.c:1354: warning: missing initializer
subversion/tests/libsvn_subr/translate-test.c:1354: warning: (near initialization for `test_funcs[37].wip')
subversion/tests/libsvn_subr/translate-test.c:1356: warning: missing initializer
subversion/tests/libsvn_subr/translate-test.c:1356: warning: (near initialization for `test_funcs[38].wip')
subversion/tests/libsvn_subr/translate-test.c:1358: warning: missing initializer
subversion/tests/libsvn_subr/translate-test.c:1358: warning: (near initialization for `test_funcs[39].wip')
subversion/tests/libsvn_subr/translate-test.c:1360: warning: missing initializer
subversion/tests/libsvn_subr/translate-test.c:1360: warning: (near initialization for `test_funcs[40].wip')
subversion/tests/libsvn_subr/translate-test.c:1362: warning: missing initializer
subversion/tests/libsvn_subr/translate-test.c:1362: warning: (near initialization for `test_funcs[41].func2')
cd subversion/tests/libsvn_subr && /opt/sfw/bin/libtool --tag=CC --silent --mode=link
gcc -static -Wold-style-definition -Wextra-tokens -Wdeclaration-after-statement -Wpointer-arith
-Wwrite-strings -Wshadow -ansi -Wall -Wformat=2 -Wunused -Waggregate-return -Wstrict-prototypes
-Wmissing-prototypes -Wmissing-declarations -Wno-multichar -Wredundant-decls -Wnested-externs
-Wunreachable-code -Winline -Wno-long-long -g -g -Wall -Wmissing-prototypes -Wstrict-prototypes
-Wmissing-declarations  -DSVN_DEBUG -DAP_DEBUG   -rpath /usr/local/lib  -o translate-test
 translate-test.lo ../../../subversion/tests/libsvn_test-1.la ../../../subversion/libsvn_subr/libsvn_subr-1.la
-L<http://hudson.zones.apache.org/hudson/job/subversion-trunk-solaris/ws/subversion-trunk/apr-util>
-laprutil-1 -L<http://hudson.zones.apache.org/hudson/job/subversion-trunk-solaris/ws/subversion-trunk/apr>
-lapr-1 -lsocket
/opt/sfw/bin/libtool --tag=CC --silent --mode=compile gcc -DSOLARIS2=10 -D_POSIX_PTHREAD_SEMANTICS
-D_REENTRANT -D_LARGEFILE64_SOURCE  -Wold-style-definition -Wextra-tokens -Wdeclaration-after-statement
-Wpointer-arith -Wwrite-strings -Wshadow -ansi -Wall -Wformat=2 -Wunused -Waggregate-return
-Wstrict-prototypes -Wmissing-prototypes -Wmissing-declarations -Wno-multichar -Wredundant-decls
-Wnested-externs -Wunreachable-code -Winline -Wno-long-long -g -g -Wall -Wmissing-prototypes
-Wstrict-prototypes -Wmissing-declarations  -DSVN_DEBUG -DAP_DEBUG  -I./subversion/include
-I./subversion  -I<http://hudson.zones.apache.org/hudson/job/subversion-trunk-solaris/ws/subversion-trunk/apr/include>
  -I<http://hudson.zones.apache.org/hudson/job/subversion-trunk-solaris/ws/subversion-trunk/apr-util/include>
     -I<http://hudson.zones.apache.org/hudson/job/subversion-trunk-solaris/ws/subversion-trunk/sqlite-amalgamation>
-static -o subversion/tests/libsvn_wc/tree-conflict-data-test.lo -c subversion/tests/libsvn_wc/tree-conflict-data-test.c
subversion/tests/libsvn_wc/tree-conflict-data-test.c:380: warning: missing initializer
subversion/tests/libsvn_wc/tree-conflict-data-test.c:380: warning: (near initialization for
`test_funcs[0].func2')
subversion/tests/libsvn_wc/tree-conflict-data-test.c:381: warning: missing initializer
subversion/tests/libsvn_wc/tree-conflict-data-test.c:381: warning: (near initialization for
`test_funcs[1].wip')
subversion/tests/libsvn_wc/tree-conflict-data-test.c:383: warning: missing initializer
subversion/tests/libsvn_wc/tree-conflict-data-test.c:383: warning: (near initialization for
`test_funcs[2].wip')
subversion/tests/libsvn_wc/tree-conflict-data-test.c:385: warning: missing initializer
subversion/tests/libsvn_wc/tree-conflict-data-test.c:385: warning: (near initialization for
`test_funcs[3].wip')
subversion/tests/libsvn_wc/tree-conflict-data-test.c:387: warning: missing initializer
subversion/tests/libsvn_wc/tree-conflict-data-test.c:387: warning: (near initialization for
`test_funcs[4].wip')
subversion/tests/libsvn_wc/tree-conflict-data-test.c:389: warning: missing initializer
subversion/tests/libsvn_wc/tree-conflict-data-test.c:389: warning: (near initialization for
`test_funcs[5].wip')
subversion/tests/libsvn_wc/tree-conflict-data-test.c:395: warning: missing initializer
subversion/tests/libsvn_wc/tree-conflict-data-test.c:395: warning: (near initialization for
`test_funcs[6].func2')
cd subversion/tests/libsvn_wc && /opt/sfw/bin/libtool --tag=CC --silent --mode=link
gcc -static -Wold-style-definition -Wextra-tokens -Wdeclaration-after-statement -Wpointer-arith
-Wwrite-strings -Wshadow -ansi -Wall -Wformat=2 -Wunused -Waggregate-return -Wstrict-prototypes
-Wmissing-prototypes -Wmissing-declarations -Wno-multichar -Wredundant-decls -Wnested-externs
-Wunreachable-code -Winline -Wno-long-long -g -g -Wall -Wmissing-prototypes -Wstrict-prototypes
-Wmissing-declarations  -DSVN_DEBUG -DAP_DEBUG   -rpath /usr/local/lib  -o tree-conflict-data-test
 tree-conflict-data-test.lo ../../../subversion/tests/libsvn_test-1.la ../../../subversion/libsvn_wc/libsvn_wc-1.la
../../../subversion/libsvn_subr/libsvn_subr-1.la -L<http://hudson.zones.apache.org/hudson/job/subversion-trunk-solaris/ws/subversion-trunk/apr-util>
-laprutil-1 -L<http://hudson.zones.apache.org/hudson/job/subversion-trunk-solaris/ws/subversion-trunk/apr>
-lapr-1 -lsocket
/opt/sfw/bin/libtool --tag=CC --silent --mode=compile gcc -DSOLARIS2=10 -D_POSIX_PTHREAD_SEMANTICS
-D_REENTRANT -D_LARGEFILE64_SOURCE  -Wold-style-definition -Wextra-tokens -Wdeclaration-after-statement
-Wpointer-arith -Wwrite-strings -Wshadow -ansi -Wall -Wformat=2 -Wunused -Waggregate-return
-Wstrict-prototypes -Wmissing-prototypes -Wmissing-declarations -Wno-multichar -Wredundant-decls
-Wnested-externs -Wunreachable-code -Winline -Wno-long-long -g -g -Wall -Wmissing-prototypes
-Wstrict-prototypes -Wmissing-declarations  -DSVN_DEBUG -DAP_DEBUG  -I./subversion/include
-I./subversion  -I<http://hudson.zones.apache.org/hudson/job/subversion-trunk-solaris/ws/subversion-trunk/apr/include>
  -I<http://hudson.zones.apache.org/hudson/job/subversion-trunk-solaris/ws/subversion-trunk/apr-util/include>
     -I<http://hudson.zones.apache.org/hudson/job/subversion-trunk-solaris/ws/subversion-trunk/sqlite-amalgamation>
-static -o subversion/tests/libsvn_subr/utf-test.lo -c subversion/tests/libsvn_subr/utf-test.c
subversion/tests/libsvn_subr/utf-test.c: In function `utf_validate':
subversion/tests/libsvn_subr/utf-test.c:150: warning: missing initializer
subversion/tests/libsvn_subr/utf-test.c:150: warning: (near initialization for `tests[67].string')
subversion/tests/libsvn_subr/utf-test.c: At top level:
subversion/tests/libsvn_subr/utf-test.c:62: warning: unused parameter 'pool'
subversion/tests/libsvn_subr/utf-test.c:180: warning: unused parameter 'pool'
subversion/tests/libsvn_subr/utf-test.c:302: warning: missing initializer
subversion/tests/libsvn_subr/utf-test.c:302: warning: (near initialization for `test_funcs[0].func2')
subversion/tests/libsvn_subr/utf-test.c:303: warning: missing initializer
subversion/tests/libsvn_subr/utf-test.c:303: warning: (near initialization for `test_funcs[1].wip')
subversion/tests/libsvn_subr/utf-test.c:305: warning: missing initializer
subversion/tests/libsvn_subr/utf-test.c:305: warning: (near initialization for `test_funcs[2].wip')
subversion/tests/libsvn_subr/utf-test.c:307: warning: missing initializer
subversion/tests/libsvn_subr/utf-test.c:307: warning: (near initialization for `test_funcs[3].wip')
subversion/tests/libsvn_subr/utf-test.c:309: warning: missing initializer
subversion/tests/libsvn_subr/utf-test.c:309: warning: (near initialization for `test_funcs[4].wip')
subversion/tests/libsvn_subr/utf-test.c:311: warning: missing initializer
subversion/tests/libsvn_subr/utf-test.c:311: warning: (near initialization for `test_funcs[5].func2')
cd subversion/tests/libsvn_subr && /opt/sfw/bin/libtool --tag=CC --silent --mode=link
gcc -static -Wold-style-definition -Wextra-tokens -Wdeclaration-after-statement -Wpointer-arith
-Wwrite-strings -Wshadow -ansi -Wall -Wformat=2 -Wunused -Waggregate-return -Wstrict-prototypes
-Wmissing-prototypes -Wmissing-declarations -Wno-multichar -Wredundant-decls -Wnested-externs
-Wunreachable-code -Winline -Wno-long-long -g -g -Wall -Wmissing-prototypes -Wstrict-prototypes
-Wmissing-declarations  -DSVN_DEBUG -DAP_DEBUG   -rpath /usr/local/lib  -o utf-test  utf-test.lo
../../../subversion/tests/libsvn_test-1.la ../../../subversion/libsvn_subr/libsvn_subr-1.la
-L<http://hudson.zones.apache.org/hudson/job/subversion-trunk-solaris/ws/subversion-trunk/apr-util>
-laprutil-1 -L<http://hudson.zones.apache.org/hudson/job/subversion-trunk-solaris/ws/subversion-trunk/apr>
-lapr-1 -lsocket
/opt/sfw/bin/libtool --tag=CC --silent --mode=compile gcc -DSOLARIS2=10 -D_POSIX_PTHREAD_SEMANTICS
-D_REENTRANT -D_LARGEFILE64_SOURCE  -Wold-style-definition -Wextra-tokens -Wdeclaration-after-statement
-Wpointer-arith -Wwrite-strings -Wshadow -ansi -Wall -Wformat=2 -Wunused -Waggregate-return
-Wstrict-prototypes -Wmissing-prototypes -Wmissing-declarations -Wno-multichar -Wredundant-decls
-Wnested-externs -Wunreachable-code -Winline -Wno-long-long -g -g -Wall -Wmissing-prototypes
-Wstrict-prototypes -Wmissing-declarations  -DSVN_DEBUG -DAP_DEBUG  -I./subversion/include
-I./subversion  -I<http://hudson.zones.apache.org/hudson/job/subversion-trunk-solaris/ws/subversion-trunk/apr/include>
  -I<http://hudson.zones.apache.org/hudson/job/subversion-trunk-solaris/ws/subversion-trunk/apr-util/include>
     -I<http://hudson.zones.apache.org/hudson/job/subversion-trunk-solaris/ws/subversion-trunk/sqlite-amalgamation>
-static -o subversion/tests/libsvn_delta/vdelta-test.lo -c subversion/tests/libsvn_delta/vdelta-test.c
cd subversion/tests/libsvn_delta && /opt/sfw/bin/libtool --tag=CC --silent --mode=link
gcc -static -Wold-style-definition -Wextra-tokens -Wdeclaration-after-statement -Wpointer-arith
-Wwrite-strings -Wshadow -ansi -Wall -Wformat=2 -Wunused -Waggregate-return -Wstrict-prototypes
-Wmissing-prototypes -Wmissing-declarations -Wno-multichar -Wredundant-decls -Wnested-externs
-Wunreachable-code -Winline -Wno-long-long -g -g -Wall -Wmissing-prototypes -Wstrict-prototypes
-Wmissing-declarations  -DSVN_DEBUG -DAP_DEBUG   -rpath /usr/local/lib  -o vdelta-test  vdelta-test.lo
../../../subversion/libsvn_delta/libsvn_delta-1.la ../../../subversion/libsvn_subr/libsvn_subr-1.la
-L<http://hudson.zones.apache.org/hudson/job/subversion-trunk-solaris/ws/subversion-trunk/apr-util>
-laprutil-1 -L<http://hudson.zones.apache.org/hudson/job/subversion-trunk-solaris/ws/subversion-trunk/apr>
-lapr-1 -lsocket
/opt/sfw/bin/libtool --tag=CC --silent --mode=compile gcc -DSOLARIS2=10 -D_POSIX_PTHREAD_SEMANTICS
-D_REENTRANT -D_LARGEFILE64_SOURCE  -Wold-style-definition -Wextra-tokens -Wdeclaration-after-statement
-Wpointer-arith -Wwrite-strings -Wshadow -ansi -Wall -Wformat=2 -Wunused -Waggregate-return
-Wstrict-prototypes -Wmissing-prototypes -Wmissing-declarations -Wno-multichar -Wredundant-decls
-Wnested-externs -Wunreachable-code -Winline -Wno-long-long -g -g -Wall -Wmissing-prototypes
-Wstrict-prototypes -Wmissing-declarations  -DSVN_DEBUG -DAP_DEBUG  -I./subversion/include
-I./subversion  -I<http://hudson.zones.apache.org/hudson/job/subversion-trunk-solaris/ws/subversion-trunk/apr/include>
  -I<http://hudson.zones.apache.org/hudson/job/subversion-trunk-solaris/ws/subversion-trunk/apr-util/include>
     -I<http://hudson.zones.apache.org/hudson/job/subversion-trunk-solaris/ws/subversion-trunk/sqlite-amalgamation>
-static -o subversion/tests/libsvn_delta/window-test.lo -c subversion/tests/libsvn_delta/window-test.c
subversion/tests/libsvn_delta/window-test.c:104: warning: missing initializer
subversion/tests/libsvn_delta/window-test.c:104: warning: (near initialization for `test_funcs[0].func2')
subversion/tests/libsvn_delta/window-test.c:105: warning: missing initializer
subversion/tests/libsvn_delta/window-test.c:105: warning: (near initialization for `test_funcs[1].wip')
subversion/tests/libsvn_delta/window-test.c:107: warning: missing initializer
subversion/tests/libsvn_delta/window-test.c:107: warning: (near initialization for `test_funcs[2].func2')
cd subversion/tests/libsvn_delta && /opt/sfw/bin/libtool --tag=CC --silent --mode=link
gcc -static -Wold-style-definition -Wextra-tokens -Wdeclaration-after-statement -Wpointer-arith
-Wwrite-strings -Wshadow -ansi -Wall -Wformat=2 -Wunused -Waggregate-return -Wstrict-prototypes
-Wmissing-prototypes -Wmissing-declarations -Wno-multichar -Wredundant-decls -Wnested-externs
-Wunreachable-code -Winline -Wno-long-long -g -g -Wall -Wmissing-prototypes -Wstrict-prototypes
-Wmissing-declarations  -DSVN_DEBUG -DAP_DEBUG   -rpath /usr/local/lib  -o window-test  window-test.lo
../../../subversion/tests/libsvn_test-1.la ../../../subversion/libsvn_delta/libsvn_delta-1.la
../../../subversion/libsvn_subr/libsvn_subr-1.la -L<http://hudson.zones.apache.org/hudson/job/subversion-trunk-solaris/ws/subversion-trunk/apr-util>
-laprutil-1 -L<http://hudson.zones.apache.org/hudson/job/subversion-trunk-solaris/ws/subversion-trunk/apr>
-lapr-1 -lsocket
/usr/bin/msgfmt  -o subversion/po/de.mo subversion/po/de.po
/usr/bin/msgfmt  -o subversion/po/es.mo subversion/po/es.po
/usr/bin/msgfmt  -o subversion/po/fr.mo subversion/po/fr.po
/usr/bin/msgfmt  -o subversion/po/it.mo subversion/po/it.po
/usr/bin/msgfmt  -o subversion/po/ja.mo subversion/po/ja.po
/usr/bin/msgfmt  -o subversion/po/ko.mo subversion/po/ko.po
/usr/bin/msgfmt  -o subversion/po/nb.mo subversion/po/nb.po
/usr/bin/msgfmt  -o subversion/po/pl.mo subversion/po/pl.po
/usr/bin/msgfmt  -o subversion/po/pt_BR.mo subversion/po/pt_BR.po
/usr/bin/msgfmt  -o subversion/po/sv.mo subversion/po/sv.po
/usr/bin/msgfmt  -o subversion/po/zh_CN.mo subversion/po/zh_CN.po
/usr/bin/msgfmt  -o subversion/po/zh_TW.mo subversion/po/zh_TW.po
Running all tests in auth-test [1/74]...................success
Running all tests in cache-test [2/74]..................success
Running all tests in checksum-test [3/74]...............success
Running all tests in client-test [4/74].................success
Running all tests in compat-test [5/74].................success
Running all tests in config-test [6/74].................success
Running all tests in db-test [7/74].....................success
Running all tests in diff-diff3-test [8/74].............success
Running all tests in dirent_uri-test [9/74].............success
Running all tests in eol-test [10/74]...................success
Running all tests in error-test [11/74].................success
Running all tests in fs-pack-test [12/74]...............success
Running all tests in fs-test [13/74]....................success
Running all tests in hashdump-test [14/74]..............success
Running all tests in locks-test [15/74].................success
Running all tests in mergeinfo-test [16/74].............success
Running all tests in opt-test [17/74]...................success
Running all tests in parse-diff-test [18/74]............success
Running all tests in path-test [19/74]..................success
Running all tests in ra-local-test [20/74]..............success
Running all tests in random-test [21/74]................success
Running all tests in repos-test [22/74].................success
Running all tests in revision-test [23/74]..............success
Running all tests in skel-test [24/74]..................success
Running all tests in stream-test [25/74]................success
Running all tests in string-test [26/74]................success
Running all tests in target-test [27/74]................success
Running all tests in time-test [28/74]..................success
Running all tests in translate-test [29/74].............success
Running all tests in tree-conflict-data-test [30/74]....success
Running all tests in utf-test [31/74]...................FAILURE
Running all tests in window-test [32/74]................success
Running all tests in authz_tests.py [33/74].............success
Running all tests in autoprop_tests.py [34/74]..........success
Running all tests in basic_tests.py [35/74].............success
Running all tests in blame_tests.py [36/74].............success
Running all tests in cat_tests.py [37/74]...............success
Running all tests in changelist_tests.py [38/74]........success
Running all tests in checkout_tests.py [39/74]..........success
Running all tests in commit_tests.py [40/74]............success
Running all tests in copy_tests.py [41/74]..............success
Running all tests in depth_tests.py [42/74].............success
Running all tests in diff_tests.py [43/74]..............success
Running all tests in entries_tests.py [44/74]...........success
Running all tests in export_tests.py [45/74]............success
Running all tests in externals_tests.py [46/74].........success
Running all tests in getopt_tests.py [47/74]............success
Running all tests in history_tests.py [48/74]...........success
Running all tests in import_tests.py [49/74]............success
Running all tests in info_tests.py [50/74]..............success
Running all tests in lock_tests.py [51/74]..............success
Running all tests in log_tests.py [52/74]...............success
Running all tests in merge_authz_tests.py [53/74].......success
Running all tests in merge_tests.py [54/74].............success
Running all tests in mergeinfo_tests.py [55/74].........success
Running all tests in obliterate_tests.py [56/74]........success
Running all tests in patch_tests.py [57/74].............success
Running all tests in prop_tests.py [58/74]..............success
Running all tests in resolved_tests.py [59/74]..........success
Running all tests in revert_tests.py [60/74]............success
Running all tests in schedule_tests.py [61/74]..........success
Running all tests in special_tests.py [62/74]...........success
Running all tests in stat_tests.py [63/74]..............success
Running all tests in svnadmin_tests.py [64/74]..........success
Running all tests in svndumpfilter_tests.py [65/74].....success
Running all tests in svnlook_tests.py [66/74]...........success
Running all tests in svnsync_tests.py [67/74]...........success
Running all tests in svnversion_tests.py [68/74]........success
Running all tests in switch_tests.py [69/74]............success
Running all tests in trans_tests.py [70/74].............success
Running all tests in tree_conflict_tests.py [71/74].....success
Running all tests in update_tests.py [72/74]............success
Running all tests in upgrade_tests.py [73/74]...........success
Running all tests in utf8_tests.py [74/74]..............success
At least one test was SKIPPED, checking <http://hudson.zones.apache.org/hudson/job/subversion-trunk-solaris/ws/subversion-trunk/tests.log>
SKIP:  cache-test 2: basic memcache svn_cache test
SKIP:  cache-test 3: memcache svn_cache with very long keys
At least one test XFAILED, checking <http://hudson.zones.apache.org/hudson/job/subversion-trunk-solaris/ws/subversion-trunk/tests.log>
XFAIL: fs-test 18: merging commit
       [[needs to be written to match new merge() algorithm expectations]]
XFAIL: fs-test 36: obliterate 1
       [[obliterate is in development]]
XFAIL: locks-test 9: able to reserve a name (lock non-existent path)
XFAIL: locks-test 10: directory locks (kinda)
XFAIL: tree-conflict-data-test 3: detect broken tree conflict data
At least one test FAILED, checking <http://hudson.zones.apache.org/hudson/job/subversion-trunk-solaris/ws/subversion-trunk/tests.log>
FAIL:  utf-test 3: test svn_utf_cstring_to_utf8_ex2
FAIL:  utf-test 4: test svn_utf_cstring_from_utf8_ex2
Summary of test results:
  283 tests PASSED
  2 tests SKIPPED
  5 tests XFAILED (2 WORK-IN-PROGRESS)
  2 tests FAILED
*** Error code 1
The following command caused the error:
if test "/usr/bin/python" != "none"; then                                 \
  flags="--verbose";                                                 \
  if test "" != ""; then                                   \
    flags="--cleanup $flags";                                       \
  fi;                                                                \
  if test "" != ""; then                                  \
    flags="--url  $flags";                               \
  fi;                                                                \
  if test "" != ""; then                                   \
    flags="--fs-type  $flags";                            \
  fi;                                                                \
  if test "" != ""; then                              \
    flags="--http-library  $flags";                  \
  fi;                                                                \
  if test "" != ""; then                      \
    flags="--server-minor-version  $flags";  \
  fi;                                                                \
  if test "" != ""; then                               \
    flags="--enable-sasl $flags";                                   \
  fi;                                                                \
  if test "" != ""; then                             \
    flags="--fsfs-sharding  $flags";                \
  fi;                                                                \
  if test "" != ""; then                              \
    flags="--fsfs-packing $flags";                                  \
  fi;                                                                \
  if test "" != ""; then                                  \
    flags="--parallel $flags";                                      \
  fi;                                                                \
  if test "" != ""; then                             \
    flags="--log-to-stdout $flags";                                 \
  fi;                                                                \
  /usr/bin/python ./build/run_tests.py                         \
            --config-file ./subversion/tests/tests.conf  \
            $flags                                                  \
            '<http://hudson.zones.apache.org/hudson/job/subversion-trunk-solaris/ws/subversion-trunk'>
'<http://hudson.zones.apache.org/hudson/job/subversion-trunk-solaris/ws/subversion-trunk'>
subversion/tests/libsvn_subr/auth-test subversion/tests/libsvn_subr/cache-test subversion/tests/libsvn_subr/checksum-test
subversion/tests/libsvn_client/client-test subversion/tests/libsvn_subr/compat-test subversion/tests/libsvn_subr/config-test
subversion/tests/libsvn_wc/db-test subversion/tests/libsvn_diff/diff-diff3-test subversion/tests/libsvn_subr/dirent_uri-test
subversion/tests/libsvn_subr/eol-test subversion/tests/libsvn_subr/error-test subversion/tests/libsvn_fs_fs/fs-pack-test
subversion/tests/libsvn_fs/fs-test subversion/tests/libsvn_subr/hashdump-test subversion/tests/libsvn_fs/locks-test
subversion/tests/libsvn_subr/mergeinfo-test subversion/tests/libsvn_subr/opt-test subversion/tests/libsvn_diff/parse-diff-test
subversion/tests/libsvn_subr/path-test subversion/tests/libsvn_ra_local/ra-local-test subversion/tests/libsvn_delta/random-test
subversion/tests/libsvn_repos/repos-test subversion/tests/libsvn_subr/revision-test subversion/tests/libsvn_subr/skel-test
subversion/tests/libsvn_subr/stream-test subversion/tests/libsvn_subr/string-test subversion/tests/libsvn_subr/target-test
subversion/tests/libsvn_subr/time-test subversion/tests/libsvn_subr/translate-test subversion/tests/libsvn_wc/tree-conflict-data-test
subversion/tests/libsvn_subr/utf-test subversion/tests/libsvn_delta/window-test subversion/tests/cmdline/authz_tests.py
subversion/tests/cmdline/autoprop_tests.py subversion/tests/cmdline/basic_tests.py subversion/tests/cmdline/blame_tests.py
subversion/tests/cmdline/cat_tests.py subversion/tests/cmdline/changelist_tests.py subversion/tests/cmdline/checkout_tests.py
subversion/tests/cmdline/commit_tests.py subversion/tests/cmdline/copy_tests.py subversion/tests/cmdline/depth_tests.py
subversion/tests/cmdline/diff_tests.py subversion/tests/cmdline/entries_tests.py subversion/tests/cmdline/export_tests.py
subversion/tests/cmdline/externals_tests.py subversion/tests/cmdline/getopt_tests.py subversion/tests/cmdline/history_tests.py
subversion/tests/cmdline/import_tests.py subversion/tests/cmdline/info_tests.py subversion/tests/cmdline/lock_tests.py
subversion/tests/cmdline/log_tests.py subversion/tests/cmdline/merge_authz_tests.py subversion/tests/cmdline/merge_tests.py
subversion/tests/cmdline/mergeinfo_tests.py subversion/tests/cmdline/obliterate_tests.py subversion/tests/cmdline/patch_tests.py
subversion/tests/cmdline/prop_tests.py subversion/tests/cmdline/resolved_tests.py subversion/tests/cmdline/revert_tests.py
subversion/tests/cmdline/schedule_tests.py subversion/tests/cmdline/special_tests.py subversion/tests/cmdline/stat_tests.py
subversion/tests/cmdline/svnadmin_tests.py subversion/tests/cmdline/svndumpfilter_tests.py
subversion/tests/cmdline/svnlook_tests.py subversion/tests/cmdline/svnsync_tests.py subversion/tests/cmdline/svnversion_tests.py
subversion/tests/cmdline/switch_tests.py subversion/tests/cmdline/trans_tests.py subversion/tests/cmdline/tree_conflict_tests.py
subversion/tests/cmdline/update_tests.py subversion/tests/cmdline/upgrade_tests.py subversion/tests/cmdline/utf8_tests.py;
             \
else                                                                 \
  echo "make check: Python 2.4 or greater is required,";             \
  echo "            but was not detected during configure";          \
  exit 1;                                                            \
fi;
make: Fatal error: Command failed for target `check'
Generating junit files ...
Recording test results


Mime
View raw message