subversion-notifications mailing list archives

Site index · List index
Message view « Date » · « Thread »
Top « Date » · « Thread »
From Apache Hudson Server <hud...@hudson.zones.apache.org>
Subject Build failed in Hudson: subversion-trunk-ubuntu #263
Date Tue, 26 Jan 2010 19:48:32 GMT
See <http://hudson.zones.apache.org/hudson/job/subversion-trunk-ubuntu/263/changes>

Changes:

[stsp] Follow-up to r903342:

* subversion/libsvn_diff/parse-diff.c
  (parse_offset): Clearing errno is necessary with apr_atoi64() from
   APR-0.9, which does not always set errno itself. Engrave this
   information in a comment so we don't forget.

r903342 put in doubt by: blair

[hwright] * tools/dist/dist.sh:
  Shuffle the Python detection snippet to a point where we can find the
  Python detection script.

[stsp] [ Note from the future: This commit was effectively reverted in r903359 ]

* subversion/libsvn_diff/parse-diff.c
  (parse_offset): Clearing errno is usually not necessary,
   with the exception of strtol() and friends, so don't.

[hwright] When creating the various distribution tarballs, pre-transform the sql-derived
header files before rolling the tarballs.  This removes a python dependency for
those using the distribution tarballs, and also eliminates a platform-
independent part of the build process.

(This was discussed in this thread on users@:
 http://svn.haxx.se/users/archive-2010-01/0455.shtml

 While the ultimate solution wasn't related to this change, it did point out
 this fact.)

* tools/dist/dist.sh:
  Add a search for python, and use that python to pre-transform the sql-derived
  header files.

[julianfoad] Make "obliterate" call the pre-obliterate hook.

* subversion/libsvn_ra_local/ra_plugin.c
  (get_username): Expand the doc string.
  (svn_ra_local__obliterate_path_rev): Get the username and pass it on.

* subversion/include/private/svn_repos_private.h,
  subversion/libsvn_repos/obliterate.c
  (svn_repos__obliterate_path_rev): Add a "username" parameter. Call the
    pre-obliterate hook.

* subversion/tests/cmdline/obliterate_tests.py
  (hook_enable): New function.
  (obliterate_1): Call hook_enable().
  (pre_obliterate_hook): New test function.
  (supports_obliteration): New function.
  (test_list): Add the new tests. For the SkipUnless condition, use
    'supports_obliteration' instead of a lambda.

[stsp] * subversion/svn/notify.c
  (notify): Since we're faking sign extension anyway when printing "negative"
   line offsets for hunks which matched early, we might as well use the entire
   64bit range and use unsigned all the way. Anyone got a file with
   18446744073709551616 lines?

[stsp] * subversion/svn/notify.c
  (notify): Mark svn patch output for translation.

Suggested by: danielsh

[stsp] Fix regressions in svn patch's handling of rejected hunks and
of notifications. Also add a regression test for hunk rejection.

* subversion/libsvn_client/patch.c
  (apply_one_patch): Really push all hunks onto TARGET->HUNKS,
   even if they will be rejected. Also, don't create reject
   files during a dry run.

* subversion/svn/notify.c
  (notify): Show the same status letters for svn_wc_notify_patch
   as we do for svn_wc_notify_update_update, not just 'U'.
   Also, count text conflicts again.

* subversion/tests/cmdline/patch_tests.py
  (patch_unidiff_reject): New test.
  (test_list): Add new test.

[stsp] Make svn patch a little less verbose again.

* subversion/svn/notify.c
  (notify): When notifying about hunks, print information about
   a hunk only if there was a problem with the hunk. Currently this
   either means the hunk had to be applied with an offset, or the
   hunk was rejected.

* subversion/tests/cmdline/patch_tests.py
  (patch_unidiff, patch_unidiff_absolute_paths, patch_chopped_leading_spaces,
   patch_unidiff_strip1): Adjust expected output.

Suggested by: danielsh

[stsp] Make svn patch provide notifications about individual hunks.
Make the CLI client print them.

* subversion/include/svn_wc.h
  (svn_wc_notify_action_t): New actions svn_wc_notify_patch_applied_hunk
   and svn_wc_notify_patch_rejected_hunk.
  (svn_wc_notify_t): New fields hunk_original_start, hunk_original_length,
   hunk_modified_start, hunk_modified_length, and hunk_matched_line.

* subversion/libsvn_client/patch.c
  (hunk_info_t): New field REJECTED.
  (patch_target_t): Rename MATCHED_HUNKS to just HUNKS.
  (init_patch_target): Track renamed field.
  (get_hunk_info): Initialise new field in hunk_info_t.
  (reject_hunk): Accept a hunk_info_t instead of a plain hunk,
   and mark it rejected. Add docstring.
  (apply_one_hunk): Swap TARGET and HI parameters for consistency.
   Pass HI to reject_hunk().
  (maybe_send_patch_notification): Send notifications for all hunks
   if the target was patched (or we attempted to patch it).
  (apply_one_patch): Pass a hunk info to reject_hunk. Track renamed
   field in patch_target_t. Put all hunks into TARGET->HUNKS, not
   just the ones we could match. The ones we could not match are
   marked rejected, don't apply those.

* subversion/svn/notify.c
  (notify): Print hunk-level notifications.

* subversion/tests/cmdline/patch_tests.py
  (patch_unidiff, patch_unidiff_absolute_paths, patch_unidiff_offset,
   patch_chopped_leading_spaces, patch_unidiff_strip1): Adjust expected output.

------------------------------------------
[...truncated 1992 lines...]
cd subversion/tests/libsvn_fs && <http://hudson.zones.apache.org/hudson/job/subversion-trunk-ubuntu/ws/subversion-trunk/apr/libtool> --tag=CC --silent --mode=link gcc -static  -Wold-style-definition -Wdeclaration-after-statement -Wpointer-arith -Wwrite-strings -Wshadow -ansi -Wall -Wformat=2 -Wunused -Waggregate-return -Wstrict-prototypes -Wmissing-prototypes -Wmissing-declarations -Wno-multichar -Wredundant-decls -Wnested-externs -Wunreachable-code -Winline -Wno-long-long -g -g -Wall -Wmissing-prototypes -Wstrict-prototypes -Wmissing-declarations -pthread -Werror=implicit-function-declaration  -DSVN_DEBUG -DAP_DEBUG   -rpath /usr/local/lib  -o locks-test  locks-test.lo ../../../subversion/tests/libsvn_test-1.la ../../../subversion/libsvn_fs/libsvn_fs-1.la ../../../subversion/libsvn_delta/libsvn_delta-1.la ../../../subversion/libsvn_subr/libsvn_subr-1.la -L<http://hudson.zones.apache.org/hudson/job/subversion-trunk-ubuntu/ws/subversion-trunk/apr-util> -laprutil-1 -L<http://hudson.zones.apache.org/hudson/job/subversion-trunk-ubuntu/ws/subversion-trunk/apr> -lapr-1 
<http://hudson.zones.apache.org/hudson/job/subversion-trunk-ubuntu/ws/subversion-trunk/apr/libtool> --tag=CC --silent --mode=compile gcc -DLINUX=2 -D_REENTRANT -D_GNU_SOURCE  -Wold-style-definition -Wdeclaration-after-statement -Wpointer-arith -Wwrite-strings -Wshadow -ansi -Wall -Wformat=2 -Wunused -Waggregate-return -Wstrict-prototypes -Wmissing-prototypes -Wmissing-declarations -Wno-multichar -Wredundant-decls -Wnested-externs -Wunreachable-code -Winline -Wno-long-long -g -g -Wall -Wmissing-prototypes -Wstrict-prototypes -Wmissing-declarations -pthread -Werror=implicit-function-declaration  -DSVN_DEBUG -DAP_DEBUG  -I./subversion/include -I./subversion -I<http://hudson.zones.apache.org/hudson/job/subversion-trunk-ubuntu/ws/subversion-trunk/apr/include>   -I<http://hudson.zones.apache.org/hudson/job/subversion-trunk-ubuntu/ws/subversion-trunk/apr-util/include> -I<http://hudson.zones.apache.org/hudson/job/subversion-trunk-ubuntu/ws/subversion-trunk/sqlite-amalgamation>  -static  -o subversion/tests/libsvn_subr/mergeinfo-test.lo -c subversion/tests/libsvn_subr/mergeinfo-test.c
subversion/tests/libsvn_subr/mergeinfo-test.c: In function ?test_mergeinfo_intersect?:
subversion/tests/libsvn_subr/mergeinfo-test.c:510: warning: ?svn_mergeinfo_intersect? is deprecated (declared at ./subversion/include/svn_mergeinfo.h:303)
subversion/tests/libsvn_subr/mergeinfo-test.c: In function ?test_remove_mergeinfo?:
subversion/tests/libsvn_subr/mergeinfo-test.c:1046: warning: ?svn_mergeinfo_remove? is deprecated (declared at ./subversion/include/svn_mergeinfo.h:219)
cd subversion/tests/libsvn_subr && <http://hudson.zones.apache.org/hudson/job/subversion-trunk-ubuntu/ws/subversion-trunk/apr/libtool> --tag=CC --silent --mode=link gcc -static  -Wold-style-definition -Wdeclaration-after-statement -Wpointer-arith -Wwrite-strings -Wshadow -ansi -Wall -Wformat=2 -Wunused -Waggregate-return -Wstrict-prototypes -Wmissing-prototypes -Wmissing-declarations -Wno-multichar -Wredundant-decls -Wnested-externs -Wunreachable-code -Winline -Wno-long-long -g -g -Wall -Wmissing-prototypes -Wstrict-prototypes -Wmissing-declarations -pthread -Werror=implicit-function-declaration  -DSVN_DEBUG -DAP_DEBUG   -rpath /usr/local/lib  -o mergeinfo-test  mergeinfo-test.lo ../../../subversion/tests/libsvn_test-1.la ../../../subversion/libsvn_subr/libsvn_subr-1.la -L<http://hudson.zones.apache.org/hudson/job/subversion-trunk-ubuntu/ws/subversion-trunk/apr> -lapr-1 
<http://hudson.zones.apache.org/hudson/job/subversion-trunk-ubuntu/ws/subversion-trunk/apr/libtool> --tag=CC --silent --mode=compile gcc -DLINUX=2 -D_REENTRANT -D_GNU_SOURCE  -Wold-style-definition -Wdeclaration-after-statement -Wpointer-arith -Wwrite-strings -Wshadow -ansi -Wall -Wformat=2 -Wunused -Waggregate-return -Wstrict-prototypes -Wmissing-prototypes -Wmissing-declarations -Wno-multichar -Wredundant-decls -Wnested-externs -Wunreachable-code -Winline -Wno-long-long -g -g -Wall -Wmissing-prototypes -Wstrict-prototypes -Wmissing-declarations -pthread -Werror=implicit-function-declaration  -DSVN_DEBUG -DAP_DEBUG  -I./subversion/include -I./subversion -I<http://hudson.zones.apache.org/hudson/job/subversion-trunk-ubuntu/ws/subversion-trunk/apr/include>   -I<http://hudson.zones.apache.org/hudson/job/subversion-trunk-ubuntu/ws/subversion-trunk/apr-util/include> -I<http://hudson.zones.apache.org/hudson/job/subversion-trunk-ubuntu/ws/subversion-trunk/sqlite-amalgamation>  -static  -o subversion/tests/libsvn_subr/opt-test.lo -c subversion/tests/libsvn_subr/opt-test.c
cd subversion/tests/libsvn_subr && <http://hudson.zones.apache.org/hudson/job/subversion-trunk-ubuntu/ws/subversion-trunk/apr/libtool> --tag=CC --silent --mode=link gcc -static  -Wold-style-definition -Wdeclaration-after-statement -Wpointer-arith -Wwrite-strings -Wshadow -ansi -Wall -Wformat=2 -Wunused -Waggregate-return -Wstrict-prototypes -Wmissing-prototypes -Wmissing-declarations -Wno-multichar -Wredundant-decls -Wnested-externs -Wunreachable-code -Winline -Wno-long-long -g -g -Wall -Wmissing-prototypes -Wstrict-prototypes -Wmissing-declarations -pthread -Werror=implicit-function-declaration  -DSVN_DEBUG -DAP_DEBUG   -rpath /usr/local/lib  -o opt-test  opt-test.lo ../../../subversion/tests/libsvn_test-1.la ../../../subversion/libsvn_subr/libsvn_subr-1.la -L<http://hudson.zones.apache.org/hudson/job/subversion-trunk-ubuntu/ws/subversion-trunk/apr> -lapr-1 
<http://hudson.zones.apache.org/hudson/job/subversion-trunk-ubuntu/ws/subversion-trunk/apr/libtool> --tag=CC --silent --mode=compile gcc -DLINUX=2 -D_REENTRANT -D_GNU_SOURCE  -Wold-style-definition -Wdeclaration-after-statement -Wpointer-arith -Wwrite-strings -Wshadow -ansi -Wall -Wformat=2 -Wunused -Waggregate-return -Wstrict-prototypes -Wmissing-prototypes -Wmissing-declarations -Wno-multichar -Wredundant-decls -Wnested-externs -Wunreachable-code -Winline -Wno-long-long -g -g -Wall -Wmissing-prototypes -Wstrict-prototypes -Wmissing-declarations -pthread -Werror=implicit-function-declaration  -DSVN_DEBUG -DAP_DEBUG  -I./subversion/include -I./subversion -I<http://hudson.zones.apache.org/hudson/job/subversion-trunk-ubuntu/ws/subversion-trunk/apr/include>   -I<http://hudson.zones.apache.org/hudson/job/subversion-trunk-ubuntu/ws/subversion-trunk/apr-util/include> -I<http://hudson.zones.apache.org/hudson/job/subversion-trunk-ubuntu/ws/subversion-trunk/sqlite-amalgamation>  -static  -o subversion/tests/libsvn_diff/parse-diff-test.lo -c subversion/tests/libsvn_diff/parse-diff-test.c
cd subversion/tests/libsvn_diff && <http://hudson.zones.apache.org/hudson/job/subversion-trunk-ubuntu/ws/subversion-trunk/apr/libtool> --tag=CC --silent --mode=link gcc -static  -Wold-style-definition -Wdeclaration-after-statement -Wpointer-arith -Wwrite-strings -Wshadow -ansi -Wall -Wformat=2 -Wunused -Waggregate-return -Wstrict-prototypes -Wmissing-prototypes -Wmissing-declarations -Wno-multichar -Wredundant-decls -Wnested-externs -Wunreachable-code -Winline -Wno-long-long -g -g -Wall -Wmissing-prototypes -Wstrict-prototypes -Wmissing-declarations -pthread -Werror=implicit-function-declaration  -DSVN_DEBUG -DAP_DEBUG   -rpath /usr/local/lib  -o parse-diff-test  parse-diff-test.lo ../../../subversion/tests/libsvn_test-1.la ../../../subversion/libsvn_diff/libsvn_diff-1.la ../../../subversion/libsvn_subr/libsvn_subr-1.la -L<http://hudson.zones.apache.org/hudson/job/subversion-trunk-ubuntu/ws/subversion-trunk/apr-util> -laprutil-1 -L<http://hudson.zones.apache.org/hudson/job/subversion-trunk-ubuntu/ws/subversion-trunk/apr> -lapr-1 
<http://hudson.zones.apache.org/hudson/job/subversion-trunk-ubuntu/ws/subversion-trunk/apr/libtool> --tag=CC --silent --mode=compile gcc -DLINUX=2 -D_REENTRANT -D_GNU_SOURCE  -Wold-style-definition -Wdeclaration-after-statement -Wpointer-arith -Wwrite-strings -Wshadow -ansi -Wall -Wformat=2 -Wunused -Waggregate-return -Wstrict-prototypes -Wmissing-prototypes -Wmissing-declarations -Wno-multichar -Wredundant-decls -Wnested-externs -Wunreachable-code -Winline -Wno-long-long -g -g -Wall -Wmissing-prototypes -Wstrict-prototypes -Wmissing-declarations -pthread -Werror=implicit-function-declaration  -DSVN_DEBUG -DAP_DEBUG  -I./subversion/include -I./subversion -I<http://hudson.zones.apache.org/hudson/job/subversion-trunk-ubuntu/ws/subversion-trunk/apr/include>   -I<http://hudson.zones.apache.org/hudson/job/subversion-trunk-ubuntu/ws/subversion-trunk/apr-util/include> -I<http://hudson.zones.apache.org/hudson/job/subversion-trunk-ubuntu/ws/subversion-trunk/sqlite-amalgamation>  -static  -o subversion/tests/libsvn_subr/path-test.lo -c subversion/tests/libsvn_subr/path-test.c
cd subversion/tests/libsvn_subr && <http://hudson.zones.apache.org/hudson/job/subversion-trunk-ubuntu/ws/subversion-trunk/apr/libtool> --tag=CC --silent --mode=link gcc -static  -Wold-style-definition -Wdeclaration-after-statement -Wpointer-arith -Wwrite-strings -Wshadow -ansi -Wall -Wformat=2 -Wunused -Waggregate-return -Wstrict-prototypes -Wmissing-prototypes -Wmissing-declarations -Wno-multichar -Wredundant-decls -Wnested-externs -Wunreachable-code -Winline -Wno-long-long -g -g -Wall -Wmissing-prototypes -Wstrict-prototypes -Wmissing-declarations -pthread -Werror=implicit-function-declaration  -DSVN_DEBUG -DAP_DEBUG   -rpath /usr/local/lib  -o path-test  path-test.lo ../../../subversion/tests/libsvn_test-1.la ../../../subversion/libsvn_subr/libsvn_subr-1.la -L<http://hudson.zones.apache.org/hudson/job/subversion-trunk-ubuntu/ws/subversion-trunk/apr-util> -laprutil-1 -L<http://hudson.zones.apache.org/hudson/job/subversion-trunk-ubuntu/ws/subversion-trunk/apr> -lapr-1 
<http://hudson.zones.apache.org/hudson/job/subversion-trunk-ubuntu/ws/subversion-trunk/apr/libtool> --tag=CC --silent --mode=compile gcc -DLINUX=2 -D_REENTRANT -D_GNU_SOURCE  -Wold-style-definition -Wdeclaration-after-statement -Wpointer-arith -Wwrite-strings -Wshadow -ansi -Wall -Wformat=2 -Wunused -Waggregate-return -Wstrict-prototypes -Wmissing-prototypes -Wmissing-declarations -Wno-multichar -Wredundant-decls -Wnested-externs -Wunreachable-code -Winline -Wno-long-long -g -g -Wall -Wmissing-prototypes -Wstrict-prototypes -Wmissing-declarations -pthread -Werror=implicit-function-declaration  -DSVN_DEBUG -DAP_DEBUG  -I./subversion/include -I./subversion -I<http://hudson.zones.apache.org/hudson/job/subversion-trunk-ubuntu/ws/subversion-trunk/apr/include>   -I<http://hudson.zones.apache.org/hudson/job/subversion-trunk-ubuntu/ws/subversion-trunk/apr-util/include> -I<http://hudson.zones.apache.org/hudson/job/subversion-trunk-ubuntu/ws/subversion-trunk/sqlite-amalgamation>  -static  -o subversion/tests/libsvn_ra_local/ra-local-test.lo -c subversion/tests/libsvn_ra_local/ra-local-test.c
cd subversion/tests/libsvn_ra_local && <http://hudson.zones.apache.org/hudson/job/subversion-trunk-ubuntu/ws/subversion-trunk/apr/libtool> --tag=CC --silent --mode=link gcc -static  -Wold-style-definition -Wdeclaration-after-statement -Wpointer-arith -Wwrite-strings -Wshadow -ansi -Wall -Wformat=2 -Wunused -Waggregate-return -Wstrict-prototypes -Wmissing-prototypes -Wmissing-declarations -Wno-multichar -Wredundant-decls -Wnested-externs -Wunreachable-code -Winline -Wno-long-long -g -g -Wall -Wmissing-prototypes -Wstrict-prototypes -Wmissing-declarations -pthread -Werror=implicit-function-declaration  -DSVN_DEBUG -DAP_DEBUG   -rpath /usr/local/lib  -o ra-local-test  ra-local-test.lo ../../../subversion/tests/libsvn_test-1.la ../../../subversion/libsvn_ra_local/libsvn_ra_local-1.la ../../../subversion/libsvn_ra/libsvn_ra-1.la ../../../subversion/libsvn_fs/libsvn_fs-1.la ../../../subversion/libsvn_delta/libsvn_delta-1.la ../../../subversion/libsvn_subr/libsvn_subr-1.la -L<http://hudson.zones.apache.org/hudson/job/subversion-trunk-ubuntu/ws/subversion-trunk/apr-util> -laprutil-1 -L<http://hudson.zones.apache.org/hudson/job/subversion-trunk-ubuntu/ws/subversion-trunk/apr> -lapr-1  
<http://hudson.zones.apache.org/hudson/job/subversion-trunk-ubuntu/ws/subversion-trunk/apr/libtool> --tag=CC --silent --mode=compile gcc -DLINUX=2 -D_REENTRANT -D_GNU_SOURCE  -Wold-style-definition -Wdeclaration-after-statement -Wpointer-arith -Wwrite-strings -Wshadow -ansi -Wall -Wformat=2 -Wunused -Waggregate-return -Wstrict-prototypes -Wmissing-prototypes -Wmissing-declarations -Wno-multichar -Wredundant-decls -Wnested-externs -Wunreachable-code -Winline -Wno-long-long -g -g -Wall -Wmissing-prototypes -Wstrict-prototypes -Wmissing-declarations -pthread -Werror=implicit-function-declaration  -DSVN_DEBUG -DAP_DEBUG  -I./subversion/include -I./subversion -I<http://hudson.zones.apache.org/hudson/job/subversion-trunk-ubuntu/ws/subversion-trunk/apr/include>   -I<http://hudson.zones.apache.org/hudson/job/subversion-trunk-ubuntu/ws/subversion-trunk/apr-util/include> -I<http://hudson.zones.apache.org/hudson/job/subversion-trunk-ubuntu/ws/subversion-trunk/sqlite-amalgamation>  -static  -o subversion/tests/libsvn_delta/random-test.lo -c subversion/tests/libsvn_delta/random-test.c
cd subversion/tests/libsvn_delta && <http://hudson.zones.apache.org/hudson/job/subversion-trunk-ubuntu/ws/subversion-trunk/apr/libtool> --tag=CC --silent --mode=link gcc -static  -Wold-style-definition -Wdeclaration-after-statement -Wpointer-arith -Wwrite-strings -Wshadow -ansi -Wall -Wformat=2 -Wunused -Waggregate-return -Wstrict-prototypes -Wmissing-prototypes -Wmissing-declarations -Wno-multichar -Wredundant-decls -Wnested-externs -Wunreachable-code -Winline -Wno-long-long -g -g -Wall -Wmissing-prototypes -Wstrict-prototypes -Wmissing-declarations -pthread -Werror=implicit-function-declaration  -DSVN_DEBUG -DAP_DEBUG   -rpath /usr/local/lib  -o random-test  random-test.lo ../../../subversion/tests/libsvn_test-1.la ../../../subversion/libsvn_delta/libsvn_delta-1.la ../../../subversion/libsvn_subr/libsvn_subr-1.la -L<http://hudson.zones.apache.org/hudson/job/subversion-trunk-ubuntu/ws/subversion-trunk/apr-util> -laprutil-1 -L<http://hudson.zones.apache.org/hudson/job/subversion-trunk-ubuntu/ws/subversion-trunk/apr> -lapr-1 
<http://hudson.zones.apache.org/hudson/job/subversion-trunk-ubuntu/ws/subversion-trunk/apr/libtool> --tag=CC --silent --mode=compile gcc -DLINUX=2 -D_REENTRANT -D_GNU_SOURCE  -Wold-style-definition -Wdeclaration-after-statement -Wpointer-arith -Wwrite-strings -Wshadow -ansi -Wall -Wformat=2 -Wunused -Waggregate-return -Wstrict-prototypes -Wmissing-prototypes -Wmissing-declarations -Wno-multichar -Wredundant-decls -Wnested-externs -Wunreachable-code -Winline -Wno-long-long -g -g -Wall -Wmissing-prototypes -Wstrict-prototypes -Wmissing-declarations -pthread -Werror=implicit-function-declaration  -DSVN_DEBUG -DAP_DEBUG  -I./subversion/include -I./subversion -I<http://hudson.zones.apache.org/hudson/job/subversion-trunk-ubuntu/ws/subversion-trunk/apr/include>   -I<http://hudson.zones.apache.org/hudson/job/subversion-trunk-ubuntu/ws/subversion-trunk/apr-util/include> -I<http://hudson.zones.apache.org/hudson/job/subversion-trunk-ubuntu/ws/subversion-trunk/sqlite-amalgamation>  -static  -o subversion/tests/libsvn_repos/dir-delta-editor.lo -c subversion/tests/libsvn_repos/dir-delta-editor.c
subversion/tests/libsvn_repos/dir-delta-editor.c: In function ?test_delete_entry?:
subversion/tests/libsvn_repos/dir-delta-editor.c:76: warning: ?svn_path_join? is deprecated (declared at ./subversion/include/svn_path.h:108)
subversion/tests/libsvn_repos/dir-delta-editor.c: In function ?test_open_directory?:
subversion/tests/libsvn_repos/dir-delta-editor.c:111: warning: ?svn_path_join? is deprecated (declared at ./subversion/include/svn_path.h:108)
subversion/tests/libsvn_repos/dir-delta-editor.c: In function ?test_add_directory?:
subversion/tests/libsvn_repos/dir-delta-editor.c:136: warning: ?svn_path_join? is deprecated (declared at ./subversion/include/svn_path.h:108)
subversion/tests/libsvn_repos/dir-delta-editor.c: In function ?test_open_file?:
subversion/tests/libsvn_repos/dir-delta-editor.c:175: warning: ?svn_path_join? is deprecated (declared at ./subversion/include/svn_path.h:108)
subversion/tests/libsvn_repos/dir-delta-editor.c: In function ?test_add_file?:
subversion/tests/libsvn_repos/dir-delta-editor.c:199: warning: ?svn_path_join? is deprecated (declared at ./subversion/include/svn_path.h:108)
<http://hudson.zones.apache.org/hudson/job/subversion-trunk-ubuntu/ws/subversion-trunk/apr/libtool> --tag=CC --silent --mode=compile gcc -DLINUX=2 -D_REENTRANT -D_GNU_SOURCE  -Wold-style-definition -Wdeclaration-after-statement -Wpointer-arith -Wwrite-strings -Wshadow -ansi -Wall -Wformat=2 -Wunused -Waggregate-return -Wstrict-prototypes -Wmissing-prototypes -Wmissing-declarations -Wno-multichar -Wredundant-decls -Wnested-externs -Wunreachable-code -Winline -Wno-long-long -g -g -Wall -Wmissing-prototypes -Wstrict-prototypes -Wmissing-declarations -pthread -Werror=implicit-function-declaration  -DSVN_DEBUG -DAP_DEBUG  -I./subversion/include -I./subversion -I<http://hudson.zones.apache.org/hudson/job/subversion-trunk-ubuntu/ws/subversion-trunk/apr/include>   -I<http://hudson.zones.apache.org/hudson/job/subversion-trunk-ubuntu/ws/subversion-trunk/apr-util/include> -I<http://hudson.zones.apache.org/hudson/job/subversion-trunk-ubuntu/ws/subversion-trunk/sqlite-amalgamation>  -static  -o subversion/tests/libsvn_repos/repos-test.lo -c subversion/tests/libsvn_repos/repos-test.c
cd subversion/tests/libsvn_repos && <http://hudson.zones.apache.org/hudson/job/subversion-trunk-ubuntu/ws/subversion-trunk/apr/libtool> --tag=CC --silent --mode=link gcc -static  -Wold-style-definition -Wdeclaration-after-statement -Wpointer-arith -Wwrite-strings -Wshadow -ansi -Wall -Wformat=2 -Wunused -Waggregate-return -Wstrict-prototypes -Wmissing-prototypes -Wmissing-declarations -Wno-multichar -Wredundant-decls -Wnested-externs -Wunreachable-code -Winline -Wno-long-long -g -g -Wall -Wmissing-prototypes -Wstrict-prototypes -Wmissing-declarations -pthread -Werror=implicit-function-declaration  -DSVN_DEBUG -DAP_DEBUG   -rpath /usr/local/lib  -o repos-test  dir-delta-editor.lo repos-test.lo ../../../subversion/tests/libsvn_test-1.la ../../../subversion/libsvn_repos/libsvn_repos-1.la ../../../subversion/libsvn_fs/libsvn_fs-1.la ../../../subversion/libsvn_delta/libsvn_delta-1.la ../../../subversion/libsvn_subr/libsvn_subr-1.la -L<http://hudson.zones.apache.org/hudson/job/subversion-trunk-ubuntu/ws/subversion-trunk/apr-util> -laprutil-1 -L<http://hudson.zones.apache.org/hudson/job/subversion-trunk-ubuntu/ws/subversion-trunk/apr> -lapr-1 
<http://hudson.zones.apache.org/hudson/job/subversion-trunk-ubuntu/ws/subversion-trunk/apr/libtool> --tag=CC --silent --mode=compile gcc -DLINUX=2 -D_REENTRANT -D_GNU_SOURCE  -Wold-style-definition -Wdeclaration-after-statement -Wpointer-arith -Wwrite-strings -Wshadow -ansi -Wall -Wformat=2 -Wunused -Waggregate-return -Wstrict-prototypes -Wmissing-prototypes -Wmissing-declarations -Wno-multichar -Wredundant-decls -Wnested-externs -Wunreachable-code -Winline -Wno-long-long -g -g -Wall -Wmissing-prototypes -Wstrict-prototypes -Wmissing-declarations -pthread -Werror=implicit-function-declaration  -DSVN_DEBUG -DAP_DEBUG  -I./subversion/include -I./subversion -I<http://hudson.zones.apache.org/hudson/job/subversion-trunk-ubuntu/ws/subversion-trunk/apr/include>   -I<http://hudson.zones.apache.org/hudson/job/subversion-trunk-ubuntu/ws/subversion-trunk/apr-util/include> -I<http://hudson.zones.apache.org/hudson/job/subversion-trunk-ubuntu/ws/subversion-trunk/sqlite-amalgamation>  -static  -o subversion/tests/libsvn_subr/revision-test.lo -c subversion/tests/libsvn_subr/revision-test.c
cd subversion/tests/libsvn_subr && <http://hudson.zones.apache.org/hudson/job/subversion-trunk-ubuntu/ws/subversion-trunk/apr/libtool> --tag=CC --silent --mode=link gcc -static  -Wold-style-definition -Wdeclaration-after-statement -Wpointer-arith -Wwrite-strings -Wshadow -ansi -Wall -Wformat=2 -Wunused -Waggregate-return -Wstrict-prototypes -Wmissing-prototypes -Wmissing-declarations -Wno-multichar -Wredundant-decls -Wnested-externs -Wunreachable-code -Winline -Wno-long-long -g -g -Wall -Wmissing-prototypes -Wstrict-prototypes -Wmissing-declarations -pthread -Werror=implicit-function-declaration  -DSVN_DEBUG -DAP_DEBUG   -rpath /usr/local/lib  -o revision-test  revision-test.lo ../../../subversion/tests/libsvn_test-1.la ../../../subversion/libsvn_subr/libsvn_subr-1.la -L<http://hudson.zones.apache.org/hudson/job/subversion-trunk-ubuntu/ws/subversion-trunk/apr> -lapr-1 
<http://hudson.zones.apache.org/hudson/job/subversion-trunk-ubuntu/ws/subversion-trunk/apr/libtool> --tag=CC --silent --mode=compile gcc -DLINUX=2 -D_REENTRANT -D_GNU_SOURCE  -Wold-style-definition -Wdeclaration-after-statement -Wpointer-arith -Wwrite-strings -Wshadow -ansi -Wall -Wformat=2 -Wunused -Waggregate-return -Wstrict-prototypes -Wmissing-prototypes -Wmissing-declarations -Wno-multichar -Wredundant-decls -Wnested-externs -Wunreachable-code -Winline -Wno-long-long -g -g -Wall -Wmissing-prototypes -Wstrict-prototypes -Wmissing-declarations -pthread -Werror=implicit-function-declaration  -DSVN_DEBUG -DAP_DEBUG  -I./subversion/include -I./subversion -I<http://hudson.zones.apache.org/hudson/job/subversion-trunk-ubuntu/ws/subversion-trunk/apr/include>   -I<http://hudson.zones.apache.org/hudson/job/subversion-trunk-ubuntu/ws/subversion-trunk/apr-util/include> -I<http://hudson.zones.apache.org/hudson/job/subversion-trunk-ubuntu/ws/subversion-trunk/sqlite-amalgamation>  -static  -o subversion/tests/libsvn_subr/skel-test.lo -c subversion/tests/libsvn_subr/skel-test.c
cd subversion/tests/libsvn_subr && <http://hudson.zones.apache.org/hudson/job/subversion-trunk-ubuntu/ws/subversion-trunk/apr/libtool> --tag=CC --silent --mode=link gcc -static  -Wold-style-definition -Wdeclaration-after-statement -Wpointer-arith -Wwrite-strings -Wshadow -ansi -Wall -Wformat=2 -Wunused -Waggregate-return -Wstrict-prototypes -Wmissing-prototypes -Wmissing-declarations -Wno-multichar -Wredundant-decls -Wnested-externs -Wunreachable-code -Winline -Wno-long-long -g -g -Wall -Wmissing-prototypes -Wstrict-prototypes -Wmissing-declarations -pthread -Werror=implicit-function-declaration  -DSVN_DEBUG -DAP_DEBUG   -rpath /usr/local/lib  -o skel-test  skel-test.lo ../../../subversion/tests/libsvn_test-1.la ../../../subversion/libsvn_subr/libsvn_subr-1.la -L<http://hudson.zones.apache.org/hudson/job/subversion-trunk-ubuntu/ws/subversion-trunk/apr-util> -laprutil-1 -L<http://hudson.zones.apache.org/hudson/job/subversion-trunk-ubuntu/ws/subversion-trunk/apr> -lapr-1 
<http://hudson.zones.apache.org/hudson/job/subversion-trunk-ubuntu/ws/subversion-trunk/apr/libtool> --tag=CC --silent --mode=compile gcc -DLINUX=2 -D_REENTRANT -D_GNU_SOURCE  -Wold-style-definition -Wdeclaration-after-statement -Wpointer-arith -Wwrite-strings -Wshadow -ansi -Wall -Wformat=2 -Wunused -Waggregate-return -Wstrict-prototypes -Wmissing-prototypes -Wmissing-declarations -Wno-multichar -Wredundant-decls -Wnested-externs -Wunreachable-code -Winline -Wno-long-long -g -g -Wall -Wmissing-prototypes -Wstrict-prototypes -Wmissing-declarations -pthread -Werror=implicit-function-declaration  -DSVN_DEBUG -DAP_DEBUG  -I./subversion/include -I./subversion -I<http://hudson.zones.apache.org/hudson/job/subversion-trunk-ubuntu/ws/subversion-trunk/apr/include>   -I<http://hudson.zones.apache.org/hudson/job/subversion-trunk-ubuntu/ws/subversion-trunk/apr-util/include> -I<http://hudson.zones.apache.org/hudson/job/subversion-trunk-ubuntu/ws/subversion-trunk/sqlite-amalgamation>  -static  -o subversion/tests/libsvn_subr/stream-test.lo -c subversion/tests/libsvn_subr/stream-test.c
cd subversion/tests/libsvn_subr && <http://hudson.zones.apache.org/hudson/job/subversion-trunk-ubuntu/ws/subversion-trunk/apr/libtool> --tag=CC --silent --mode=link gcc -static  -Wold-style-definition -Wdeclaration-after-statement -Wpointer-arith -Wwrite-strings -Wshadow -ansi -Wall -Wformat=2 -Wunused -Waggregate-return -Wstrict-prototypes -Wmissing-prototypes -Wmissing-declarations -Wno-multichar -Wredundant-decls -Wnested-externs -Wunreachable-code -Winline -Wno-long-long -g -g -Wall -Wmissing-prototypes -Wstrict-prototypes -Wmissing-declarations -pthread -Werror=implicit-function-declaration  -DSVN_DEBUG -DAP_DEBUG   -rpath /usr/local/lib  -o stream-test  stream-test.lo ../../../subversion/tests/libsvn_test-1.la ../../../subversion/libsvn_subr/libsvn_subr-1.la -L<http://hudson.zones.apache.org/hudson/job/subversion-trunk-ubuntu/ws/subversion-trunk/apr-util> -laprutil-1 -L<http://hudson.zones.apache.org/hudson/job/subversion-trunk-ubuntu/ws/subversion-trunk/apr> -lapr-1 
<http://hudson.zones.apache.org/hudson/job/subversion-trunk-ubuntu/ws/subversion-trunk/apr/libtool> --tag=CC --silent --mode=compile gcc -DLINUX=2 -D_REENTRANT -D_GNU_SOURCE  -Wold-style-definition -Wdeclaration-after-statement -Wpointer-arith -Wwrite-strings -Wshadow -ansi -Wall -Wformat=2 -Wunused -Waggregate-return -Wstrict-prototypes -Wmissing-prototypes -Wmissing-declarations -Wno-multichar -Wredundant-decls -Wnested-externs -Wunreachable-code -Winline -Wno-long-long -g -g -Wall -Wmissing-prototypes -Wstrict-prototypes -Wmissing-declarations -pthread -Werror=implicit-function-declaration  -DSVN_DEBUG -DAP_DEBUG  -I./subversion/include -I./subversion -I<http://hudson.zones.apache.org/hudson/job/subversion-trunk-ubuntu/ws/subversion-trunk/apr/include>   -I<http://hudson.zones.apache.org/hudson/job/subversion-trunk-ubuntu/ws/subversion-trunk/apr-util/include> -I<http://hudson.zones.apache.org/hudson/job/subversion-trunk-ubuntu/ws/subversion-trunk/sqlite-amalgamation>  -static  -o subversion/tests/libsvn_subr/string-test.lo -c subversion/tests/libsvn_subr/string-test.c
cd subversion/tests/libsvn_subr && <http://hudson.zones.apache.org/hudson/job/subversion-trunk-ubuntu/ws/subversion-trunk/apr/libtool> --tag=CC --silent --mode=link gcc -static  -Wold-style-definition -Wdeclaration-after-statement -Wpointer-arith -Wwrite-strings -Wshadow -ansi -Wall -Wformat=2 -Wunused -Waggregate-return -Wstrict-prototypes -Wmissing-prototypes -Wmissing-declarations -Wno-multichar -Wredundant-decls -Wnested-externs -Wunreachable-code -Winline -Wno-long-long -g -g -Wall -Wmissing-prototypes -Wstrict-prototypes -Wmissing-declarations -pthread -Werror=implicit-function-declaration  -DSVN_DEBUG -DAP_DEBUG   -rpath /usr/local/lib  -o string-test  string-test.lo ../../../subversion/tests/libsvn_test-1.la ../../../subversion/libsvn_subr/libsvn_subr-1.la -L<http://hudson.zones.apache.org/hudson/job/subversion-trunk-ubuntu/ws/subversion-trunk/apr-util> -laprutil-1 -L<http://hudson.zones.apache.org/hudson/job/subversion-trunk-ubuntu/ws/subversion-trunk/apr> -lapr-1 
<http://hudson.zones.apache.org/hudson/job/subversion-trunk-ubuntu/ws/subversion-trunk/apr/libtool> --tag=CC --silent --mode=compile gcc -DLINUX=2 -D_REENTRANT -D_GNU_SOURCE  -Wold-style-definition -Wdeclaration-after-statement -Wpointer-arith -Wwrite-strings -Wshadow -ansi -Wall -Wformat=2 -Wunused -Waggregate-return -Wstrict-prototypes -Wmissing-prototypes -Wmissing-declarations -Wno-multichar -Wredundant-decls -Wnested-externs -Wunreachable-code -Winline -Wno-long-long -g -g -Wall -Wmissing-prototypes -Wstrict-prototypes -Wmissing-declarations -pthread -Werror=implicit-function-declaration  -DSVN_DEBUG -DAP_DEBUG  -I./subversion/include -I./subversion -I<http://hudson.zones.apache.org/hudson/job/subversion-trunk-ubuntu/ws/subversion-trunk/apr/include>   -I<http://hudson.zones.apache.org/hudson/job/subversion-trunk-ubuntu/ws/subversion-trunk/apr-util/include> -I<http://hudson.zones.apache.org/hudson/job/subversion-trunk-ubuntu/ws/subversion-trunk/sqlite-amalgamation>  -static  -o subversion/tests/libsvn_delta/svndiff-test.lo -c subversion/tests/libsvn_delta/svndiff-test.c
cd subversion/tests/libsvn_delta && <http://hudson.zones.apache.org/hudson/job/subversion-trunk-ubuntu/ws/subversion-trunk/apr/libtool> --tag=CC --silent --mode=link gcc -static  -Wold-style-definition -Wdeclaration-after-statement -Wpointer-arith -Wwrite-strings -Wshadow -ansi -Wall -Wformat=2 -Wunused -Waggregate-return -Wstrict-prototypes -Wmissing-prototypes -Wmissing-declarations -Wno-multichar -Wredundant-decls -Wnested-externs -Wunreachable-code -Winline -Wno-long-long -g -g -Wall -Wmissing-prototypes -Wstrict-prototypes -Wmissing-declarations -pthread -Werror=implicit-function-declaration  -DSVN_DEBUG -DAP_DEBUG   -rpath /usr/local/lib  -o svndiff-test  svndiff-test.lo ../../../subversion/libsvn_delta/libsvn_delta-1.la ../../../subversion/libsvn_subr/libsvn_subr-1.la -L<http://hudson.zones.apache.org/hudson/job/subversion-trunk-ubuntu/ws/subversion-trunk/apr-util> -laprutil-1 -L<http://hudson.zones.apache.org/hudson/job/subversion-trunk-ubuntu/ws/subversion-trunk/apr> -lapr-1 
<http://hudson.zones.apache.org/hudson/job/subversion-trunk-ubuntu/ws/subversion-trunk/apr/libtool> --tag=CC --silent --mode=compile gcc -DLINUX=2 -D_REENTRANT -D_GNU_SOURCE  -Wold-style-definition -Wdeclaration-after-statement -Wpointer-arith -Wwrite-strings -Wshadow -ansi -Wall -Wformat=2 -Wunused -Waggregate-return -Wstrict-prototypes -Wmissing-prototypes -Wmissing-declarations -Wno-multichar -Wredundant-decls -Wnested-externs -Wunreachable-code -Winline -Wno-long-long -g -g -Wall -Wmissing-prototypes -Wstrict-prototypes -Wmissing-declarations -pthread -Werror=implicit-function-declaration  -DSVN_DEBUG -DAP_DEBUG  -I./subversion/include -I./subversion -I<http://hudson.zones.apache.org/hudson/job/subversion-trunk-ubuntu/ws/subversion-trunk/apr/include>   -I<http://hudson.zones.apache.org/hudson/job/subversion-trunk-ubuntu/ws/subversion-trunk/apr-util/include> -I<http://hudson.zones.apache.org/hudson/job/subversion-trunk-ubuntu/ws/subversion-trunk/sqlite-amalgamation>  -static  -o subversion/tests/libsvn_subr/target-test.lo -c subversion/tests/libsvn_subr/target-test.c
subversion/tests/libsvn_subr/target-test.c: In function ?condense_targets_tests_helper?:
subversion/tests/libsvn_subr/target-test.c:73: warning: ?svn_path_internal_style? is deprecated (declared at ./subversion/include/svn_path.h:71)
subversion/tests/libsvn_subr/target-test.c:81: warning: ?svn_path_internal_style? is deprecated (declared at ./subversion/include/svn_path.h:71)
subversion/tests/libsvn_subr/target-test.c: In function ?test_path_condense_targets?:
subversion/tests/libsvn_subr/target-test.c:176: warning: ?svn_path_condense_targets? is deprecated (declared at ./subversion/include/svn_path.h:375)
cd subversion/tests/libsvn_subr && <http://hudson.zones.apache.org/hudson/job/subversion-trunk-ubuntu/ws/subversion-trunk/apr/libtool> --tag=CC --silent --mode=link gcc -static  -Wold-style-definition -Wdeclaration-after-statement -Wpointer-arith -Wwrite-strings -Wshadow -ansi -Wall -Wformat=2 -Wunused -Waggregate-return -Wstrict-prototypes -Wmissing-prototypes -Wmissing-declarations -Wno-multichar -Wredundant-decls -Wnested-externs -Wunreachable-code -Winline -Wno-long-long -g -g -Wall -Wmissing-prototypes -Wstrict-prototypes -Wmissing-declarations -pthread -Werror=implicit-function-declaration  -DSVN_DEBUG -DAP_DEBUG   -rpath /usr/local/lib  -o target-test  target-test.lo ../../../subversion/tests/libsvn_test-1.la ../../../subversion/libsvn_subr/libsvn_subr-1.la -L<http://hudson.zones.apache.org/hudson/job/subversion-trunk-ubuntu/ws/subversion-trunk/apr-util> -laprutil-1 -L<http://hudson.zones.apache.org/hudson/job/subversion-trunk-ubuntu/ws/subversion-trunk/apr> -lapr-1 
<http://hudson.zones.apache.org/hudson/job/subversion-trunk-ubuntu/ws/subversion-trunk/apr/libtool> --tag=CC --silent --mode=compile gcc -DLINUX=2 -D_REENTRANT -D_GNU_SOURCE  -Wold-style-definition -Wdeclaration-after-statement -Wpointer-arith -Wwrite-strings -Wshadow -ansi -Wall -Wformat=2 -Wunused -Waggregate-return -Wstrict-prototypes -Wmissing-prototypes -Wmissing-declarations -Wno-multichar -Wredundant-decls -Wnested-externs -Wunreachable-code -Winline -Wno-long-long -g -g -Wall -Wmissing-prototypes -Wstrict-prototypes -Wmissing-declarations -pthread -Werror=implicit-function-declaration  -DSVN_DEBUG -DAP_DEBUG  -I./subversion/include -I./subversion -I<http://hudson.zones.apache.org/hudson/job/subversion-trunk-ubuntu/ws/subversion-trunk/apr/include>   -I<http://hudson.zones.apache.org/hudson/job/subversion-trunk-ubuntu/ws/subversion-trunk/apr-util/include> -I<http://hudson.zones.apache.org/hudson/job/subversion-trunk-ubuntu/ws/subversion-trunk/sqlite-amalgamation>  -static  -o subversion/tests/libsvn_subr/time-test.lo -c subversion/tests/libsvn_subr/time-test.c
cd subversion/tests/libsvn_subr && <http://hudson.zones.apache.org/hudson/job/subversion-trunk-ubuntu/ws/subversion-trunk/apr/libtool> --tag=CC --silent --mode=link gcc -static  -Wold-style-definition -Wdeclaration-after-statement -Wpointer-arith -Wwrite-strings -Wshadow -ansi -Wall -Wformat=2 -Wunused -Waggregate-return -Wstrict-prototypes -Wmissing-prototypes -Wmissing-declarations -Wno-multichar -Wredundant-decls -Wnested-externs -Wunreachable-code -Winline -Wno-long-long -g -g -Wall -Wmissing-prototypes -Wstrict-prototypes -Wmissing-declarations -pthread -Werror=implicit-function-declaration  -DSVN_DEBUG -DAP_DEBUG   -rpath /usr/local/lib  -o time-test  time-test.lo ../../../subversion/tests/libsvn_test-1.la ../../../subversion/libsvn_subr/libsvn_subr-1.la -L<http://hudson.zones.apache.org/hudson/job/subversion-trunk-ubuntu/ws/subversion-trunk/apr-util> -laprutil-1 -L<http://hudson.zones.apache.org/hudson/job/subversion-trunk-ubuntu/ws/subversion-trunk/apr> -lapr-1 
<http://hudson.zones.apache.org/hudson/job/subversion-trunk-ubuntu/ws/subversion-trunk/apr/libtool> --tag=CC --silent --mode=compile gcc -DLINUX=2 -D_REENTRANT -D_GNU_SOURCE  -Wold-style-definition -Wdeclaration-after-statement -Wpointer-arith -Wwrite-strings -Wshadow -ansi -Wall -Wformat=2 -Wunused -Waggregate-return -Wstrict-prototypes -Wmissing-prototypes -Wmissing-declarations -Wno-multichar -Wredundant-decls -Wnested-externs -Wunreachable-code -Winline -Wno-long-long -g -g -Wall -Wmissing-prototypes -Wstrict-prototypes -Wmissing-declarations -pthread -Werror=implicit-function-declaration  -DSVN_DEBUG -DAP_DEBUG  -I./subversion/include -I./subversion -I<http://hudson.zones.apache.org/hudson/job/subversion-trunk-ubuntu/ws/subversion-trunk/apr/include>   -I<http://hudson.zones.apache.org/hudson/job/subversion-trunk-ubuntu/ws/subversion-trunk/apr-util/include> -I<http://hudson.zones.apache.org/hudson/job/subversion-trunk-ubuntu/ws/subversion-trunk/sqlite-amalgamation>  -static  -o subversion/tests/libsvn_subr/translate-test.lo -c subversion/tests/libsvn_subr/translate-test.c
cd subversion/tests/libsvn_subr && <http://hudson.zones.apache.org/hudson/job/subversion-trunk-ubuntu/ws/subversion-trunk/apr/libtool> --tag=CC --silent --mode=link gcc -static  -Wold-style-definition -Wdeclaration-after-statement -Wpointer-arith -Wwrite-strings -Wshadow -ansi -Wall -Wformat=2 -Wunused -Waggregate-return -Wstrict-prototypes -Wmissing-prototypes -Wmissing-declarations -Wno-multichar -Wredundant-decls -Wnested-externs -Wunreachable-code -Winline -Wno-long-long -g -g -Wall -Wmissing-prototypes -Wstrict-prototypes -Wmissing-declarations -pthread -Werror=implicit-function-declaration  -DSVN_DEBUG -DAP_DEBUG   -rpath /usr/local/lib  -o translate-test  translate-test.lo ../../../subversion/tests/libsvn_test-1.la ../../../subversion/libsvn_subr/libsvn_subr-1.la -L<http://hudson.zones.apache.org/hudson/job/subversion-trunk-ubuntu/ws/subversion-trunk/apr-util> -laprutil-1 -L<http://hudson.zones.apache.org/hudson/job/subversion-trunk-ubuntu/ws/subversion-trunk/apr> -lapr-1 
<http://hudson.zones.apache.org/hudson/job/subversion-trunk-ubuntu/ws/subversion-trunk/apr/libtool> --tag=CC --silent --mode=compile gcc -DLINUX=2 -D_REENTRANT -D_GNU_SOURCE  -Wold-style-definition -Wdeclaration-after-statement -Wpointer-arith -Wwrite-strings -Wshadow -ansi -Wall -Wformat=2 -Wunused -Waggregate-return -Wstrict-prototypes -Wmissing-prototypes -Wmissing-declarations -Wno-multichar -Wredundant-decls -Wnested-externs -Wunreachable-code -Winline -Wno-long-long -g -g -Wall -Wmissing-prototypes -Wstrict-prototypes -Wmissing-declarations -pthread -Werror=implicit-function-declaration  -DSVN_DEBUG -DAP_DEBUG  -I./subversion/include -I./subversion -I<http://hudson.zones.apache.org/hudson/job/subversion-trunk-ubuntu/ws/subversion-trunk/apr/include>   -I<http://hudson.zones.apache.org/hudson/job/subversion-trunk-ubuntu/ws/subversion-trunk/apr-util/include> -I<http://hudson.zones.apache.org/hudson/job/subversion-trunk-ubuntu/ws/subversion-trunk/sqlite-amalgamation>  -static  -o subversion/tests/libsvn_wc/tree-conflict-data-test.lo -c subversion/tests/libsvn_wc/tree-conflict-data-test.c
cd subversion/tests/libsvn_wc && <http://hudson.zones.apache.org/hudson/job/subversion-trunk-ubuntu/ws/subversion-trunk/apr/libtool> --tag=CC --silent --mode=link gcc -static  -Wold-style-definition -Wdeclaration-after-statement -Wpointer-arith -Wwrite-strings -Wshadow -ansi -Wall -Wformat=2 -Wunused -Waggregate-return -Wstrict-prototypes -Wmissing-prototypes -Wmissing-declarations -Wno-multichar -Wredundant-decls -Wnested-externs -Wunreachable-code -Winline -Wno-long-long -g -g -Wall -Wmissing-prototypes -Wstrict-prototypes -Wmissing-declarations -pthread -Werror=implicit-function-declaration  -DSVN_DEBUG -DAP_DEBUG   -rpath /usr/local/lib  -o tree-conflict-data-test  tree-conflict-data-test.lo ../../../subversion/tests/libsvn_test-1.la ../../../subversion/libsvn_wc/libsvn_wc-1.la ../../../subversion/libsvn_subr/libsvn_subr-1.la -L<http://hudson.zones.apache.org/hudson/job/subversion-trunk-ubuntu/ws/subversion-trunk/apr-util> -laprutil-1 -L<http://hudson.zones.apache.org/hudson/job/subversion-trunk-ubuntu/ws/subversion-trunk/apr> -lapr-1 
<http://hudson.zones.apache.org/hudson/job/subversion-trunk-ubuntu/ws/subversion-trunk/apr/libtool> --tag=CC --silent --mode=compile gcc -DLINUX=2 -D_REENTRANT -D_GNU_SOURCE  -Wold-style-definition -Wdeclaration-after-statement -Wpointer-arith -Wwrite-strings -Wshadow -ansi -Wall -Wformat=2 -Wunused -Waggregate-return -Wstrict-prototypes -Wmissing-prototypes -Wmissing-declarations -Wno-multichar -Wredundant-decls -Wnested-externs -Wunreachable-code -Winline -Wno-long-long -g -g -Wall -Wmissing-prototypes -Wstrict-prototypes -Wmissing-declarations -pthread -Werror=implicit-function-declaration  -DSVN_DEBUG -DAP_DEBUG  -I./subversion/include -I./subversion -I<http://hudson.zones.apache.org/hudson/job/subversion-trunk-ubuntu/ws/subversion-trunk/apr/include>   -I<http://hudson.zones.apache.org/hudson/job/subversion-trunk-ubuntu/ws/subversion-trunk/apr-util/include> -I<http://hudson.zones.apache.org/hudson/job/subversion-trunk-ubuntu/ws/subversion-trunk/sqlite-amalgamation>  -static  -o subversion/tests/libsvn_subr/utf-test.lo -c subversion/tests/libsvn_subr/utf-test.c
cd subversion/tests/libsvn_subr && <http://hudson.zones.apache.org/hudson/job/subversion-trunk-ubuntu/ws/subversion-trunk/apr/libtool> --tag=CC --silent --mode=link gcc -static  -Wold-style-definition -Wdeclaration-after-statement -Wpointer-arith -Wwrite-strings -Wshadow -ansi -Wall -Wformat=2 -Wunused -Waggregate-return -Wstrict-prototypes -Wmissing-prototypes -Wmissing-declarations -Wno-multichar -Wredundant-decls -Wnested-externs -Wunreachable-code -Winline -Wno-long-long -g -g -Wall -Wmissing-prototypes -Wstrict-prototypes -Wmissing-declarations -pthread -Werror=implicit-function-declaration  -DSVN_DEBUG -DAP_DEBUG   -rpath /usr/local/lib  -o utf-test  utf-test.lo ../../../subversion/tests/libsvn_test-1.la ../../../subversion/libsvn_subr/libsvn_subr-1.la -L<http://hudson.zones.apache.org/hudson/job/subversion-trunk-ubuntu/ws/subversion-trunk/apr-util> -laprutil-1 -L<http://hudson.zones.apache.org/hudson/job/subversion-trunk-ubuntu/ws/subversion-trunk/apr> -lapr-1 
<http://hudson.zones.apache.org/hudson/job/subversion-trunk-ubuntu/ws/subversion-trunk/apr/libtool> --tag=CC --silent --mode=compile gcc -DLINUX=2 -D_REENTRANT -D_GNU_SOURCE  -Wold-style-definition -Wdeclaration-after-statement -Wpointer-arith -Wwrite-strings -Wshadow -ansi -Wall -Wformat=2 -Wunused -Waggregate-return -Wstrict-prototypes -Wmissing-prototypes -Wmissing-declarations -Wno-multichar -Wredundant-decls -Wnested-externs -Wunreachable-code -Winline -Wno-long-long -g -g -Wall -Wmissing-prototypes -Wstrict-prototypes -Wmissing-declarations -pthread -Werror=implicit-function-declaration  -DSVN_DEBUG -DAP_DEBUG  -I./subversion/include -I./subversion -I<http://hudson.zones.apache.org/hudson/job/subversion-trunk-ubuntu/ws/subversion-trunk/apr/include>   -I<http://hudson.zones.apache.org/hudson/job/subversion-trunk-ubuntu/ws/subversion-trunk/apr-util/include> -I<http://hudson.zones.apache.org/hudson/job/subversion-trunk-ubuntu/ws/subversion-trunk/sqlite-amalgamation>  -static  -o subversion/tests/libsvn_delta/vdelta-test.lo -c subversion/tests/libsvn_delta/vdelta-test.c
cd subversion/tests/libsvn_delta && <http://hudson.zones.apache.org/hudson/job/subversion-trunk-ubuntu/ws/subversion-trunk/apr/libtool> --tag=CC --silent --mode=link gcc -static  -Wold-style-definition -Wdeclaration-after-statement -Wpointer-arith -Wwrite-strings -Wshadow -ansi -Wall -Wformat=2 -Wunused -Waggregate-return -Wstrict-prototypes -Wmissing-prototypes -Wmissing-declarations -Wno-multichar -Wredundant-decls -Wnested-externs -Wunreachable-code -Winline -Wno-long-long -g -g -Wall -Wmissing-prototypes -Wstrict-prototypes -Wmissing-declarations -pthread -Werror=implicit-function-declaration  -DSVN_DEBUG -DAP_DEBUG   -rpath /usr/local/lib  -o vdelta-test  vdelta-test.lo ../../../subversion/libsvn_delta/libsvn_delta-1.la ../../../subversion/libsvn_subr/libsvn_subr-1.la -L<http://hudson.zones.apache.org/hudson/job/subversion-trunk-ubuntu/ws/subversion-trunk/apr-util> -laprutil-1 -L<http://hudson.zones.apache.org/hudson/job/subversion-trunk-ubuntu/ws/subversion-trunk/apr> -lapr-1 
<http://hudson.zones.apache.org/hudson/job/subversion-trunk-ubuntu/ws/subversion-trunk/apr/libtool> --tag=CC --silent --mode=compile gcc -DLINUX=2 -D_REENTRANT -D_GNU_SOURCE  -Wold-style-definition -Wdeclaration-after-statement -Wpointer-arith -Wwrite-strings -Wshadow -ansi -Wall -Wformat=2 -Wunused -Waggregate-return -Wstrict-prototypes -Wmissing-prototypes -Wmissing-declarations -Wno-multichar -Wredundant-decls -Wnested-externs -Wunreachable-code -Winline -Wno-long-long -g -g -Wall -Wmissing-prototypes -Wstrict-prototypes -Wmissing-declarations -pthread -Werror=implicit-function-declaration  -DSVN_DEBUG -DAP_DEBUG  -I./subversion/include -I./subversion -I<http://hudson.zones.apache.org/hudson/job/subversion-trunk-ubuntu/ws/subversion-trunk/apr/include>   -I<http://hudson.zones.apache.org/hudson/job/subversion-trunk-ubuntu/ws/subversion-trunk/apr-util/include> -I<http://hudson.zones.apache.org/hudson/job/subversion-trunk-ubuntu/ws/subversion-trunk/sqlite-amalgamation>  -static  -o subversion/tests/libsvn_delta/window-test.lo -c subversion/tests/libsvn_delta/window-test.c
cd subversion/tests/libsvn_delta && <http://hudson.zones.apache.org/hudson/job/subversion-trunk-ubuntu/ws/subversion-trunk/apr/libtool> --tag=CC --silent --mode=link gcc -static  -Wold-style-definition -Wdeclaration-after-statement -Wpointer-arith -Wwrite-strings -Wshadow -ansi -Wall -Wformat=2 -Wunused -Waggregate-return -Wstrict-prototypes -Wmissing-prototypes -Wmissing-declarations -Wno-multichar -Wredundant-decls -Wnested-externs -Wunreachable-code -Winline -Wno-long-long -g -g -Wall -Wmissing-prototypes -Wstrict-prototypes -Wmissing-declarations -pthread -Werror=implicit-function-declaration  -DSVN_DEBUG -DAP_DEBUG   -rpath /usr/local/lib  -o window-test  window-test.lo ../../../subversion/tests/libsvn_test-1.la ../../../subversion/libsvn_delta/libsvn_delta-1.la ../../../subversion/libsvn_subr/libsvn_subr-1.la -L<http://hudson.zones.apache.org/hudson/job/subversion-trunk-ubuntu/ws/subversion-trunk/apr-util> -laprutil-1 -L<http://hudson.zones.apache.org/hudson/job/subversion-trunk-ubuntu/ws/subversion-trunk/apr> -lapr-1 
/usr/bin/msgfmt -c -o subversion/po/de.mo subversion/po/de.po
/usr/bin/msgfmt -c -o subversion/po/es.mo subversion/po/es.po
/usr/bin/msgfmt -c -o subversion/po/fr.mo subversion/po/fr.po
/usr/bin/msgfmt -c -o subversion/po/it.mo subversion/po/it.po
/usr/bin/msgfmt -c -o subversion/po/ja.mo subversion/po/ja.po
/usr/bin/msgfmt -c -o subversion/po/ko.mo subversion/po/ko.po
/usr/bin/msgfmt -c -o subversion/po/nb.mo subversion/po/nb.po
/usr/bin/msgfmt -c -o subversion/po/pl.mo subversion/po/pl.po
/usr/bin/msgfmt -c -o subversion/po/pt_BR.mo subversion/po/pt_BR.po
/usr/bin/msgfmt -c -o subversion/po/sv.mo subversion/po/sv.po
/usr/bin/msgfmt -c -o subversion/po/zh_CN.mo subversion/po/zh_CN.po
/usr/bin/msgfmt -c -o subversion/po/zh_TW.mo subversion/po/zh_TW.po
Running tests in auth-test [1/75]...................success
Running tests in cache-test [2/75]..................success
Running tests in checksum-test [3/75]...............success
Running tests in client-test [4/75].................success
Running tests in compat-test [5/75].................success
Running tests in config-test [6/75].................success
Running tests in db-test [7/75].....................success
Running tests in diff-diff3-test [8/75].............success
Running tests in dirent_uri-test [9/75].............success
Running tests in eol-test [10/75]...................success
Running tests in error-test [11/75].................success
Running tests in fs-pack-test [12/75]...............success
Running tests in fs-test [13/75]....................success
Running tests in hashdump-test [14/75]..............success
Running tests in locks-test [15/75].................success
Running tests in mergeinfo-test [16/75].............success
Running tests in opt-test [17/75]...................success
Running tests in parse-diff-test [18/75]............success
Running tests in path-test [19/75]..................success
Running tests in ra-local-test [20/75]..............success
Running tests in random-test [21/75]................success
Running tests in repos-test [22/75].................success
Running tests in revision-test [23/75]..............success
Running tests in skel-test [24/75]..................success
Running tests in stream-test [25/75]................success
Running tests in string-test [26/75]................success
Running tests in target-test [27/75]................success
Running tests in time-test [28/75]..................success
Running tests in translate-test [29/75].............success
Running tests in tree-conflict-data-test [30/75]....success
Running tests in utf-test [31/75]...................success
Running tests in window-test [32/75]................success
Running tests in authz_tests.py [33/75].............success
Running tests in autoprop_tests.py [34/75]..........success
Running tests in basic_tests.py [35/75].............success
Running tests in blame_tests.py [36/75].............success
Running tests in cat_tests.py [37/75]...............success
Running tests in changelist_tests.py [38/75]........success
Running tests in checkout_tests.py [39/75]..........success
Running tests in commit_tests.py [40/75]............success
Running tests in copy_tests.py [41/75]..............success
Running tests in depth_tests.py [42/75].............success
Running tests in diff_tests.py [43/75]..............success
Running tests in entries_tests.py [44/75]...........success
Running tests in export_tests.py [45/75]............success
Running tests in externals_tests.py [46/75].........success
Running tests in getopt_tests.py [47/75]............success
Running tests in history_tests.py [48/75]...........success
Running tests in import_tests.py [49/75]............success
Running tests in info_tests.py [50/75]..............success
Running tests in lock_tests.py [51/75]..............success
Running tests in log_tests.py [52/75]...............success
Running tests in merge_authz_tests.py [53/75].......FAILURE
Running tests in merge_tests.py [54/75].............FAILURE
Running tests in mergeinfo_tests.py [55/75].........success
Running tests in obliterate_tests.py [56/75]........success
Running tests in patch_tests.py [57/75].............success
Running tests in prop_tests.py [58/75]..............success
Running tests in resolve_tests.py [59/75]...........success
Running tests in resolved_tests.py [60/75]..........success
Running tests in revert_tests.py [61/75]............success
Running tests in schedule_tests.py [62/75]..........success
Running tests in special_tests.py [63/75]...........success
Running tests in stat_tests.py [64/75]..............success
Running tests in svnadmin_tests.py [65/75]..........success
Running tests in svndumpfilter_tests.py [66/75].....success
Running tests in svnlook_tests.py [67/75]...........success
Running tests in svnsync_tests.py [68/75]...........success
Running tests in svnversion_tests.py [69/75]........success
Running tests in switch_tests.py [70/75]............success
Running tests in trans_tests.py [71/75].............success
Running tests in tree_conflict_tests.py [72/75].....success
Running tests in update_tests.py [73/75]............FAILURE
Running tests in upgrade_tests.py [74/75]...........success
Running tests in utf8_tests.py [75/75]..............success
At least one test was SKIPPED, checking <http://hudson.zones.apache.org/hudson/job/subversion-trunk-ubuntu/ws/subversion-trunk/tests.log>
SKIP:  cache-test 2: basic memcache svn_cache test
SKIP:  cache-test 3: memcache svn_cache with very long keys
SKIP:  authz_tests.py 1: authz issue #2486 - open root
SKIP:  authz_tests.py 2: authz issue #2486 - open directory
SKIP:  authz_tests.py 3: broken authz files cause errors
SKIP:  authz_tests.py 4: test authz for read operations
SKIP:  authz_tests.py 5: test authz for write operations
SKIP:  authz_tests.py 6: test authz for checkout
SKIP:  authz_tests.py 7: test authz for log and tracing path changes
SKIP:  authz_tests.py 8: test authz for checkout and update
SKIP:  authz_tests.py 9: test authz for export with unreadable subfolder
SKIP:  authz_tests.py 10: test authz for aliases
SKIP:  authz_tests.py 11: test the authz validation rules
SKIP:  authz_tests.py 12: test authz for locking
SKIP:  authz_tests.py 13: authz issue #2712
SKIP:  authz_tests.py 14: switched to directory, no read access on parents
SKIP:  authz_tests.py 15: authz issue #3242 - access required at repo root
SKIP:  authz_tests.py 16: multiple lines matching a user
SKIP:  copy_tests.py 24: wc to wc copy with deleted=true items
SKIP:  merge_authz_tests.py 1: skipped paths get overriding mergeinfo
SKIP:  obliterate_tests.py 1: test svn obliterate
SKIP:  obliterate_tests.py 2: test the pre-obliterate hook
SKIP:  svnlook_tests.py 2: delete file in moved dir
SKIP:  svnsync_tests.py 14: verify that unreadable content is not synced
SKIP:  svnsync_tests.py 15: verify that copies from unreadable dirs work
SKIP:  svnsync_tests.py 16: verify copies with mods from unreadable dirs
SKIP:  svnsync_tests.py 17: verify copies with mods from unreadable dirs +copy
SKIP:  update_tests.py 32: update wc on the root of a Windows (virtual) drive
SKIP:  utf8_tests.py 1: conversion of paths and logs to/from utf8
At least one test XFAILED, checking <http://hudson.zones.apache.org/hudson/job/subversion-trunk-ubuntu/ws/subversion-trunk/tests.log>
XFAIL: fs-test 18: merging commit
       [[needs to be written to match new merge() algorithm expectations]]
XFAIL: fs-test 36: obliterate 1
       [[obliterate is in development]]
XFAIL: locks-test 9: able to reserve a name (lock non-existent path)
XFAIL: locks-test 10: directory locks (kinda)
XFAIL: tree-conflict-data-test 3: detect broken tree conflict data
XFAIL: basic_tests.py 39: remotely remove directories from two repositories
XFAIL: changelist_tests.py 12: 'svn mv' of existing keeps the changelist
XFAIL: changelist_tests.py 13: 'svn mv' of added keeps the changelist
XFAIL: commit_tests.py 25: commit from two nested working copies
XFAIL: commit_tests.py 26: commit from two working copies
XFAIL: copy_tests.py 79: move a dir below a moved dir
XFAIL: copy_tests.py 80: reverse merge move
XFAIL: depth_tests.py 32: make sure update handle svn_depth_exclude properly
XFAIL: depth_tests.py 36: 'info' should treat excluded item as versioned
XFAIL: diff_tests.py 28: diff a renamed directory
XFAIL: diff_tests.py 49: diff URL against working copy with local mods
XFAIL: diff_tests.py 50: diff -r1 of removed file to its local addition
XFAIL: externals_tests.py 19: delete a file external
XFAIL: log_tests.py 21: test log -c on range of changes
XFAIL: merge_tests.py 33: merge a replacement of a directory
XFAIL: merge_tests.py 55: avoid repeated merges for cyclic merging
XFAIL: merge_tests.py 71: merge target with non inheritable mergeinfo
XFAIL: merge_tests.py 90: merge added subtree
XFAIL: merge_tests.py 114: tree conflicts 5.1: leaf edit, tree del
XFAIL: merge_tests.py 115: tree conflicts 5.2: leaf del, tree del
XFAIL: merge_tests.py 119: tree conflicts 5.1: leaf edit (no ci), tree del
XFAIL: merge_tests.py 120: tree conflicts 5.2: leaf del (no ci), tree del
XFAIL: merge_tests.py 124: merge prior to rename src existence still dels src
XFAIL: merge_tests.py 135: replace vs. delete tree-conflicts
XFAIL: merge_tests.py 137: automatic conflict resolutions work with merge
XFAIL: mergeinfo_tests.py 4: 'mergeinfo' with uninteresting source selection
XFAIL: revert_tests.py 4: revert a moved file
XFAIL: revert_tests.py 17: status after replace+, revert, and local rm
       [[revert behavior needs better definition]]
XFAIL: switch_tests.py 10: switch a file to a dir and back to the file
XFAIL: switch_tests.py 38: copy directory with switched subdir
XFAIL: tree_conflict_tests.py 14: merge dir: del/rpl/mv onto not-same
XFAIL: tree_conflict_tests.py 18: --force del on dir with TCs inside
XFAIL: tree_conflict_tests.py 19: --keep-local del on tree-conflicted targets
XFAIL: tree_conflict_tests.py 20: --force del on tree-conflicted targets
XFAIL: tree_conflict_tests.py 21: query an unversioned tree-conflicted dir
XFAIL: update_tests.py 50: tree conflicts 2.3: skip on 2nd update
XFAIL: update_tests.py 57: verify update of deleted locked files
XFAIL: upgrade_tests.py 3: test updating a 1.5-era working copy
At least one test FAILED, checking <http://hudson.zones.apache.org/hudson/job/subversion-trunk-ubuntu/ws/subversion-trunk/tests.log>
FAIL:  merge_authz_tests.py 2: merge fails if subtree is deleted on src
FAIL:  merge_tests.py 1: performing a merge, with mixed results
FAIL:  merge_tests.py 5: merging a file w/no explicit target path using -r
FAIL:  merge_tests.py 6: merging a file w/no explicit target path using -c
FAIL:  merge_tests.py 7: merging a file w/no explicit target path or revs
FAIL:  merge_tests.py 11: merge operations using PREV revision
FAIL:  merge_tests.py 46: mergeinfo elides to ancestor with identical info
FAIL:  merge_tests.py 64: child having different rev ranges to merge
FAIL:  merge_tests.py 65: merge -rold(before rename):head renamed file
FAIL:  merge_tests.py 68: command line supports cherry picked merge ranges
FAIL:  merge_tests.py 94: merge fails with renamed subtrees with mergeinfo
FAIL:  merge_tests.py 98: subtree merge source might not exist
FAIL:  merge_tests.py 104: subtree merges dont cause spurious conflicts
FAIL:  merge_tests.py 105: target and subtrees need nonintersecting revs
FAIL:  merge_tests.py 122: subtree gets changes even if ultimately deleted
FAIL:  merge_tests.py 138: skipped files get correct mergeinfo set
FAIL:  update_tests.py 36: mergeinfo does not elide after update
Summary of test results:
  1153 tests PASSED
  29 tests SKIPPED
  43 tests XFAILED (3 WORK-IN-PROGRESS)
  17 tests FAILED
make: *** [check] Error 1
Generating junit files ...
Recording test results


Mime
View raw message