subversion-notifications mailing list archives

Site index · List index
Message view « Date » · « Thread »
Top « Date » · « Thread »
From Apache Hudson Server <hud...@hudson.zones.apache.org>
Subject Build failed in Hudson: subversion-trunk-ubuntu #203
Date Tue, 12 Jan 2010 19:23:38 GMT
See <http://hudson.zones.apache.org/hudson/job/subversion-trunk-ubuntu/203/changes>

Changes:

[hwright] * CHANGES: Update 1.6.8 section for release.

------------------------------------------
[...truncated 2488 lines...]
FAIL:  lock_tests.py 30: show correct lock info on moved path
FAIL:  lock_tests.py 35: lock a file using a comment with xml special chars
FAIL:  lock_tests.py 36: try to lock a file twice in one working copy
FAIL:  log_tests.py 1: 'svn log', no args, top of wc
FAIL:  log_tests.py 3: 'svn log -rN some_dir_unchanged_in_N'
FAIL:  log_tests.py 5: 'svn log -r COMMITTED' of dynamic/local WC rev
FAIL:  log_tests.py 6: 'svn log', with args, top of wc
FAIL:  log_tests.py 7: 'svn log wc_target@N'
FAIL:  log_tests.py 8: 'svn log target@N' when target removed from HEAD
FAIL:  log_tests.py 9: 'svn log TGT' with copyfrom history
FAIL:  log_tests.py 12: svn log --limit
FAIL:  log_tests.py 13: run log on an @BASE target
FAIL:  log_tests.py 14: run log with verbose output
FAIL:  log_tests.py 16: test 'svn log -g' on a single revision
FAIL:  log_tests.py 17: test 'svn log -g' on a branching revision
FAIL:  log_tests.py 18: test 'svn log -g' on a non-branching revision
FAIL:  log_tests.py 19: test 'svn log -g' a path added before merge
FAIL:  log_tests.py 20: test log -c for a single change
FAIL:  log_tests.py 22: test log -c on comma-separated list of changes
FAIL:  log_tests.py 24: test revprop retrieval
FAIL:  log_tests.py 27: log -g and explicit mergeinfo replacing inherited
FAIL:  log_tests.py 28: log -g and simple propmod to merge-inheriting path
FAIL:  merge_authz_tests.py 2: merge fails if subtree is deleted on src
FAIL:  merge_tests.py 1: performing a merge, with mixed results
FAIL:  merge_tests.py 5: merging a file w/no explicit target path using -r
FAIL:  merge_tests.py 6: merging a file w/no explicit target path using -c
FAIL:  merge_tests.py 7: merging a file w/no explicit target path or revs
FAIL:  merge_tests.py 8: merge should not die if a target file is absent
FAIL:  merge_tests.py 9: merge on deleted directory in target
FAIL:  merge_tests.py 10: merging similar trees ancestrally unrelated
FAIL:  merge_tests.py 11: merge operations using PREV revision
FAIL:  merge_tests.py 12: merge change into unchanged binary file
FAIL:  merge_tests.py 14: merge one file (issue #1150) using the -r option
FAIL:  merge_tests.py 15: merge one file (issue #1150) using the -c option
FAIL:  merge_tests.py 16: merge one file without explicit revisions
FAIL:  merge_tests.py 17: mark a revision range as merged
FAIL:  merge_tests.py 19: merge should skip over unversioned obstructions
FAIL:  merge_tests.py 22: merge binary files with common ancestry
FAIL:  merge_tests.py 26: merge a file whose name contains a space
FAIL:  merge_tests.py 31: cherry-pick a dependent change, get conflict
FAIL:  merge_tests.py 32: merge a replacement of a file
FAIL:  merge_tests.py 35: merge a replacement of a file to mixed rev wc
FAIL:  merge_tests.py 37: ignore whitespace when merging
FAIL:  merge_tests.py 38: ignore eolstyle when merging
FAIL:  merge_tests.py 40: conflict markers should match the file's eol style
FAIL:  merge_tests.py 41: handle eol-style propchange during merge
FAIL:  merge_tests.py 42: use inherited mergeinfo to avoid repeated merge
FAIL:  merge_tests.py 43: use subtree's mergeinfo to avoid repeated merge
FAIL:  merge_tests.py 44: drive reporter api in depth first order
FAIL:  merge_tests.py 45: target inherits mergeinfo from nearest ancestor
FAIL:  merge_tests.py 46: mergeinfo elides to ancestor with identical info
FAIL:  merge_tests.py 47: discontinuous merges produce correct mergeinfo
FAIL:  merge_tests.py 48: merge works when target has copied children
FAIL:  merge_tests.py 49: merge to switched path does not inherit or elide
FAIL:  merge_tests.py 50: merge to path with switched children
FAIL:  merge_tests.py 51: merge a change to a file, using relative path
FAIL:  merge_tests.py 52: mergeinfo can explicitly be empty
FAIL:  merge_tests.py 53: merge adding prop to child of merge target works
FAIL:  merge_tests.py 54: set no mergeinfo when merging from foreign repos
FAIL:  merge_tests.py 58: replace-style merge capability for a single file
FAIL:  merge_tests.py 59: merge to ood path can lead to inaccurate mergeinfo
FAIL:  merge_tests.py 60: merge test for --depth files
FAIL:  merge_tests.py 61: subtrees can lose non-inheritable ranges
FAIL:  merge_tests.py 62: merge to sparse directories
FAIL:  merge_tests.py 63: merge -rold(before rename):head renamed dir
FAIL:  merge_tests.py 64: child having different rev ranges to merge
FAIL:  merge_tests.py 65: merge -rold(before rename):head renamed file
FAIL:  merge_tests.py 66: merge with auto detection of revision ranges
FAIL:  merge_tests.py 67: mergeinfo recording in skipped merge
FAIL:  merge_tests.py 68: command line supports cherry picked merge ranges
FAIL:  merge_tests.py 69: merge of propchange on subdir raises conflict
FAIL:  merge_tests.py 72: revert a commit on a target
FAIL:  merge_tests.py 73: --ignore-ancestry also ignores mergeinfo
FAIL:  merge_tests.py 74: merge from renamed branch
FAIL:  merge_tests.py 75: normalized mergeinfo is recorded on subtrees
FAIL:  merge_tests.py 76: subtrees added after start of merge range are ok
FAIL:  merge_tests.py 77: basic merge --reintegrate support
FAIL:  merge_tests.py 78: merge --reintegrate with renamed file on branch
FAIL:  merge_tests.py 79: merge --reintegrate on a never-updated branch
FAIL:  merge_tests.py 80: merge --reintegrate should fail in modified wc
FAIL:  merge_tests.py 81: merge --reintegrate should fail in mixed-rev wc
FAIL:  merge_tests.py 82: merge --reintegrate should fail in switched wc
FAIL:  merge_tests.py 83: merge --reintegrate should fail in shallow wc
FAIL:  merge_tests.py 84: merge --reintegrate should fail on stale source
FAIL:  merge_tests.py 85: cyclic merges don't add mergeinfo from own history
FAIL:  merge_tests.py 86: merge range predates history (issue #3094)
FAIL:  merge_tests.py 87: merge from a foreign repository
FAIL:  merge_tests.py 89: 2-url merge from a foreign repository
FAIL:  merge_tests.py 92: merges that remove all mergeinfo work
FAIL:  merge_tests.py 93: dont merge revs into a subtree that predate it
FAIL:  merge_tests.py 94: merge fails with renamed subtrees with mergeinfo
FAIL:  merge_tests.py 95: don't explicitly record implicit mergeinfo
FAIL:  merge_tests.py 96: merge with broken symlinks in target
FAIL:  merge_tests.py 97: subtree ranges might not intersect with target
FAIL:  merge_tests.py 98: subtree merge source might not exist
FAIL:  merge_tests.py 99: mergeinfo not set on subtree with empty mergeinfo
FAIL:  merge_tests.py 100: commits to subtrees added by merge wreak havoc
FAIL:  merge_tests.py 101: merge tries to delete a file of identical content
FAIL:  merge_tests.py 103: merge tries to delete a file of different content
FAIL:  merge_tests.py 104: subtree merges dont cause spurious conflicts
FAIL:  merge_tests.py 105: target and subtrees need nonintersecting revs
FAIL:  merge_tests.py 106: merge two successive edits to the same property
FAIL:  merge_tests.py 107: merge an EOL unification and set svn:eol-style
FAIL:  merge_tests.py 108: merge adds mergeinfo to subtrees correctly
FAIL:  merge_tests.py 109: merge a file with space in its path
FAIL:  merge_tests.py 110: natural history filtering permits valid mergeinfo
FAIL:  merge_tests.py 112: tree conflicts 4.1: tree del, leaf edit
FAIL:  merge_tests.py 117: tree conflicts 4.1: tree del (no ci), leaf edit
FAIL:  merge_tests.py 122: subtree gets changes even if ultimately deleted
FAIL:  merge_tests.py 123: no self referential filtering on added path
FAIL:  merge_tests.py 125: merge --reintegrate with subtree mergeinfo
FAIL:  merge_tests.py 126: mergeinfo aware merges ignore natural history gaps
FAIL:  merge_tests.py 127: mergeinfo deleted by a merge should disappear
FAIL:  merge_tests.py 128: tree conflicts: tree missing, leaf edit
FAIL:  merge_tests.py 130: noop file merge does not segfault
FAIL:  merge_tests.py 131: multiple reintegrates create self-referential
FAIL:  merge_tests.py 132: replace vs. edit tree-conflicts
FAIL:  merge_tests.py 133: correctly consider natural history gaps
FAIL:  merge_tests.py 136: record only merge applies mergeinfo diffs
FAIL:  merge_tests.py 138: skipped files get correct mergeinfo set
FAIL:  merge_tests.py 140: merge into WC of deleted branch should work
FAIL:  merge_tests.py 141: source has target's history as explicit mergeinfo
FAIL:  mergeinfo_tests.py 6: non-inheritable mergeinfo shows as merged
FAIL:  mergeinfo_tests.py 7: test svn mergeinfo -R
FAIL:  mergeinfo_tests.py 8: svn mergeinfo on pegged working copy target
FAIL:  patch_tests.py 1: apply a unidiff patch
FAIL:  patch_tests.py 2: apply a unidiff patch containing absolute paths
FAIL:  patch_tests.py 3: apply a unidiff patch with offset searching
FAIL:  patch_tests.py 4: apply a unidiff patch with chopped leading spaces
FAIL:  patch_tests.py 5: apply a unidiff patch with -p1
FAIL:  prop_tests.py 3: receive properties via update
FAIL:  prop_tests.py 4: receive property changes as part of a downdate
FAIL:  prop_tests.py 6: update with conflicting props
FAIL:  prop_tests.py 8: props work when committing a replacement
FAIL:  prop_tests.py 9: props work when reverting a replacement
FAIL:  prop_tests.py 14: test binary property support
FAIL:  prop_tests.py 15: recursive property operations in BASE and WC
FAIL:  prop_tests.py 24: remove a property with a custom namespace
FAIL:  resolve_tests.py 1: resolve -R --accept [base | mf | tf]
FAIL:  resolved_tests.py 1: resolved on working copy root
FAIL:  resolved_tests.py 2: resolved on deleted item
FAIL:  resolved_tests.py 3: resolve to 'theirs-conflict' in sub-directory
FAIL:  revert_tests.py 1: revert relative to wc root
FAIL:  revert_tests.py 2: revert reexpands manually contracted keyword
FAIL:  revert_tests.py 3: revert a replaced file with no properties
FAIL:  revert_tests.py 5: revert svn cp PATH PATH replace file with props
FAIL:  revert_tests.py 6: revert a merge replacement of file with history
FAIL:  revert_tests.py 7: revert svn cp URL PATH replace file with props
FAIL:  revert_tests.py 8: revert file after second replace
FAIL:  revert_tests.py 9: revert after manual text-conflict resolution
FAIL:  revert_tests.py 10: revert after manual property-conflict resolution
FAIL:  revert_tests.py 15: revert a committed replace-with-history == no-op
FAIL:  revert_tests.py 18: reverted replace with history restores checksum
FAIL:  revert_tests.py 19: revert tree conflicts in updated files
FAIL:  schedule_tests.py 1: revert: add some files
FAIL:  schedule_tests.py 3: revert: add some nested files and directories
FAIL:  schedule_tests.py 4: revert: add some executable files
FAIL:  schedule_tests.py 7: unschedule addition on missing items
FAIL:  schedule_tests.py 11: 'svn add' should traverse already-versioned dirs
FAIL:  special_tests.py 1: general symlink handling
FAIL:  special_tests.py 4: 'svn cp dir1 dir2' which contains a symlink
FAIL:  special_tests.py 8: merge file into symlink
FAIL:  stat_tests.py 10: status -u indicates out-of-dateness
FAIL:  stat_tests.py 11: status -u on outdated, added file shows only that
FAIL:  stat_tests.py 13: timestamp behaviour
FAIL:  stat_tests.py 15: status -u in partially non-recursive wc
FAIL:  stat_tests.py 17: status output in XML format
FAIL:  stat_tests.py 22: status on conflicted added file
FAIL:  stat_tests.py 23: status with inconsistent eol style
FAIL:  stat_tests.py 26: run 'status -uN' with incoming changes
FAIL:  stat_tests.py 28: run 'status --depth=X' with local changes
FAIL:  stat_tests.py 29: run 'status --depth=X -u' with incoming changes
FAIL:  stat_tests.py 31: status with tree conflicts
FAIL:  svnadmin_tests.py 6: 'svnadmin dump' on modified child of copied dir
FAIL:  svnadmin_tests.py 13: recover a repository (FSFS only)
FAIL:  svnadmin_tests.py 17: fsfs recovery checks missing revs / revprops files
FAIL:  svnlook_tests.py 1: test miscellaneous svnlook features
FAIL:  svnlook_tests.py 5: test --copy-info flag on the changed command
FAIL:  svnlook_tests.py 8: test 'svnlook diff -x -b' and 'svnlook diff -x -w'
FAIL:  svnlook_tests.py 9: test 'svnlook diff -x --ignore-eol-style'
FAIL:  svnlook_tests.py 10: test 'svnlook diff' on binary files
FAIL:  svnsync_tests.py 13: detect non-svnsync commits in destination
FAIL:  svnversion_tests.py 1: test 'svnversion' on files and directories
FAIL:  switch_tests.py 2: commits after some basic switching operations
FAIL:  switch_tests.py 3: update wc that contains switched things
FAIL:  switch_tests.py 4: reverse update wc that contains switched things
FAIL:  switch_tests.py 5: update switched wc things to HEAD
FAIL:  switch_tests.py 6: reverse update switched wc things to an older rev
FAIL:  switch_tests.py 12: anchor=target, try to replace a local-mod file
FAIL:  switch_tests.py 20: forced switch tolerates obstructions to adds
FAIL:  switch_tests.py 22: switch a scheduled-add file
FAIL:  switch_tests.py 23: mergeinfo does not elide post switch
FAIL:  switch_tests.py 24: switch tolerates WC adds
FAIL:  switch_tests.py 26: switch to dir@peg where dir doesn't exist in HEAD
FAIL:  switch_tests.py 28: switch to old rev of now renamed branch
FAIL:  switch_tests.py 31: tree conflicts 1.1: tree del, leaf edit on switch
FAIL:  switch_tests.py 33: tree conflicts 2.1: leaf edit, tree del on switch
FAIL:  trans_tests.py 1: commit new files with keywords active from birth
FAIL:  trans_tests.py 2: update modified file with eol-style 'native'
FAIL:  trans_tests.py 3: committing eol-style change forces text send
FAIL:  trans_tests.py 5: keyword expanded on cat
FAIL:  trans_tests.py 6: copy, propset svn:eol-style, commit
FAIL:  trans_tests.py 7: propset, commit, check out into another wc
FAIL:  trans_tests.py 8: propset, revert
FAIL:  tree_conflict_tests.py 1: up/sw file: modify onto del/rpl/mv
FAIL:  tree_conflict_tests.py 2: up/sw file: del/rpl/mv onto modify
FAIL:  tree_conflict_tests.py 3: up/sw file: del/rpl/mv onto del/rpl/mv
FAIL:  tree_conflict_tests.py 4: up/sw file: add onto add
FAIL:  tree_conflict_tests.py 9: merge file: modify onto not-file
FAIL:  tree_conflict_tests.py 10: merge file: del/rpl/mv onto not-same
FAIL:  tree_conflict_tests.py 11: merge file: del/rpl/mv onto not-file
FAIL:  tree_conflict_tests.py 12: merge file: add onto not-none
FAIL:  update_tests.py 1: update a locally-modified binary file
FAIL:  update_tests.py 2: update to an old revision of a binary files
FAIL:  update_tests.py 3: update should not munge adds or replaces
FAIL:  update_tests.py 5: overlapping identical changes should not conflict
FAIL:  update_tests.py 6: delete files and update to resolve text conflicts
FAIL:  update_tests.py 7: update that deletes modified files
FAIL:  update_tests.py 8: update after add/rm of deleted state
FAIL:  update_tests.py 11: update with explicit file target
FAIL:  update_tests.py 18: non-recursive update
FAIL:  update_tests.py 27: conflict markers should match the file's eol style
FAIL:  update_tests.py 28: handle eol-style propchange during update
FAIL:  update_tests.py 29: update schedule-add copy of old rev
FAIL:  update_tests.py 30: forced update tolerates obstructions to adds
FAIL:  update_tests.py 33: update wc containing a replaced-with-history file
FAIL:  update_tests.py 34: update handles obstructing paths scheduled for add
FAIL:  update_tests.py 35: update conflicted files
FAIL:  update_tests.py 36: mergeinfo does not elide after update
FAIL:  update_tests.py 37: update should make use of copyfrom args
FAIL:  update_tests.py 38: update degrades well if copyfrom_path unavailable
FAIL:  update_tests.py 39: update uses copyfrom & accepts further txdeltas
FAIL:  update_tests.py 40: update chooses right copyfrom for double move
FAIL:  update_tests.py 41: updating a copied file with a deleted property
FAIL:  update_tests.py 42: update --accept automatic conflict resolution
FAIL:  update_tests.py 43: eof in interactive resolution can't break wc
FAIL:  update_tests.py 46: tree conflicts 1.1: tree del, leaf edit on update
FAIL:  update_tests.py 48: tree conflicts 2.1: leaf edit, tree del on update
FAIL:  update_tests.py 52: update moves and modifies a file with edits
FAIL:  update_tests.py 53: tree conflicts on update UC1, update deleted tree
FAIL:  update_tests.py 54: tree conflicts on update UC2, schedule re-add
Summary of test results:
  733 tests PASSED
  27 tests SKIPPED
  43 tests XFAILED (3 WORK-IN-PROGRESS)
  433 tests FAILED
make: *** [check] Error 1
Generating junit files ...
Recording test results


Mime
View raw message