subversion-notifications mailing list archives

Site index · List index
Message view « Date » · « Thread »
Top « Date » · « Thread »
From Apache Hudson Server <hud...@hudson.zones.apache.org>
Subject Build failed in Hudson: subversion-trunk-solaris #1103
Date Fri, 11 Jun 2010 12:19:01 GMT
See <http://hudson.zones.apache.org/hudson/job/subversion-trunk-solaris/1103/changes>

Changes:

[hwright] JavaHL: Allow the File C++ proxy object to do path internalization.

[ in subversion/bindings/javahl/ ]
* native/SVNAdmin.cpp
  (create): Update to take File params, and use them appropriately.

* native/org_apache_subversion_javahl_SVNAdmin.cpp
  (Java_org_apache_subversion_javahl_SVNAdmin_create): Update call to
    SVNAdmin::create.

* native/File.h,
  native/File.cpp
  (getInternalStyle, isNull): New

* native/SVNAdmin.h
  (create): Update API to accept Files.

[rhuijben] * subversion/libsvn_wc/wc_db.c
  (svn_wc__db_temp_op_set_text_conflict_marker_files): Fix offset.
  (svn_wc__db_temp_op_set_property_conflict_marker_file): Fix setting
    parent_relpath to NULL on a working copy root.

Found by: Lunch

[ivan] Fix generating unique temporary file on Windows. Before this change 
temporary files are created in the drive root when caller asked to create 
files in current working directory.

This fixes two failures in svnadmin_tests.py and export_tests.py when 
running test suite on Windows without write access to root directory.

* subversion/libsvn_subr/io.c
  (temp_file_create): Use svn_dirent_join to combine path instead of 
   apr_psprintf().

[rhuijben] * subversion/libsvn_wc/wc-queries.sql
  (STMT_INSERT_ACTUAL_TEXT_CONFLICTS,
   STMT_INSERT_ACTUAL_PROPERTY_CONFLICTS):
     Add parent_relpath and obsolete (copy&pasted) comment.

* subversion/libsvn_wc/wc_db.c
  (svn_wc__db_temp_op_set_text_conflict_marker_files,
   svn_wc__db_temp_op_set_property_conflict_marker_file): Add comment
     on using a transaction and properly set the parent_relpath when
     we add a new record.

Found by: gstein

[hwright] JavaHL: In a place we use a local file path, use a File object instead of a
String.  This will eventually propogate through JavaHL, this commit just
introduces the needed infrastructure, and a sample switch.

[ in subversion/bindings/javahl/ ]
* tests/org/apache/subversion/javahl/SVNTests.java
  (setUp, createInitialRepository): Use the File directly in the updated API.

* native/org_apache_subversion_javahl_SVNAdmin.cpp
  (Java_org_apache_subversion_javahl_SVNAdmin_create): Update for the new
    File arguments.

* native/File.h:
  New.

* native/File.cpp:
  New.

* src/org/apache/subversion/javahl/ISVNAdmin.java,
  src/org/apache/subversion/javahl/SVNAdmin.java
  (create): Use a File where we want a local path.

* src/org/tigris/subversion/javahl/SVNAdmin.java
  (create): Update the compat wrapper.

[rhuijben] * subversion/libsvn_wc/merge.c
  (preserve_pre_merge_files): Complete temporary pool renaming work and
    fix a pool lifetime issue reintroduced in r953617. Also switch to
    just taking the basename in a few cases.

Suggested by: gstein

[rhuijben] Following up on r953617, remove the support of setting the conflict marker
file locations via entry modify.

* subversion/libsvn_wc/entries.c
  (fold_entry): Remove conflict marker handling.

* subversion/libsvn_wc/entries.h
  (SVN_WC__ENTRY_ATTR_CONFLICT_OLD,
   SVN_WC__ENTRY_ATTR_CONFLICT_NEW,
   SVN_WC__ENTRY_ATTR_CONFLICT_WRK,
   SVN_WC__ENTRY_ATTR_PREJFILE): Move to old-and-busted.c
  (SVN_WC__ENTRY_MODIFY_CONFLICT_OLD,
   SVN_WC__ENTRY_MODIFY_CONFLICT_NEW,
   SVN_WC__ENTRY_MODIFY_CONFLICT_WRK,
   SVN_WC__ENTRY_MODIFY_PREJFILE): Remove defines.

* subversion/libsvn_wc/old-and-busted.c
  (ENTRIES_ATTR_CONFLICT_OLD, ENTRIES_ATTR_CONFLICT_NEW,
   ENTRIES_ATTR_CONFLICT_WRK, ENTRIES_ATTR_PREJFILE):
     New defines based on values in entries.h
  (extract_string_normalize): Remove unused modify flags support.
  (atts_to_entry): Remove modify flags support, use new defines and
    update caller.
  (handle_start_tag): Update caller.

[rhuijben] Remove the loggy entry modification system as it is no longer being used.
since r953617.

* subversion/libsvn_wc/entries.h
  (svn_wc__atts_to_entry): Remove function from public view.

* subversion/libsvn_wc/log.c
  (SVN_WC__LOG_MODIFY_ENTRY): Remove define.
  (log_do_modify_entry): Remove function.
  (start_handler): Remove modify entry support.
  (svn_wc__loggy_entry_modify): Remove function.

* subversion/libsvn_wc/log.h
  (svn_wc__loggy_entry_modify): Remove function.

* subversion/libsvn_wc/old-and-busted.c
  (svn_wc__atts_to_entry): Rename function to ...
  (atts_to_entry): ... this and make static.
  (handle_start_tag): Update caller.

[philip] * subversion/libsvn_wc/props.c (svn_wc__merge_props): Remove unused variable.

[rhuijben] Update the installing of the location of conflict markers to use a
temporary working queue operation and wc-db operations instead of
loggy entry modify.

This removes the last entry modify operations and the last entry
write operations on text/property conflict data. This support will
be removed in a few follow up commits.

* subversion/libsvn_wc/merge.c
  (preserve_pre_merge_files,
   merge_binary_file): Use new wq operation instead of loggy entry modify.

* subversion/libsvn_wc/props.c
  (svn_wc__merge_props): Use new wq operation instead of loggy entry modify.

* subversion/libsvn_wc/wc-queries.sql
  (STMT_UPDATE_ACTUAL_TEXT_CONFLICTS, STMT_INSERT_ACTUAL_TEXT_CONFLICTS,
   STMT_UPDATE_ACTUAL_PROPERTY_CONFLICTS,
   STMT_INSERT_ACTUAL_PROPERTY_CONFLICTS): New statements.

* subversion/libsvn_wc/wc_db.c
  (svn_wc__db_temp_op_set_text_conflict_marker_files,
   svn_wc__db_temp_op_set_property_conflict_marker_file): New functions.

* subversion/libsvn_wc/wc_db.h
  (svn_wc__db_temp_op_set_text_conflict_marker_files,
   svn_wc__db_temp_op_set_property_conflict_marker_file): New functions.

* subversion/libsvn_wc/workqueue.c
  (OP_TMP_SET_TEXT_CONFLICT_MARKERS, OP_TMP_SET_PROPERTY_CONFLICT_MARKER):
    New defines.
  (run_set_text_conflict_markers,
   svn_wc__wq_tmp_build_set_text_conflict_markers,
   run_set_property_conflict_marker,
   svn_wc__wq_tmp_build_set_property_conflict_marker): New functions.
  (dispatch_table): Add new wq operations.

* subversion/libsvn_wc/workqueue.h
  (svn_wc__wq_tmp_build_set_text_conflict_markers,
   svn_wc__wq_tmp_build_set_property_conflict_marker): New functions.

------------------------------------------
[...truncated 6607 lines...]
subversion/tests/libsvn_subr/translate-test.c:1318: warning: (near initialization for `test_funcs[20].wip')
subversion/tests/libsvn_subr/translate-test.c:1320: warning: missing initializer
subversion/tests/libsvn_subr/translate-test.c:1320: warning: (near initialization for `test_funcs[21].wip')
subversion/tests/libsvn_subr/translate-test.c:1323: warning: missing initializer
subversion/tests/libsvn_subr/translate-test.c:1323: warning: (near initialization for `test_funcs[22].wip')
subversion/tests/libsvn_subr/translate-test.c:1325: warning: missing initializer
subversion/tests/libsvn_subr/translate-test.c:1325: warning: (near initialization for `test_funcs[23].wip')
subversion/tests/libsvn_subr/translate-test.c:1327: warning: missing initializer
subversion/tests/libsvn_subr/translate-test.c:1327: warning: (near initialization for `test_funcs[24].wip')
subversion/tests/libsvn_subr/translate-test.c:1329: warning: missing initializer
subversion/tests/libsvn_subr/translate-test.c:1329: warning: (near initialization for `test_funcs[25].wip')
subversion/tests/libsvn_subr/translate-test.c:1331: warning: missing initializer
subversion/tests/libsvn_subr/translate-test.c:1331: warning: (near initialization for `test_funcs[26].wip')
subversion/tests/libsvn_subr/translate-test.c:1333: warning: missing initializer
subversion/tests/libsvn_subr/translate-test.c:1333: warning: (near initialization for `test_funcs[27].wip')
subversion/tests/libsvn_subr/translate-test.c:1336: warning: missing initializer
subversion/tests/libsvn_subr/translate-test.c:1336: warning: (near initialization for `test_funcs[28].wip')
subversion/tests/libsvn_subr/translate-test.c:1338: warning: missing initializer
subversion/tests/libsvn_subr/translate-test.c:1338: warning: (near initialization for `test_funcs[29].wip')
subversion/tests/libsvn_subr/translate-test.c:1340: warning: missing initializer
subversion/tests/libsvn_subr/translate-test.c:1340: warning: (near initialization for `test_funcs[30].wip')
subversion/tests/libsvn_subr/translate-test.c:1342: warning: missing initializer
subversion/tests/libsvn_subr/translate-test.c:1342: warning: (near initialization for `test_funcs[31].wip')
subversion/tests/libsvn_subr/translate-test.c:1344: warning: missing initializer
subversion/tests/libsvn_subr/translate-test.c:1344: warning: (near initialization for `test_funcs[32].wip')
subversion/tests/libsvn_subr/translate-test.c:1346: warning: missing initializer
subversion/tests/libsvn_subr/translate-test.c:1346: warning: (near initialization for `test_funcs[33].wip')
subversion/tests/libsvn_subr/translate-test.c:1348: warning: missing initializer
subversion/tests/libsvn_subr/translate-test.c:1348: warning: (near initialization for `test_funcs[34].wip')
subversion/tests/libsvn_subr/translate-test.c:1351: warning: missing initializer
subversion/tests/libsvn_subr/translate-test.c:1351: warning: (near initialization for `test_funcs[35].wip')
subversion/tests/libsvn_subr/translate-test.c:1353: warning: missing initializer
subversion/tests/libsvn_subr/translate-test.c:1353: warning: (near initialization for `test_funcs[36].wip')
subversion/tests/libsvn_subr/translate-test.c:1355: warning: missing initializer
subversion/tests/libsvn_subr/translate-test.c:1355: warning: (near initialization for `test_funcs[37].wip')
subversion/tests/libsvn_subr/translate-test.c:1357: warning: missing initializer
subversion/tests/libsvn_subr/translate-test.c:1357: warning: (near initialization for `test_funcs[38].wip')
subversion/tests/libsvn_subr/translate-test.c:1359: warning: missing initializer
subversion/tests/libsvn_subr/translate-test.c:1359: warning: (near initialization for `test_funcs[39].wip')
subversion/tests/libsvn_subr/translate-test.c:1361: warning: missing initializer
subversion/tests/libsvn_subr/translate-test.c:1361: warning: (near initialization for `test_funcs[40].wip')
subversion/tests/libsvn_subr/translate-test.c:1363: warning: missing initializer
subversion/tests/libsvn_subr/translate-test.c:1363: warning: (near initialization for `test_funcs[41].func2')
cd subversion/tests/libsvn_subr && /opt/sfw/bin/libtool --tag=CC --silent --mode=link
gcc -static -Wold-style-definition -Wextra-tokens -Wdeclaration-after-statement -Wpointer-arith
-Wwrite-strings -Wshadow -ansi -Wall -Wformat=2 -Wunused -Waggregate-return -Wstrict-prototypes
-Wmissing-prototypes -Wmissing-declarations -Wno-multichar -Wredundant-decls -Wnested-externs
-Wunreachable-code -Winline -Wno-long-long -g -g  -DSVN_DEBUG -DAP_DEBUG   -rpath /usr/local/lib
 -o translate-test  translate-test.lo ../../../subversion/tests/libsvn_test-1.la ../../../subversion/libsvn_subr/libsvn_subr-1.la
-L/opt/subversion-current/apr-util-1.3.9 -laprutil-1 -L/opt/subversion-current/apr -lapr-1
-lsocket
/opt/sfw/bin/libtool --tag=CC --silent --mode=compile gcc -DSOLARIS2=10 -D_POSIX_PTHREAD_SEMANTICS
-D_REENTRANT -D_LARGEFILE64_SOURCE  -Wold-style-definition -Wextra-tokens -Wdeclaration-after-statement
-Wpointer-arith -Wwrite-strings -Wshadow -ansi -Wall -Wformat=2 -Wunused -Waggregate-return
-Wstrict-prototypes -Wmissing-prototypes -Wmissing-declarations -Wno-multichar -Wredundant-decls
-Wnested-externs -Wunreachable-code -Winline -Wno-long-long -g -g  -DSVN_DEBUG -DAP_DEBUG
 -I./subversion/include -I./subversion  -I/opt/subversion-current/apr/include   -I/opt/subversion-current/apr-util-1.3.9/include
     -I/opt/subversion-current/sqlite-3.6.23.1 -static -o subversion/tests/libsvn_wc/tree-conflict-data-test.lo
-c subversion/tests/libsvn_wc/tree-conflict-data-test.c
subversion/tests/libsvn_wc/tree-conflict-data-test.c:380: warning: missing initializer
subversion/tests/libsvn_wc/tree-conflict-data-test.c:380: warning: (near initialization for
`test_funcs[0].func2')
subversion/tests/libsvn_wc/tree-conflict-data-test.c:381: warning: missing initializer
subversion/tests/libsvn_wc/tree-conflict-data-test.c:381: warning: (near initialization for
`test_funcs[1].wip')
subversion/tests/libsvn_wc/tree-conflict-data-test.c:383: warning: missing initializer
subversion/tests/libsvn_wc/tree-conflict-data-test.c:383: warning: (near initialization for
`test_funcs[2].wip')
subversion/tests/libsvn_wc/tree-conflict-data-test.c:385: warning: missing initializer
subversion/tests/libsvn_wc/tree-conflict-data-test.c:385: warning: (near initialization for
`test_funcs[3].wip')
subversion/tests/libsvn_wc/tree-conflict-data-test.c:387: warning: missing initializer
subversion/tests/libsvn_wc/tree-conflict-data-test.c:387: warning: (near initialization for
`test_funcs[4].wip')
subversion/tests/libsvn_wc/tree-conflict-data-test.c:389: warning: missing initializer
subversion/tests/libsvn_wc/tree-conflict-data-test.c:389: warning: (near initialization for
`test_funcs[5].wip')
subversion/tests/libsvn_wc/tree-conflict-data-test.c:395: warning: missing initializer
subversion/tests/libsvn_wc/tree-conflict-data-test.c:395: warning: (near initialization for
`test_funcs[6].func2')
cd subversion/tests/libsvn_wc && /opt/sfw/bin/libtool --tag=CC --silent --mode=link
gcc -static -Wold-style-definition -Wextra-tokens -Wdeclaration-after-statement -Wpointer-arith
-Wwrite-strings -Wshadow -ansi -Wall -Wformat=2 -Wunused -Waggregate-return -Wstrict-prototypes
-Wmissing-prototypes -Wmissing-declarations -Wno-multichar -Wredundant-decls -Wnested-externs
-Wunreachable-code -Winline -Wno-long-long -g -g  -DSVN_DEBUG -DAP_DEBUG   -rpath /usr/local/lib
 -o tree-conflict-data-test  tree-conflict-data-test.lo ../../../subversion/tests/libsvn_test-1.la
../../../subversion/libsvn_wc/libsvn_wc-1.la ../../../subversion/libsvn_subr/libsvn_subr-1.la
-L/opt/subversion-current/apr-util-1.3.9 -laprutil-1 -L/opt/subversion-current/apr -lapr-1
-lsocket
/opt/sfw/bin/libtool --tag=CC --silent --mode=compile gcc -DSOLARIS2=10 -D_POSIX_PTHREAD_SEMANTICS
-D_REENTRANT -D_LARGEFILE64_SOURCE  -Wold-style-definition -Wextra-tokens -Wdeclaration-after-statement
-Wpointer-arith -Wwrite-strings -Wshadow -ansi -Wall -Wformat=2 -Wunused -Waggregate-return
-Wstrict-prototypes -Wmissing-prototypes -Wmissing-declarations -Wno-multichar -Wredundant-decls
-Wnested-externs -Wunreachable-code -Winline -Wno-long-long -g -g  -DSVN_DEBUG -DAP_DEBUG
 -I./subversion/include -I./subversion  -I/opt/subversion-current/apr/include   -I/opt/subversion-current/apr-util-1.3.9/include
     -I/opt/subversion-current/sqlite-3.6.23.1 -static -o subversion/tests/libsvn_subr/utf-test.lo
-c subversion/tests/libsvn_subr/utf-test.c
subversion/tests/libsvn_subr/utf-test.c: In function `utf_validate':
subversion/tests/libsvn_subr/utf-test.c:150: warning: missing initializer
subversion/tests/libsvn_subr/utf-test.c:150: warning: (near initialization for `tests[67].string')
subversion/tests/libsvn_subr/utf-test.c: At top level:
subversion/tests/libsvn_subr/utf-test.c:62: warning: unused parameter 'pool'
subversion/tests/libsvn_subr/utf-test.c:180: warning: unused parameter 'pool'
subversion/tests/libsvn_subr/utf-test.c:302: warning: missing initializer
subversion/tests/libsvn_subr/utf-test.c:302: warning: (near initialization for `test_funcs[0].func2')
subversion/tests/libsvn_subr/utf-test.c:303: warning: missing initializer
subversion/tests/libsvn_subr/utf-test.c:303: warning: (near initialization for `test_funcs[1].wip')
subversion/tests/libsvn_subr/utf-test.c:305: warning: missing initializer
subversion/tests/libsvn_subr/utf-test.c:305: warning: (near initialization for `test_funcs[2].wip')
subversion/tests/libsvn_subr/utf-test.c:307: warning: missing initializer
subversion/tests/libsvn_subr/utf-test.c:307: warning: (near initialization for `test_funcs[3].wip')
subversion/tests/libsvn_subr/utf-test.c:309: warning: missing initializer
subversion/tests/libsvn_subr/utf-test.c:309: warning: (near initialization for `test_funcs[4].wip')
subversion/tests/libsvn_subr/utf-test.c:311: warning: missing initializer
subversion/tests/libsvn_subr/utf-test.c:311: warning: (near initialization for `test_funcs[5].func2')
cd subversion/tests/libsvn_subr && /opt/sfw/bin/libtool --tag=CC --silent --mode=link
gcc -static -Wold-style-definition -Wextra-tokens -Wdeclaration-after-statement -Wpointer-arith
-Wwrite-strings -Wshadow -ansi -Wall -Wformat=2 -Wunused -Waggregate-return -Wstrict-prototypes
-Wmissing-prototypes -Wmissing-declarations -Wno-multichar -Wredundant-decls -Wnested-externs
-Wunreachable-code -Winline -Wno-long-long -g -g  -DSVN_DEBUG -DAP_DEBUG   -rpath /usr/local/lib
 -o utf-test  utf-test.lo ../../../subversion/tests/libsvn_test-1.la ../../../subversion/libsvn_subr/libsvn_subr-1.la
-L/opt/subversion-current/apr-util-1.3.9 -laprutil-1 -L/opt/subversion-current/apr -lapr-1
-lsocket
/opt/sfw/bin/libtool --tag=CC --silent --mode=compile gcc -DSOLARIS2=10 -D_POSIX_PTHREAD_SEMANTICS
-D_REENTRANT -D_LARGEFILE64_SOURCE  -Wold-style-definition -Wextra-tokens -Wdeclaration-after-statement
-Wpointer-arith -Wwrite-strings -Wshadow -ansi -Wall -Wformat=2 -Wunused -Waggregate-return
-Wstrict-prototypes -Wmissing-prototypes -Wmissing-declarations -Wno-multichar -Wredundant-decls
-Wnested-externs -Wunreachable-code -Winline -Wno-long-long -g -g  -DSVN_DEBUG -DAP_DEBUG
 -I./subversion/include -I./subversion  -I/opt/subversion-current/apr/include   -I/opt/subversion-current/apr-util-1.3.9/include
     -I/opt/subversion-current/sqlite-3.6.23.1 -static -o subversion/tests/libsvn_delta/vdelta-test.lo
-c subversion/tests/libsvn_delta/vdelta-test.c
cd subversion/tests/libsvn_delta && /opt/sfw/bin/libtool --tag=CC --silent --mode=link
gcc -static -Wold-style-definition -Wextra-tokens -Wdeclaration-after-statement -Wpointer-arith
-Wwrite-strings -Wshadow -ansi -Wall -Wformat=2 -Wunused -Waggregate-return -Wstrict-prototypes
-Wmissing-prototypes -Wmissing-declarations -Wno-multichar -Wredundant-decls -Wnested-externs
-Wunreachable-code -Winline -Wno-long-long -g -g  -DSVN_DEBUG -DAP_DEBUG   -rpath /usr/local/lib
 -o vdelta-test  vdelta-test.lo ../../../subversion/libsvn_delta/libsvn_delta-1.la ../../../subversion/libsvn_subr/libsvn_subr-1.la
-L/opt/subversion-current/apr-util-1.3.9 -laprutil-1 -L/opt/subversion-current/apr -lapr-1
-lsocket
/opt/sfw/bin/libtool --tag=CC --silent --mode=compile gcc -DSOLARIS2=10 -D_POSIX_PTHREAD_SEMANTICS
-D_REENTRANT -D_LARGEFILE64_SOURCE  -Wold-style-definition -Wextra-tokens -Wdeclaration-after-statement
-Wpointer-arith -Wwrite-strings -Wshadow -ansi -Wall -Wformat=2 -Wunused -Waggregate-return
-Wstrict-prototypes -Wmissing-prototypes -Wmissing-declarations -Wno-multichar -Wredundant-decls
-Wnested-externs -Wunreachable-code -Winline -Wno-long-long -g -g  -DSVN_DEBUG -DAP_DEBUG
 -I./subversion/include -I./subversion  -I/opt/subversion-current/apr/include   -I/opt/subversion-current/apr-util-1.3.9/include
     -I/opt/subversion-current/sqlite-3.6.23.1 -static -o subversion/tests/libsvn_delta/window-test.lo
-c subversion/tests/libsvn_delta/window-test.c
subversion/tests/libsvn_delta/window-test.c:104: warning: missing initializer
subversion/tests/libsvn_delta/window-test.c:104: warning: (near initialization for `test_funcs[0].func2')
subversion/tests/libsvn_delta/window-test.c:105: warning: missing initializer
subversion/tests/libsvn_delta/window-test.c:105: warning: (near initialization for `test_funcs[1].wip')
subversion/tests/libsvn_delta/window-test.c:107: warning: missing initializer
subversion/tests/libsvn_delta/window-test.c:107: warning: (near initialization for `test_funcs[2].func2')
cd subversion/tests/libsvn_delta && /opt/sfw/bin/libtool --tag=CC --silent --mode=link
gcc -static -Wold-style-definition -Wextra-tokens -Wdeclaration-after-statement -Wpointer-arith
-Wwrite-strings -Wshadow -ansi -Wall -Wformat=2 -Wunused -Waggregate-return -Wstrict-prototypes
-Wmissing-prototypes -Wmissing-declarations -Wno-multichar -Wredundant-decls -Wnested-externs
-Wunreachable-code -Winline -Wno-long-long -g -g  -DSVN_DEBUG -DAP_DEBUG   -rpath /usr/local/lib
 -o window-test  window-test.lo ../../../subversion/tests/libsvn_test-1.la ../../../subversion/libsvn_delta/libsvn_delta-1.la
../../../subversion/libsvn_subr/libsvn_subr-1.la -L/opt/subversion-current/apr-util-1.3.9
-laprutil-1 -L/opt/subversion-current/apr -lapr-1 -lsocket
/usr/bin/msgfmt  -o subversion/po/de.mo subversion/po/de.po
/usr/bin/msgfmt  -o subversion/po/es.mo subversion/po/es.po
/usr/bin/msgfmt  -o subversion/po/fr.mo subversion/po/fr.po
/usr/bin/msgfmt  -o subversion/po/it.mo subversion/po/it.po
/usr/bin/msgfmt  -o subversion/po/ja.mo subversion/po/ja.po
/usr/bin/msgfmt  -o subversion/po/ko.mo subversion/po/ko.po
/usr/bin/msgfmt  -o subversion/po/nb.mo subversion/po/nb.po
/usr/bin/msgfmt  -o subversion/po/pl.mo subversion/po/pl.po
/usr/bin/msgfmt  -o subversion/po/pt_BR.mo subversion/po/pt_BR.po
/usr/bin/msgfmt  -o subversion/po/sv.mo subversion/po/sv.po
/usr/bin/msgfmt  -o subversion/po/zh_CN.mo subversion/po/zh_CN.po
/usr/bin/msgfmt  -o subversion/po/zh_TW.mo subversion/po/zh_TW.po
[subversion-trunk-solaris] $ /bin/bash /var/tmp/hudson6594569429538441471.sh
Running tests in auth-test [1/79]........................success
Running tests in cache-test [2/79].......................success
Running tests in checksum-test [3/79]....................success
Running tests in client-test [4/79]......................success
Running tests in compat-test [5/79]......................success
Running tests in config-test [6/79]......................success
Running tests in db-test [7/79]..........................FAILURE
Running tests in diff-diff3-test [8/79]..................success
Running tests in dirent_uri-test [9/79]..................success
Running tests in entries-compat-test [10/79].............success
Running tests in eol-test [11/79]........................success
Running tests in error-test [12/79]......................success
Running tests in fs-pack-test [13/79]....................success
Running tests in fs-test [14/79].........................success
Running tests in hashdump-test [15/79]...................success
Running tests in locks-test [16/79]......................success
Running tests in mergeinfo-test [17/79]..................success
Running tests in opt-test [18/79]........................success
Running tests in parse-diff-test [19/79].................success
Running tests in path-test [20/79].......................success
Running tests in pristine-store-test [21/79].............success
Running tests in ra-local-test [22/79]...................success
Running tests in random-test [23/79].....................success
Running tests in repos-test [24/79]......................success
Running tests in revision-test [25/79]...................success
Running tests in skel-test [26/79].......................success
Running tests in stream-test [27/79].....................success
Running tests in string-test [28/79].....................success
Running tests in target-test [29/79].....................success
Running tests in time-test [30/79].......................success
Running tests in translate-test [31/79]..................success
Running tests in tree-conflict-data-test [32/79].........success
Running tests in utf-test [33/79]........................success
Running tests in window-test [34/79].....................success
Running tests in authz_tests.py [35/79]..................success
Running tests in autoprop_tests.py [36/79]...............success
Running tests in basic_tests.py [37/79]..................success
Running tests in blame_tests.py [38/79]..................success
Running tests in cat_tests.py [39/79]....................success
Running tests in changelist_tests.py [40/79].............success
Running tests in checkout_tests.py [41/79]...............success
Running tests in commit_tests.py [42/79].................success
Running tests in copy_tests.py [43/79]...................success
Running tests in depth_tests.py [44/79]..................success
Running tests in diff_tests.py [45/79]...................success
Running tests in entries_tests.py [46/79]................success
Running tests in export_tests.py [47/79].................success
Running tests in externals_tests.py [48/79]..............success
Running tests in getopt_tests.py [49/79].................success
Running tests in history_tests.py [50/79]................success
Running tests in import_tests.py [51/79].................success
Running tests in info_tests.py [52/79]...................success
Running tests in lock_tests.py [53/79]...................success
Running tests in log_tests.py [54/79]....................success
Running tests in merge_authz_tests.py [55/79]............success
Running tests in merge_reintegrate_tests.py [56/79]......success
Running tests in merge_tests.py [57/79]..................success
Running tests in merge_tree_conflict_tests.py [58/79]....success
Running tests in mergeinfo_tests.py [59/79]..............success
Running tests in obliterate_tests.py [60/79].............success
Running tests in patch_tests.py [61/79]..................success
Running tests in prop_tests.py [62/79]...................success
Running tests in resolve_tests.py [63/79]................success
Running tests in resolved_tests.py [64/79]...............success
Running tests in revert_tests.py [65/79].................success
Running tests in schedule_tests.py [66/79]...............success
Running tests in special_tests.py [67/79]................success
Running tests in stat_tests.py [68/79]...................success
Running tests in svnadmin_tests.py [69/79]...............success
Running tests in svndumpfilter_tests.py [70/79]..........success
Running tests in svnlook_tests.py [71/79]................success
Running tests in svnsync_tests.py [72/79]................success
Running tests in svnversion_tests.py [73/79].............success
Running tests in switch_tests.py [74/79].................success
Running tests in trans_tests.py [75/79]..................success
Running tests in tree_conflict_tests.py [76/79]..........success
Running tests in update_tests.py [77/79].................success
Running tests in upgrade_tests.py [78/79]................success
Running tests in utf8_tests.py [79/79]...................success
At least one test was SKIPPED, checking <http://hudson.zones.apache.org/hudson/job/subversion-trunk-solaris/ws/subversion-trunk/tests.log>
SKIP:  cache-test 2: basic memcache svn_cache test
SKIP:  cache-test 3: memcache svn_cache with very long keys
At least one test XFAILED, checking <http://hudson.zones.apache.org/hudson/job/subversion-trunk-solaris/ws/subversion-trunk/tests.log>
XFAIL: fs-test 18: merging commit
       [[needs to be written to match new merge() algorithm expectations]]
XFAIL: fs-test 36: obliterate 1
       [[obliterate is in development]]
XFAIL: locks-test 9: able to reserve a name (lock non-existent path)
XFAIL: locks-test 10: directory locks (kinda)
XFAIL: parse-diff-test 2: test git unidiff parsing
XFAIL: stream-test 10: test stream seeking for translated streams
XFAIL: tree-conflict-data-test 3: detect broken tree conflict data
At least one test FAILED, checking <http://hudson.zones.apache.org/hudson/job/subversion-trunk-solaris/ws/subversion-trunk/tests.log>
FAIL:  db-test 8: relocating a node
Summary of test results:
  290 tests PASSED
  2 tests SKIPPED
  7 tests XFAILED (2 WORK-IN-PROGRESS)
  1 test FAILED
*** Error code 1
The following command caused the error:
if test "/usr/bin/python" != "none"; then                                 \
  flags="--verbose";                                                 \
  if test "" != ""; then                                   \
    flags="--cleanup $flags";                                       \
  fi;                                                                \
  if test "" != ""; then                                  \
    flags="--url  $flags";                               \
  fi;                                                                \
  if test "" != ""; then                                   \
    flags="--fs-type  $flags";                            \
  fi;                                                                \
  if test "" != ""; then                              \
    flags="--http-library  $flags";                  \
  fi;                                                                \
  if test "" != ""; then                      \
    flags="--server-minor-version  $flags";  \
  fi;                                                                \
  if test "" != ""; then                               \
    flags="--enable-sasl $flags";                                   \
  fi;                                                                \
  if test "" != ""; then                             \
    flags="--fsfs-sharding  $flags";                \
  fi;                                                                \
  if test "" != ""; then                              \
    flags="--fsfs-packing $flags";                                  \
  fi;                                                                \
  if test "" != ""; then                                  \
    flags="--parallel $flags";                                      \
  fi;                                                                \
  if test "" != ""; then                             \
    flags="--log-to-stdout $flags";                                 \
  fi;                                                                \
  /usr/bin/python ./build/run_tests.py                         \
            --config-file ./subversion/tests/tests.conf  \
            $flags                                                  \
            '<http://hudson.zones.apache.org/hudson/job/subversion-trunk-solaris/ws/subversion-trunk'>
'<http://hudson.zones.apache.org/hudson/job/subversion-trunk-solaris/ws/subversion-trunk'>
subversion/tests/libsvn_subr/auth-test subversion/tests/libsvn_subr/cache-test subversion/tests/libsvn_subr/checksum-test
subversion/tests/libsvn_client/client-test subversion/tests/libsvn_subr/compat-test subversion/tests/libsvn_subr/config-test
subversion/tests/libsvn_wc/db-test subversion/tests/libsvn_diff/diff-diff3-test subversion/tests/libsvn_subr/dirent_uri-test
subversion/tests/libsvn_wc/entries-compat-test subversion/tests/libsvn_subr/eol-test subversion/tests/libsvn_subr/error-test
subversion/tests/libsvn_fs_fs/fs-pack-test subversion/tests/libsvn_fs/fs-test subversion/tests/libsvn_subr/hashdump-test
subversion/tests/libsvn_fs/locks-test subversion/tests/libsvn_subr/mergeinfo-test subversion/tests/libsvn_subr/opt-test
subversion/tests/libsvn_diff/parse-diff-test subversion/tests/libsvn_subr/path-test subversion/tests/libsvn_wc/pristine-store-test
subversion/tests/libsvn_ra_local/ra-local-test subversion/tests/libsvn_delta/random-test subversion/tests/libsvn_repos/repos-test
subversion/tests/libsvn_subr/revision-test subversion/tests/libsvn_subr/skel-test subversion/tests/libsvn_subr/stream-test
subversion/tests/libsvn_subr/string-test subversion/tests/libsvn_subr/target-test subversion/tests/libsvn_subr/time-test
subversion/tests/libsvn_subr/translate-test subversion/tests/libsvn_wc/tree-conflict-data-test
subversion/tests/libsvn_subr/utf-test subversion/tests/libsvn_delta/window-test subversion/tests/cmdline/authz_tests.py
subversion/tests/cmdline/autoprop_tests.py subversion/tests/cmdline/basic_tests.py subversion/tests/cmdline/blame_tests.py
subversion/tests/cmdline/cat_tests.py subversion/tests/cmdline/changelist_tests.py subversion/tests/cmdline/checkout_tests.py
subversion/tests/cmdline/commit_tests.py subversion/tests/cmdline/copy_tests.py subversion/tests/cmdline/depth_tests.py
subversion/tests/cmdline/diff_tests.py subversion/tests/cmdline/entries_tests.py subversion/tests/cmdline/export_tests.py
subversion/tests/cmdline/externals_tests.py subversion/tests/cmdline/getopt_tests.py subversion/tests/cmdline/history_tests.py
subversion/tests/cmdline/import_tests.py subversion/tests/cmdline/info_tests.py subversion/tests/cmdline/lock_tests.py
subversion/tests/cmdline/log_tests.py subversion/tests/cmdline/merge_authz_tests.py subversion/tests/cmdline/merge_reintegrate_tests.py
subversion/tests/cmdline/merge_tests.py subversion/tests/cmdline/merge_tree_conflict_tests.py
subversion/tests/cmdline/mergeinfo_tests.py subversion/tests/cmdline/obliterate_tests.py subversion/tests/cmdline/patch_tests.py
subversion/tests/cmdline/prop_tests.py subversion/tests/cmdline/resolve_tests.py subversion/tests/cmdline/resolved_tests.py
subversion/tests/cmdline/revert_tests.py subversion/tests/cmdline/schedule_tests.py subversion/tests/cmdline/special_tests.py
subversion/tests/cmdline/stat_tests.py subversion/tests/cmdline/svnadmin_tests.py subversion/tests/cmdline/svndumpfilter_tests.py
subversion/tests/cmdline/svnlook_tests.py subversion/tests/cmdline/svnsync_tests.py subversion/tests/cmdline/svnversion_tests.py
subversion/tests/cmdline/switch_tests.py subversion/tests/cmdline/trans_tests.py subversion/tests/cmdline/tree_conflict_tests.py
subversion/tests/cmdline/update_tests.py subversion/tests/cmdline/upgrade_tests.py subversion/tests/cmdline/utf8_tests.py;
             \
else                                                                 \
  echo "make check: Python 2.4 or greater is required,";             \
  echo "            but was not detected during configure";          \
  exit 1;                                                            \
fi;
make: Fatal error: Command failed for target `check'
Generating junit files ...
Directory 'build/junit-reports' not exists, creating ...
Recording test results


Mime
View raw message