subversion-users mailing list archives

Site index · List index
Message view « Date » · « Thread »
Top « Date » · « Thread »
From "Bert Huijben" <b...@qqmail.nl>
Subject RE: Subversion 1.8.5 make test failed on wc-tests
Date Thu, 05 Dec 2013 17:56:43 GMT
This looks like a specific instance of an issue documented at:

https://bugzilla.redhat.com/show_bug.cgi?id=985582#c5

 

This specific issue was fixed in r1543145 and backported to 1.8.x (post
1.8.5) in r1544739.

 

                Bert

 

From: CLEYET-MERLE Gilles [mailto:gilles.cleyet-merle@alstom.com] 
Sent: donderdag 5 december 2013 18:40
To: users@subversion.apache.org
Subject: Subversion 1.8.5 make test failed on wc-tests

 

Hello,

 

Make test failed on wc-tests when I build subversion 1.8.5 (see following
logs)
and don't know where is the problem.

 

Thank for your support.

 

Best regards,

 

 

************** Configuration  *****************

 

SUSE SLES 11 SP1

Subversion 1.8.5

 

./configure --with-apr=/busapps/apr/1.5.0/         

--with-apr-util=/busapps/apr-util/1.5.3/                

--with-apxs=/busapps/apache/2.2.22/bin/apxs    

--with-serf=/busapps/serf/1.3.2/                           

--with-sqlite=/busapps/sqlite/3.7.17/                    

--with-zlib=/busapps/zlib/1.2.7/                            

--without-berkeley-db

 

************************************************

 

 

make check TESTS=subversion/tests/cmdline/wc_tests.py

[1/1]
wc_tests.py.................................................................
.................................................FAILURE

At least one test was SKIPPED, checking
/data/bussrc/subversion-1.8.5/tests.log

SKIP:  wc_tests.py 11: missing .svn/wc.db and .svn/entries

At least one test XFAILED, checking /data/bussrc/subversion-1.8.5/tests.log

XFAIL: wc_tests.py 1: file status through unversioned symlink

XFAIL: wc_tests.py 2: file status through versioned symlink

XFAIL: wc_tests.py 3: file status with not-parent symlink

XFAIL: wc_tests.py 4: add file through unversioned symlink

XFAIL: wc_tests.py 5: add file through versioned symlink

XFAIL: wc_tests.py 6: add file with not-parent symlink

At least one test FAILED, checking /data/bussrc/subversion-1.8.5/tests.log

FAIL:  wc_tests.py 7: inaccessible .svn/wc.db

Summary of test results:

  6 tests PASSED

  1 test SKIPPED

  6 tests XFAILED

  1 test FAILED

SUMMARY: Some tests failed.

 

make: *** [check] Error 1

 

more tests.log

START: wc_tests.py

W: Couldn't find node 'wc_tests-1' in actual status tree

W:  * Node name:   wc_tests-1

    Path:       svn-test-work/working_copies/wc_tests-1

    Contents:   None

    Properties: {}

    Attributes: {'status': '  ', 'wc_rev': '1'}

    Children:  None (node is probably a file)

 

W: ACTUAL STATUS TREE:

svntest.wc.State(wc_dir, {})

W: CWD: /data/bussrc/subversion-1.8.5/subversion/tests/cmdline

W: EXCEPTION: SVNTreeUnequal

Traceback (most recent call last):

  File "/bussrc/subversion-1.8.5/subversion/tests/cmdline/svntest/main.py",
line 1550, in run

    rc = self.pred.run(sandbox)

  File
"/bussrc/subversion-1.8.5/subversion/tests/cmdline/svntest/testcase.py",
line 114, in run

    return self._delegate.run(sandbox)

  File
"/bussrc/subversion-1.8.5/subversion/tests/cmdline/svntest/testcase.py",
line 254, in run

    return self._delegate.run(sandbox)

  File
"/bussrc/subversion-1.8.5/subversion/tests/cmdline/svntest/testcase.py",
line 176, in run

    return self.func(sandbox)

  File "/bussrc/subversion-1.8.5/subversion/tests/cmdline/wc_tests.py", line
61, in status_through_unversioned_symlink

    svntest.actions.run_and_verify_status(sbox.ospath('Z/mu'), state)

  File
"/bussrc/subversion-1.8.5/subversion/tests/cmdline/svntest/actions.py", line
1479, in run_and_verify_status

    status_tree.compare_and_display('status', actual_status)

  File "/bussrc/subversion-1.8.5/subversion/tests/cmdline/svntest/wc.py",
line 338, in compare_and_display

    default_singleton_handler('actual ' + label, path, norm_self.desc[path])

  File "/bussrc/subversion-1.8.5/subversion/tests/cmdline/svntest/wc.py",
line 1048, in default_singleton_handler

    raise svntest.tree.SVNTreeUnequal

SVNTreeUnequal

XFAIL: wc_tests.py 1: file status through unversioned symlink

W: Couldn't find node 'wc_tests-2' in actual status tree

W:  * Node name:   wc_tests-2

    Path:       svn-test-work/working_copies/wc_tests-2

    Contents:   None

    Properties: {}

    Attributes: {'status': '  ', 'wc_rev': '1'}

    Children:  None (node is probably a file)

 

W: ACTUAL STATUS TREE:

svntest.wc.State(wc_dir, {})

W: CWD: /data/bussrc/subversion-1.8.5/subversion/tests/cmdline

W: EXCEPTION: SVNTreeUnequal

Traceback (most recent call last):

  File "/bussrc/subversion-1.8.5/subversion/tests/cmdline/svntest/main.py",
line 1550, in run

    rc = self.pred.run(sandbox)

  File
"/bussrc/subversion-1.8.5/subversion/tests/cmdline/svntest/testcase.py",
line 114, in run

    return self._delegate.run(sandbox)

  File
"/bussrc/subversion-1.8.5/subversion/tests/cmdline/svntest/testcase.py",
line 254, in run

    return self._delegate.run(sandbox)

  File
"/bussrc/subversion-1.8.5/subversion/tests/cmdline/svntest/testcase.py",
line 176, in run

    return self.func(sandbox)

  File "/bussrc/subversion-1.8.5/subversion/tests/cmdline/wc_tests.py", line
74, in status_through_versioned_symlink

    svntest.actions.run_and_verify_status(sbox.ospath('Z/mu'), state)

  File
"/bussrc/subversion-1.8.5/subversion/tests/cmdline/svntest/actions.py", line
1479, in run_and_verify_status

    status_tree.compare_and_display('status', actual_status)

  File "/bussrc/subversion-1.8.5/subversion/tests/cmdline/svntest/wc.py",
line 338, in compare_and_display

    default_singleton_handler('actual ' + label, path, norm_self.desc[path])

  File "/bussrc/subversion-1.8.5/subversion/tests/cmdline/svntest/wc.py",
line 1048, in default_singleton_handler

    raise svntest.tree.SVNTreeUnequal

SVNTreeUnequal

XFAIL: wc_tests.py 2: file status through versioned symlink

W: Couldn't find node 'wc_tests-3' in actual status tree

W:  * Node name:   wc_tests-3

    Path:       svn-test-work/working_copies/wc_tests-3

    Contents:   None

    Properties: {}

    Attributes: {'status': '  ', 'wc_rev': '1'}

    Children:  None (node is probably a file)

 

W: ACTUAL STATUS TREE:

svntest.wc.State(wc_dir, {})

W: CWD: /data/bussrc/subversion-1.8.5/subversion/tests/cmdline

W: EXCEPTION: SVNTreeUnequal

Traceback (most recent call last):

  File "/bussrc/subversion-1.8.5/subversion/tests/cmdline/svntest/main.py",
line 1550, in run

    rc = self.pred.run(sandbox)

  File
"/bussrc/subversion-1.8.5/subversion/tests/cmdline/svntest/testcase.py",
line 114, in run

    return self._delegate.run(sandbox)

  File
"/bussrc/subversion-1.8.5/subversion/tests/cmdline/svntest/testcase.py",
line 254, in run

    return self._delegate.run(sandbox)

  File
"/bussrc/subversion-1.8.5/subversion/tests/cmdline/svntest/testcase.py",
line 176, in run

    return self.func(sandbox)

  File "/bussrc/subversion-1.8.5/subversion/tests/cmdline/wc_tests.py", line
85, in status_with_symlink_in_path

    svntest.actions.run_and_verify_status(sbox.ospath('Z/B/lambda'), state)

  File
"/bussrc/subversion-1.8.5/subversion/tests/cmdline/svntest/actions.py", line
1479, in run_and_verify_status

    status_tree.compare_and_display('status', actual_status)

  File "/bussrc/subversion-1.8.5/subversion/tests/cmdline/svntest/wc.py",
line 338, in compare_and_display

    default_singleton_handler('actual ' + label, path, norm_self.desc[path])

  File "/bussrc/subversion-1.8.5/subversion/tests/cmdline/svntest/wc.py",
line 1048, in default_singleton_handler

    raise svntest.tree.SVNTreeUnequal

SVNTreeUnequal

XFAIL: wc_tests.py 3: file status with not-parent symlink

W: svn: E150000: Can't find parent directory's node while trying to add
'/data/bussrc/subversion-1.8.5/subversion/tests/cmdline/svn-test-w

ork/working_copies/wc_tests-4/Z/kappa'

W: svn: E155010: The node
'/data/bussrc/subversion-1.8.5/subversion/tests/cmdline/svn-test-work/workin
g_copies/wc_tests-4/Z' was not found

.

W: CWD: /data/bussrc/subversion-1.8.5/subversion/tests/cmdline

W: EXCEPTION: Failure: Command failed:
"/data/bussrc/subversion-1.8.5/subversion/svn/svn add
svn-test-work/working_copies/wc_tests-4/Z/kap

pa --config-dir ..."; exit code 1

Traceback (most recent call last):

  File "/bussrc/subversion-1.8.5/subversion/tests/cmdline/svntest/main.py",
line 1550, in run

    rc = self.pred.run(sandbox)

  File
"/bussrc/subversion-1.8.5/subversion/tests/cmdline/svntest/testcase.py",
line 114, in run

    return self._delegate.run(sandbox)

  File
"/bussrc/subversion-1.8.5/subversion/tests/cmdline/svntest/testcase.py",
line 254, in run

    return self._delegate.run(sandbox)

  File
"/bussrc/subversion-1.8.5/subversion/tests/cmdline/svntest/testcase.py",
line 176, in run

    return self.func(sandbox)

  File "/bussrc/subversion-1.8.5/subversion/tests/cmdline/wc_tests.py", line
96, in add_through_unversioned_symlink

    sbox.simple_add('Z/kappa')

  File
"/bussrc/subversion-1.8.5/subversion/tests/cmdline/svntest/sandbox.py", line
266, in simple_add

    svntest.main.run_svn(False, 'add', *targets)

  File "/bussrc/subversion-1.8.5/subversion/tests/cmdline/svntest/main.py",
line 682, in run_svn

    *(_with_auth(_with_config_dir(varargs))))

  File "/bussrc/subversion-1.8.5/subversion/tests/cmdline/svntest/main.py",
line 365, in run_command

    None, *varargs)

  File "/bussrc/subversion-1.8.5/subversion/tests/cmdline/svntest/main.py",
line 557, in run_command_stdin

    '"; exit code ' + str(exit_code))

Failure: Command failed: "/data/bussrc/subversion-1.8.5/subversion/svn/svn
add svn-test-work/working_copies/wc_tests-4/Z/kappa --config-di

r ..."; exit code 1

XFAIL: wc_tests.py 4: add file through unversioned symlink

W: svn: E145001: Can't schedule an addition of
'/data/bussrc/subversion-1.8.5/subversion/tests/cmdline/svn-test-work/workin
g_copies/wc_tes

ts-5/Z/kappa' below a not-directory node

W: CWD: /data/bussrc/subversion-1.8.5/subversion/tests/cmdline

W: EXCEPTION: Failure: Command failed:
"/data/bussrc/subversion-1.8.5/subversion/svn/svn add
svn-test-work/working_copies/wc_tests-5/Z/kap

pa --config-dir ..."; exit code 1

Traceback (most recent call last):

  File "/bussrc/subversion-1.8.5/subversion/tests/cmdline/svntest/main.py",
line 1550, in run

    rc = self.pred.run(sandbox)

  File
"/bussrc/subversion-1.8.5/subversion/tests/cmdline/svntest/testcase.py",
line 114, in run

    return self._delegate.run(sandbox)

  File
"/bussrc/subversion-1.8.5/subversion/tests/cmdline/svntest/testcase.py",
line 254, in run

    return self._delegate.run(sandbox)

  File
"/bussrc/subversion-1.8.5/subversion/tests/cmdline/svntest/testcase.py",
line 176, in run

    return self.func(sandbox)

  File "/bussrc/subversion-1.8.5/subversion/tests/cmdline/wc_tests.py", line
108, in add_through_versioned_symlink

    sbox.simple_add('Z/kappa')

  File
"/bussrc/subversion-1.8.5/subversion/tests/cmdline/svntest/sandbox.py", line
266, in simple_add

    svntest.main.run_svn(False, 'add', *targets)

  File "/bussrc/subversion-1.8.5/subversion/tests/cmdline/svntest/main.py",
line 682, in run_svn

    *(_with_auth(_with_config_dir(varargs))))

  File "/bussrc/subversion-1.8.5/subversion/tests/cmdline/svntest/main.py",
line 365, in run_command

    None, *varargs)

  File "/bussrc/subversion-1.8.5/subversion/tests/cmdline/svntest/main.py",
line 557, in run_command_stdin

    '"; exit code ' + str(exit_code))

Failure: Command failed: "/data/bussrc/subversion-1.8.5/subversion/svn/svn
add svn-test-work/working_copies/wc_tests-5/Z/kappa --config-di

r ..."; exit code 1

XFAIL: wc_tests.py 5: add file through versioned symlink

W: svn: warning: W155010: The node
'/data/bussrc/subversion-1.8.5/subversion/tests/cmdline/svn-test-work/workin
g_copies/wc_tests-6/Z' was

not found.

W: svn: E200009: Could not add all targets because some targets don't exist

W: svn: E200009: Illegal target for the requested operation

W: CWD: /data/bussrc/subversion-1.8.5/subversion/tests/cmdline

W: EXCEPTION: Failure: Command failed:
"/data/bussrc/subversion-1.8.5/subversion/svn/svn add
svn-test-work/working_copies/wc_tests-6/Z/B/k

appa --config-dir ..."; exit code 1

Traceback (most recent call last):

  File "/bussrc/subversion-1.8.5/subversion/tests/cmdline/svntest/main.py",
line 1550, in run

    rc = self.pred.run(sandbox)

  File
"/bussrc/subversion-1.8.5/subversion/tests/cmdline/svntest/testcase.py",
line 114, in run

    return self._delegate.run(sandbox)

  File
"/bussrc/subversion-1.8.5/subversion/tests/cmdline/svntest/testcase.py",
line 254, in run

    return self._delegate.run(sandbox)

  File
"/bussrc/subversion-1.8.5/subversion/tests/cmdline/svntest/testcase.py",
line 176, in run

    return self.func(sandbox)

  File "/bussrc/subversion-1.8.5/subversion/tests/cmdline/wc_tests.py", line
119, in add_with_symlink_in_path

    sbox.simple_add('Z/B/kappa')

  File
"/bussrc/subversion-1.8.5/subversion/tests/cmdline/svntest/sandbox.py", line
266, in simple_add

    svntest.main.run_svn(False, 'add', *targets)

  File "/bussrc/subversion-1.8.5/subversion/tests/cmdline/svntest/main.py",
line 682, in run_svn

    *(_with_auth(_with_config_dir(varargs))))

  File "/bussrc/subversion-1.8.5/subversion/tests/cmdline/svntest/main.py",
line 365, in run_command

    None, *varargs)

  File "/bussrc/subversion-1.8.5/subversion/tests/cmdline/svntest/main.py",
line 557, in run_command_stdin

    '"; exit code ' + str(exit_code))

Failure: Command failed: "/data/bussrc/subversion-1.8.5/subversion/svn/svn
add svn-test-work/working_copies/wc_tests-6/Z/B/kappa --config-

dir ..."; exit code 1

XFAIL: wc_tests.py 6: add file with not-parent symlink

W: Status when wc.db is not accessible

W: EXPECTED STDERR (regexp):

W: | [^ ]+ E155016: The working copy database at '.*' is corrupt

W: ACTUAL STDERR:

W: CWD: /data/bussrc/subversion-1.8.5/subversion/tests/cmdline

W: EXCEPTION: SVNUnmatchedError

Traceback (most recent call last):

  File "/bussrc/subversion-1.8.5/subversion/tests/cmdline/svntest/main.py",
line 1550, in run

    rc = self.pred.run(sandbox)

  File
"/bussrc/subversion-1.8.5/subversion/tests/cmdline/svntest/testcase.py",
line 254, in run

    return self._delegate.run(sandbox)

  File
"/bussrc/subversion-1.8.5/subversion/tests/cmdline/svntest/testcase.py",
line 176, in run

    return self.func(sandbox)

  File "/bussrc/subversion-1.8.5/subversion/tests/cmdline/wc_tests.py", line
131, in status_with_inaccessible_wc_db

    "st", sbox.wc_dir)

  File
"/bussrc/subversion-1.8.5/subversion/tests/cmdline/svntest/actions.py", line
282, in run_and_verify_svn

    expected_exit, *varargs)

  File
"/bussrc/subversion-1.8.5/subversion/tests/cmdline/svntest/actions.py", line
321, in run_and_verify_svn2

    verify.verify_outputs(message, out, err, expected_stdout,
expected_stderr)

  File
"/bussrc/subversion-1.8.5/subversion/tests/cmdline/svntest/verify.py", line
445, in verify_outputs

    compare_and_display_lines(message, label, expected, actual, raisable)

  File
"/bussrc/subversion-1.8.5/subversion/tests/cmdline/svntest/verify.py", line
418, in compare_and_display_lines

    raise raisable

SVNUnmatchedError

FAIL:  wc_tests.py 7: inaccessible .svn/wc.db

PASS:  wc_tests.py 8: corrupt .svn/wc.db

PASS:  wc_tests.py 9: zero-length .svn/wc.db

PASS:  wc_tests.py 10: missing .svn/wc.db

SKIP:  wc_tests.py 11: missing .svn/wc.db and .svn/entries

PASS:  wc_tests.py 12: missing .svn/wc.db, maybe valid .svn/entries

PASS:  wc_tests.py 13: cleanup from directory below WC root

PASS:  wc_tests.py 14: update through unversioned symlink

END: wc_tests.py

ELAPSED: wc_tests.py 0:00:02.316758

 

 

Gilles Cleyet-Merle

Alstom Grid | ITSSC ASC | Solution Analyst CAO DAO PAO| Stamp Solution
Manager

Phone: +33 4 79 63 55 37 | Cell +33 6 63 82 26 02 | E-mail:
<mailto:gilles.cleyet-merle@alstom.com> gilles.cleyet-merle@alstom.com

Office address: 1, Rue Paul Doumer- 73100 Aix-les-Bains

Site:  <http://www.alstom.com/> www.alstom.com

** Please consider the environment before printing this e-mail **

 

 

  _____  

CONFIDENTIALITY : This e-mail and any attachments are confidential and may
be privileged. If you are not a named recipient, please notify the sender
immediately and do not disclose the contents to another person, use it for
any purpose or store or copy the information in any medium.


Mime
View raw message