synapse-dev mailing list archives

Site index · List index
Message view « Date » · « Thread »
Top « Date » · « Thread »
From Andreas Veithen <andreas.veit...@skynet.be>
Subject Re: Unit tests fail after uncommenting qpid dependencies
Date Fri, 07 Mar 2008 22:25:23 GMT
qpid depends on dom4j, but dom4j-1.4.jar contains a (probably  
outdated) copy of the Jaxen and SAXPath classes, conflicting with  
Synapse's Jaxen dependency.

On 07 Mar 2008, at 12:41, Upul Godage wrote:

> I will revert the pom.xml to the earlier one for now. There must be  
> wrong dependency coming from this dependency.
>
> Upul
>
>
> Running org.apache.synapse.config.xml.IterateMediatorSerializationTest
> Tests run: 6, Failures: 4, Errors: 0, Skipped: 0, Time elapsed:  
> 0.485 sec <<< FAILURE!
> Running org.apache.synapse.mediators.ext.ClassMediatorTest
> Tests run: 4, Failures: 0, Errors: 0, Skipped: 0, Time elapsed:  
> 0.207 sec
> Running org.apache.synapse.mediators.eip.IterateMediatorTest
> Tests run: 2, Failures: 0, Errors: 0, Skipped: 0, Time elapsed:  
> 0.507 sec
> Running org.apache.synapse.config.xml.ClassMediatorSerializationTest
> Tests run: 3, Failures: 0, Errors: 0, Skipped: 0, Time elapsed:  
> 0.352 sec
> Running org.apache.synapse.mediators.TestMediator
> Tests run: 0, Failures: 0, Errors: 0, Skipped: 0, Time elapsed:  
> 0.011 sec
> Running org.apache.synapse.mediators.transform.FaultMediatorTest
> Tests run: 1, Failures: 0, Errors: 0, Skipped: 0, Time elapsed:  
> 0.203 sec
> Running  
> org.apache.synapse.mediators.builtin.ValidateMediatorSerializationTest
> Tests run: 1, Failures: 1, Errors: 0, Skipped: 0, Time elapsed:  
> 0.505 sec <<< FAILURE!
> Running org.apache.synapse.mediators.builtin.DropMediatorTest
> Tests run: 1, Failures: 0, Errors: 0, Skipped: 0, Time elapsed:  
> 0.171 sec
> Running org.apache.synapse.mediators.TestUtils
> Tests run: 0, Failures: 0, Errors: 0, Skipped: 0, Time elapsed:  
> 0.011 sec
> Running org.apache.synapse.mediators.transform.XSLTMediatorTest
> Tests run: 7, Failures: 0, Errors: 0, Skipped: 0, Time elapsed:  
> 45.654 sec
> Running org.apache.synapse.mediators.ext.AnnotatedCommandMediatorTest
> Tests run: 3, Failures: 0, Errors: 0, Skipped: 0, Time elapsed:  
> 0.413 sec
> Running org.apache.synapse.config.xml.InMediatorSerializationTest
> Tests run: 1, Failures: 0, Errors: 0, Skipped: 0, Time elapsed: 0.37  
> sec
> Running  
> org.apache.synapse.config.xml.SequenceMediatorSerializationTest
> Tests run: 5, Failures: 0, Errors: 0, Skipped: 0, Time elapsed:  
> 0.407 sec
> Running org.apache.synapse.registry.url.SimpleURLRegistryTest
> Tests run: 1, Failures: 0, Errors: 0, Skipped: 0, Time elapsed:  
> 4.656 sec
> Running  
> org.apache.synapse.config.xml.POJOCommandMediatorSerializationTest
> Tests run: 11, Failures: 0, Errors: 5, Skipped: 0, Time elapsed:  
> 0.579 sec <<< FAILURE!
> Running org.apache.synapse.mediators.db.DBReportMediatorTest
> Tests run: 1, Failures: 0, Errors: 0, Skipped: 0, Time elapsed:  
> 1.683 sec
> Running org.apache.synapse.config.xml.RegistrySerializationTest
> Tests run: 1, Failures: 0, Errors: 0, Skipped: 0, Time elapsed: 0.34  
> sec
> Running org.apache.synapse.n2n.SynapseCommodityServiceTest
> Tests run: 1, Failures: 0, Errors: 0, Skipped: 0, Time elapsed:  
> 6.928 sec
> Running  
> org.apache.synapse.config.xml.PropertyMediatorSerializationTest
> Tests run: 4, Failures: 0, Errors: 0, Skipped: 0, Time elapsed:  
> 0.439 sec
> Running org.apache.synapse.util.TextFileDataSourceTest
> Tests run: 1, Failures: 0, Errors: 0, Skipped: 0, Time elapsed:  
> 0.052 sec
> Running org.apache.synapse.config.xml.DropMediatorSerializationTest
> Tests run: 1, Failures: 0, Errors: 0, Skipped: 0, Time elapsed:  
> 0.362 sec
> Running  
> org.apache.synapse.config.xml.DBLookupMediatorSerializationTest
> Tests run: 1, Failures: 1, Errors: 0, Skipped: 0, Time elapsed:  
> 0.432 sec <<< FAILURE!
> Running org.apache.synapse.config.xml.LogMediatorSerializationTest
> Tests run: 2, Failures: 0, Errors: 0, Skipped: 0, Time elapsed:  
> 0.388 sec
> Running org.apache.synapse.mediators.db.DBLookupMediatorTest
> Tests run: 2, Failures: 0, Errors: 0, Skipped: 0, Time elapsed:  
> 1.425 sec
> Running org.apache.synapse.config.xml.TestMediator
> Tests run: 0, Failures: 0, Errors: 0, Skipped: 0, Time elapsed:  
> 0.012 sec
> Running org.apache.synapse.mediators.filters.FilterMediatorTest
> Tests run: 4, Failures: 0, Errors: 0, Skipped: 0, Time elapsed:  
> 0.262 sec
> Running org.apache.synapse.mediators.builtin.PropertyMediatorTest
> Tests run: 3, Failures: 0, Errors: 2, Skipped: 0, Time elapsed:  
> 0.213 sec <<< FAILURE!
> Running org.apache.synapse.config.xml.FilterMediatorSerializationTest
> Tests run: 2, Failures: 2, Errors: 0, Skipped: 0, Time elapsed:  
> 0.425 sec <<< FAILURE!
> Running org.apache.synapse.config.xml.SendMediatorSerializationTest
> Tests run: 5, Failures: 0, Errors: 0, Skipped: 0, Time elapsed: 0.77  
> sec
> Running org.apache.synapse.config.xml.CloneMediatorSerializationTest
> Tests run: 4, Failures: 0, Errors: 0, Skipped: 0, Time elapsed:  
> 0.435 sec
> Running org.apache.synapse.TestMessageContext
> Tests run: 0, Failures: 0, Errors: 0, Skipped: 0, Time elapsed:  
> 0.011 sec
> Running org.apache.synapse.core.axis2.Axis2MessageContextTest
> Tests run: 2, Failures: 0, Errors: 0, Skipped: 0, Time elapsed:  
> 0.246 sec
> Running org.apache.synapse.config.xml.ProxyServiceSerializationTest
> Tests run: 5, Failures: 0, Errors: 0, Skipped: 0, Time elapsed:  
> 0.447 sec
> Running org.apache.synapse.config.xml.SwitchMediatorSerializationTest
> Tests run: 2, Failures: 2, Errors: 0, Skipped: 0, Time elapsed:  
> 0.163 sec <<< FAILURE!
> Running org.apache.synapse.mediators.transform.HeaderMediatorTest
> Tests run: 2, Failures: 0, Errors: 0, Skipped: 0, Time elapsed:  
> 0.225 sec
> Running org.apache.synapse.mediators.builtin.ValidateMediatorTest
> Tests run: 8, Failures: 0, Errors: 0, Skipped: 0, Time elapsed:  
> 0.894 sec
> Running org.apache.synapse.config.xml.FaultMediatorSerializationTest
> Tests run: 2, Failures: 0, Errors: 0, Skipped: 0, Time elapsed:  
> 0.352 sec
> Running org.apache.synapse.mediators.filters.SwitchMediatorTest
> Tests run: 3, Failures: 0, Errors: 0, Skipped: 0, Time elapsed:  
> 0.242 sec
> Running org.apache.synapse.util.WrappedTextNodeStreamReaderTest
> Tests run: 8, Failures: 0, Errors: 0, Skipped: 0, Time elapsed:  
> 0.297 sec
> Running org.apache.synapse.config.xml.HeaderMediatorSerializationTest
> Tests run: 2, Failures: 0, Errors: 0, Skipped: 0, Time elapsed: 0.36  
> sec
> Running org.apache.synapse.mediators.eip.CloneMediatorTest
> Tests run: 2, Failures: 0, Errors: 0, Skipped: 0, Time elapsed:  
> 0.499 sec
> Running org.apache.synapse.config.xml.OutMediatorSerializationTest
> Tests run: 1, Failures: 0, Errors: 0, Skipped: 0, Time elapsed:  
> 0.365 sec
> Running org.apache.synapse.mediators.ext.POJOCommandMediatorTest
> Tests run: 8, Failures: 0, Errors: 2, Skipped: 0, Time elapsed:  
> 0.266 sec <<< FAILURE!
> Running org.apache.synapse.mediators.base.SequenceMediatorTest
> Tests run: 2, Failures: 0, Errors: 0, Skipped: 0, Time elapsed:  
> 0.232 sec
>


---------------------------------------------------------------------
To unsubscribe, e-mail: dev-unsubscribe@synapse.apache.org
For additional commands, e-mail: dev-help@synapse.apache.org


Mime
View raw message