synapse-dev mailing list archives

Site index · List index
Message view « Date » · « Thread »
Top « Date » · « Thread »
From Apache Hudson Server <hud...@hudson.zones.apache.org>
Subject Build failed in Hudson: Synapse - Trunk #2363
Date Wed, 23 Jun 2010 14:50:47 GMT
See <http://hudson.zones.apache.org/hudson/job/Synapse%20-%20Trunk/2363/changes>

Changes:

[supun] fixing issue SYNAPSE-665

------------------------------------------
[...truncated 1270 lines...]
Downloading: http://dist.wso2.org/snapshots/maven2//org/apache/axis2/axis2-transport-mail/1.1.0-SNAPSHOT/axis2-transport-mail-1.1.0-SNAPSHOT.jar
[INFO] Unable to find resource 'org.apache.axis2:axis2-transport-mail:jar:1.1.0-SNAPSHOT'
in repository wso2-m2-snapshots (http://dist.wso2.org/snapshots/maven2/)
Downloading: http://people.apache.org/repo/m2-snapshot-repository//org/apache/axis2/axis2-transport-base/1.1.0-SNAPSHOT/axis2-transport-base-1.1.0-SNAPSHOT.jar
[INFO] Unable to find resource 'org.apache.axis2:axis2-transport-base:jar:1.1.0-SNAPSHOT'
in repository apache-snapshots (http://people.apache.org/repo/m2-snapshot-repository/)
Downloading: http://dist.wso2.org/snapshots/maven2//org/apache/axis2/axis2-transport-base/1.1.0-SNAPSHOT/axis2-transport-base-1.1.0-SNAPSHOT.jar
[INFO] Unable to find resource 'org.apache.axis2:axis2-transport-base:jar:1.1.0-SNAPSHOT'
in repository wso2-m2-snapshots (http://dist.wso2.org/snapshots/maven2/)
Downloading: http://people.apache.org/repo/m2-snapshot-repository//org/apache/axis2/axis2-transport-jms/1.1.0-SNAPSHOT/axis2-transport-jms-1.1.0-SNAPSHOT.jar
[INFO] Unable to find resource 'org.apache.axis2:axis2-transport-jms:jar:1.1.0-SNAPSHOT' in
repository apache-snapshots (http://people.apache.org/repo/m2-snapshot-repository/)
Downloading: http://dist.wso2.org/snapshots/maven2//org/apache/axis2/axis2-transport-jms/1.1.0-SNAPSHOT/axis2-transport-jms-1.1.0-SNAPSHOT.jar
[INFO] Unable to find resource 'org.apache.axis2:axis2-transport-jms:jar:1.1.0-SNAPSHOT' in
repository wso2-m2-snapshots (http://dist.wso2.org/snapshots/maven2/)
Downloading: http://people.apache.org/repo/m2-snapshot-repository//org/apache/axis2/axis2-transport-mail/1.1.0-SNAPSHOT/axis2-transport-mail-1.1.0-SNAPSHOT.jar
[INFO] Unable to find resource 'org.apache.axis2:axis2-transport-mail:jar:1.1.0-SNAPSHOT'
in repository apache-snapshots (http://people.apache.org/repo/m2-snapshot-repository/)
Downloading: http://dist.wso2.org/snapshots/maven2//org/apache/axis2/axis2-transport-mail/1.1.0-SNAPSHOT/axis2-transport-mail-1.1.0-SNAPSHOT.jar
[INFO] Unable to find resource 'org.apache.axis2:axis2-transport-mail:jar:1.1.0-SNAPSHOT'
in repository wso2-m2-snapshots (http://dist.wso2.org/snapshots/maven2/)
[INFO] [compiler:testCompile {execution: default-testCompile}]
Compiling 80 source files to <http://hudson.zones.apache.org/hudson/job/Synapse%20-%20Trunk/ws/java/modules/core/target/test-classes>
Downloading: http://people.apache.org/repo/m2-snapshot-repository//org/apache/axis2/axis2-transport-base/1.1.0-SNAPSHOT/axis2-transport-base-1.1.0-SNAPSHOT.jar
[INFO] Unable to find resource 'org.apache.axis2:axis2-transport-base:jar:1.1.0-SNAPSHOT'
in repository apache-snapshots (http://people.apache.org/repo/m2-snapshot-repository/)
Downloading: http://dist.wso2.org/snapshots/maven2//org/apache/axis2/axis2-transport-base/1.1.0-SNAPSHOT/axis2-transport-base-1.1.0-SNAPSHOT.jar
[INFO] Unable to find resource 'org.apache.axis2:axis2-transport-base:jar:1.1.0-SNAPSHOT'
in repository wso2-m2-snapshots (http://dist.wso2.org/snapshots/maven2/)
Downloading: http://people.apache.org/repo/m2-snapshot-repository//org/apache/axis2/axis2-transport-jms/1.1.0-SNAPSHOT/axis2-transport-jms-1.1.0-SNAPSHOT.jar
[INFO] Unable to find resource 'org.apache.axis2:axis2-transport-jms:jar:1.1.0-SNAPSHOT' in
repository apache-snapshots (http://people.apache.org/repo/m2-snapshot-repository/)
Downloading: http://dist.wso2.org/snapshots/maven2//org/apache/axis2/axis2-transport-jms/1.1.0-SNAPSHOT/axis2-transport-jms-1.1.0-SNAPSHOT.jar
[INFO] Unable to find resource 'org.apache.axis2:axis2-transport-jms:jar:1.1.0-SNAPSHOT' in
repository wso2-m2-snapshots (http://dist.wso2.org/snapshots/maven2/)
Downloading: http://people.apache.org/repo/m2-snapshot-repository//org/apache/axis2/axis2-transport-mail/1.1.0-SNAPSHOT/axis2-transport-mail-1.1.0-SNAPSHOT.jar
[INFO] Unable to find resource 'org.apache.axis2:axis2-transport-mail:jar:1.1.0-SNAPSHOT'
in repository apache-snapshots (http://people.apache.org/repo/m2-snapshot-repository/)
Downloading: http://dist.wso2.org/snapshots/maven2//org/apache/axis2/axis2-transport-mail/1.1.0-SNAPSHOT/axis2-transport-mail-1.1.0-SNAPSHOT.jar
[INFO] Unable to find resource 'org.apache.axis2:axis2-transport-mail:jar:1.1.0-SNAPSHOT'
in repository wso2-m2-snapshots (http://dist.wso2.org/snapshots/maven2/)
Downloading: http://people.apache.org/repo/m2-snapshot-repository//org/apache/axis2/axis2-transport-base/1.1.0-SNAPSHOT/axis2-transport-base-1.1.0-SNAPSHOT.jar
[INFO] Unable to find resource 'org.apache.axis2:axis2-transport-base:jar:1.1.0-SNAPSHOT'
in repository apache-snapshots (http://people.apache.org/repo/m2-snapshot-repository/)
Downloading: http://dist.wso2.org/snapshots/maven2//org/apache/axis2/axis2-transport-base/1.1.0-SNAPSHOT/axis2-transport-base-1.1.0-SNAPSHOT.jar
[INFO] Unable to find resource 'org.apache.axis2:axis2-transport-base:jar:1.1.0-SNAPSHOT'
in repository wso2-m2-snapshots (http://dist.wso2.org/snapshots/maven2/)
Downloading: http://people.apache.org/repo/m2-snapshot-repository//org/apache/axis2/axis2-transport-jms/1.1.0-SNAPSHOT/axis2-transport-jms-1.1.0-SNAPSHOT.jar
[INFO] Unable to find resource 'org.apache.axis2:axis2-transport-jms:jar:1.1.0-SNAPSHOT' in
repository apache-snapshots (http://people.apache.org/repo/m2-snapshot-repository/)
Downloading: http://dist.wso2.org/snapshots/maven2//org/apache/axis2/axis2-transport-jms/1.1.0-SNAPSHOT/axis2-transport-jms-1.1.0-SNAPSHOT.jar
[INFO] Unable to find resource 'org.apache.axis2:axis2-transport-jms:jar:1.1.0-SNAPSHOT' in
repository wso2-m2-snapshots (http://dist.wso2.org/snapshots/maven2/)
Downloading: http://people.apache.org/repo/m2-snapshot-repository//org/apache/axis2/axis2-transport-mail/1.1.0-SNAPSHOT/axis2-transport-mail-1.1.0-SNAPSHOT.jar
[INFO] Unable to find resource 'org.apache.axis2:axis2-transport-mail:jar:1.1.0-SNAPSHOT'
in repository apache-snapshots (http://people.apache.org/repo/m2-snapshot-repository/)
Downloading: http://dist.wso2.org/snapshots/maven2//org/apache/axis2/axis2-transport-mail/1.1.0-SNAPSHOT/axis2-transport-mail-1.1.0-SNAPSHOT.jar
[INFO] Unable to find resource 'org.apache.axis2:axis2-transport-mail:jar:1.1.0-SNAPSHOT'
in repository wso2-m2-snapshots (http://dist.wso2.org/snapshots/maven2/)
[INFO] [surefire:test {execution: default-test}]
[INFO] Surefire report directory: <http://hudson.zones.apache.org/hudson/job/Synapse%20-%20Trunk/ws/java/modules/core/target/surefire-reports>

-------------------------------------------------------
 T E S T S
-------------------------------------------------------
Running org.apache.synapse.config.xml.HeaderMediatorConfigurationTest
Tests run: 4, Failures: 0, Errors: 0, Skipped: 0, Time elapsed: 0.123 sec
Running org.apache.synapse.config.xml.IterateMediatorSerializationTest
Tests run: 6, Failures: 0, Errors: 0, Skipped: 0, Time elapsed: 0.413 sec
Running org.apache.synapse.mediators.ext.ClassMediatorTest
Tests run: 4, Failures: 0, Errors: 0, Skipped: 0, Time elapsed: 0.161 sec
Running org.apache.synapse.mediators.TestMediator
Tests run: 0, Failures: 0, Errors: 0, Skipped: 0, Time elapsed: 0.009 sec
Running org.apache.synapse.TestMessageContextBuilder
Tests run: 0, Failures: 0, Errors: 0, Skipped: 0, Time elapsed: 0.009 sec
Running org.apache.synapse.mediators.builtin.ValidateMediatorSerializationTest
Tests run: 1, Failures: 0, Errors: 0, Skipped: 0, Time elapsed: 0.394 sec
Running org.apache.synapse.mediators.TestUtils
Tests run: 0, Failures: 0, Errors: 0, Skipped: 0, Time elapsed: 0.009 sec
Running org.apache.synapse.config.xml.RMSequenceMediatorSerializationTest
Tests run: 2, Failures: 0, Errors: 0, Skipped: 0, Time elapsed: 0.314 sec
Running org.apache.synapse.config.xml.AggregateMediatorSerializationTest
Tests run: 1, Failures: 0, Errors: 0, Skipped: 0, Time elapsed: 0.367 sec
Running org.apache.synapse.config.xml.TransactionMediatorSerializationTest
Tests run: 1, Failures: 0, Errors: 0, Skipped: 0, Time elapsed: 0.282 sec
Running org.apache.synapse.registry.url.SimpleURLRegistryTest
Tests run: 3, Failures: 0, Errors: 0, Skipped: 0, Time elapsed: 4.596 sec
Running org.apache.synapse.mediators.db.DBReportMediatorTest
Tests run: 1, Failures: 0, Errors: 0, Skipped: 0, Time elapsed: 1.859 sec
Running org.apache.synapse.util.TextFileDataSourceTest
Tests run: 3, Failures: 0, Errors: 0, Skipped: 0, Time elapsed: 0.105 sec
Running org.apache.synapse.mediators.filters.FilterMediatorTest
Tests run: 6, Failures: 0, Errors: 0, Skipped: 0, Time elapsed: 0.231 sec
Running org.apache.synapse.config.xml.FilterMediatorSerializationTest
Tests run: 7, Failures: 0, Errors: 0, Skipped: 0, Time elapsed: 0.398 sec
Running org.apache.synapse.config.xml.SendMediatorSerializationTest
Tests run: 5, Failures: 0, Errors: 0, Skipped: 0, Time elapsed: 0.459 sec
Running org.apache.synapse.config.xml.CloneMediatorSerializationTest
Tests run: 4, Failures: 0, Errors: 0, Skipped: 0, Time elapsed: 0.404 sec
Running org.apache.synapse.core.axis2.ProxyServiceTest
Tests run: 3, Failures: 0, Errors: 0, Skipped: 0, Time elapsed: 0.855 sec
Running org.apache.synapse.endpoints.algorithms.WeightedRRLCAlgorithmTest
Tests run: 2, Failures: 0, Errors: 0, Skipped: 0, Time elapsed: 0.098 sec
Running org.apache.synapse.config.xml.XSLTMediatorSerializationTest
Tests run: 3, Failures: 0, Errors: 0, Skipped: 0, Time elapsed: 0.347 sec
Running org.apache.synapse.eventing.builders.MessageBuilderTest
Tests run: 5, Failures: 0, Errors: 0, Skipped: 0, Time elapsed: 0.218 sec
Running org.apache.synapse.config.xml.HeaderMediatorSerializationTest
Tests run: 2, Failures: 0, Errors: 0, Skipped: 0, Time elapsed: 0.285 sec
Running org.apache.synapse.mediators.eip.CloneMediatorTest
Tests run: 2, Failures: 0, Errors: 0, Skipped: 0, Time elapsed: 0.456 sec
Running org.apache.synapse.config.xml.OutMediatorSerializationTest
Tests run: 1, Failures: 0, Errors: 0, Skipped: 0, Time elapsed: 0.386 sec
Running org.apache.synapse.mediators.base.SequenceMediatorTest
Tests run: 2, Failures: 0, Errors: 0, Skipped: 0, Time elapsed: 0.196 sec
Running org.apache.synapse.config.xml.LocalEntryConfigurationTest
Testing text entry with markup characters; Coalesced parsing: true
Testing text entry with markup characters; Coalesced parsing: false
Testing text entry with nested CDATA elements; Coalesced parsing: true
Testing text entry with nested CDATA elements; Coalesced parsing: false
Testing large text entry with markup characters; Coalesced parsing: true
Testing large text entry with markup characters; Coalesced parsing: false
Testing simple XML entry with CDATA elements; Coalesced parsing: true
Testing simple XML entry with CDATA elements; Coalesced parsing: false
Tests run: 8, Failures: 0, Errors: 0, Skipped: 0, Time elapsed: 0.394 sec
Running org.apache.synapse.registry.DynamicResourceTest
Initializing in-memory registry for dynamic resource tests...
Testing dynamic sequence lookup...
Testing basic registry lookup functionality...
Testing basic sequence caching...
Testing advanced sequence caching...
Waiting for the cache to expire...
Testing sequence reloading...
Waiting for the cache to expire...
Testing for non-existing sequences...
Dynamic sequence lookup tests were successful...
Initializing in-memory registry for dynamic resource tests...
Testing dynamic endpoint lookup...
Testing basic registry lookup functionality...
Testing basic endpoint caching...
Testing advanced endpoint caching...
Waiting for the cache to expire...
Testing endpoint reloading...
Waiting for the cache to expire...
Testing for non-existing endpoints...
Dynamic endpoint lookup tests were successful...
Tests run: 2, Failures: 0, Errors: 0, Skipped: 0, Time elapsed: 34.224 sec
Running org.apache.synapse.mediators.eip.IterateMediatorTest
Tests run: 2, Failures: 0, Errors: 0, Skipped: 0, Time elapsed: 0.487 sec
Running org.apache.synapse.config.xml.ClassMediatorSerializationTest
Tests run: 3, Failures: 0, Errors: 0, Skipped: 0, Time elapsed: 0.3 sec
Running org.apache.synapse.util.SynapseXPathTest
Tests run: 9, Failures: 0, Errors: 0, Skipped: 0, Time elapsed: 0.251 sec
Running org.apache.synapse.mediators.transform.FaultMediatorTest
Tests run: 1, Failures: 0, Errors: 0, Skipped: 0, Time elapsed: 0.201 sec
Running org.apache.synapse.mediators.builtin.DropMediatorTest
Tests run: 1, Failures: 0, Errors: 0, Skipped: 0, Time elapsed: 0.176 sec
Running org.apache.synapse.mediators.ext.AnnotatedCommandMediatorTest
Tests run: 3, Failures: 0, Errors: 0, Skipped: 0, Time elapsed: 0.264 sec
Running org.apache.synapse.mediators.transform.XSLTMediatorTest
Tests run: 28, Failures: 0, Errors: 0, Skipped: 0, Time elapsed: 14.891 sec
Running org.apache.synapse.eventing.filters.EventFilterTest
Tests run: 2, Failures: 0, Errors: 0, Skipped: 0, Time elapsed: 0.239 sec
Running org.apache.synapse.config.xml.InMediatorSerializationTest
Tests run: 1, Failures: 0, Errors: 0, Skipped: 0, Time elapsed: 0.294 sec
Running org.apache.synapse.config.xml.SequenceMediatorSerializationTest
Tests run: 5, Failures: 0, Errors: 0, Skipped: 0, Time elapsed: 0.331 sec
Running org.apache.synapse.config.xml.POJOCommandMediatorSerializationTest
Tests run: 11, Failures: 0, Errors: 0, Skipped: 0, Time elapsed: 0.368 sec
Running org.apache.synapse.config.xml.RegistrySerializationTest
Tests run: 1, Failures: 0, Errors: 0, Skipped: 0, Time elapsed: 0.29 sec
Running org.apache.synapse.config.xml.PropertyMediatorSerializationTest
Tests run: 8, Failures: 0, Errors: 0, Skipped: 0, Time elapsed: 0.359 sec
Running org.apache.synapse.n2n.SynapseCommodityServiceTest
Tests run: 1, Failures: 0, Errors: 0, Skipped: 0, Time elapsed: 1.488 sec
Running org.apache.synapse.config.xml.MultiXMLConfigurationBuilderTest
Using SYNAPSE_CONFIG_HOME=<http://hudson.zones.apache.org/hudson/job/Synapse%20-%20Trunk/ws/java/modules/core/target/test-classes/synapse-config>
Tests run: 1, Failures: 0, Errors: 0, Skipped: 0, Time elapsed: 0.275 sec
Running org.apache.synapse.config.xml.DBLookupMediatorSerializationTest
Tests run: 1, Failures: 0, Errors: 0, Skipped: 0, Time elapsed: 0.355 sec
Running org.apache.synapse.config.xml.DropMediatorSerializationTest
Tests run: 1, Failures: 0, Errors: 0, Skipped: 0, Time elapsed: 0.277 sec
Running org.apache.synapse.config.xml.LogMediatorSerializationTest
Tests run: 3, Failures: 0, Errors: 0, Skipped: 0, Time elapsed: 0.336 sec
Running org.apache.synapse.mediators.db.DBLookupMediatorTest
Tests run: 2, Failures: 0, Errors: 0, Skipped: 0, Time elapsed: 1.086 sec
Running org.apache.synapse.config.xml.TestMediator
Tests run: 0, Failures: 0, Errors: 0, Skipped: 0, Time elapsed: 0.009 sec
Running org.apache.synapse.mediators.builtin.PropertyMediatorTest
All property values are correctly in place - Test SUCCESSFUL
Tests run: 5, Failures: 0, Errors: 0, Skipped: 0, Time elapsed: 0.292 sec
Running org.apache.synapse.util.MessageHelperTest
Tests run: 2, Failures: 0, Errors: 0, Skipped: 0, Time elapsed: 0.053 sec
Running org.apache.synapse.eventing.builders.ResponseMessageBuilderTest
Tests run: 4, Failures: 0, Errors: 0, Skipped: 0, Time elapsed: 0.394 sec
Running org.apache.synapse.core.axis2.Axis2MessageContextTest
Tests run: 2, Failures: 0, Errors: 0, Skipped: 0, Time elapsed: 0.216 sec
Running org.apache.synapse.config.xml.ProxyServiceSerializationTest
Tests run: 6, Failures: 0, Errors: 0, Skipped: 0, Time elapsed: 0.413 sec
Running org.apache.synapse.config.xml.SwitchMediatorSerializationTest
Tests run: 2, Failures: 0, Errors: 0, Skipped: 0, Time elapsed: 0.358 sec
Running org.apache.synapse.TestMessageContext
Tests run: 0, Failures: 0, Errors: 0, Skipped: 0, Time elapsed: 0.008 sec
Running org.apache.synapse.config.xml.ConditionalRouterMediatorSerializationTest
Tests run: 4, Failures: 0, Errors: 0, Skipped: 0, Time elapsed: 0.364 sec
Running org.apache.synapse.mediators.transform.HeaderMediatorTest
Tests run: 3, Failures: 0, Errors: 0, Skipped: 0, Time elapsed: 0.215 sec
Running org.apache.synapse.mediators.builtin.ValidateMediatorTest
Tests run: 8, Failures: 0, Errors: 0, Skipped: 0, Time elapsed: 0.556 sec
Running org.apache.synapse.config.xml.FaultMediatorSerializationTest
Tests run: 5, Failures: 0, Errors: 0, Skipped: 0, Time elapsed: 0.327 sec
Running org.apache.synapse.config.xml.CacheMediatorSerializationTest
Tests run: 3, Failures: 0, Errors: 0, Skipped: 0, Time elapsed: 0.329 sec
Running org.apache.synapse.mediators.filters.SwitchMediatorTest
Tests run: 3, Failures: 0, Errors: 0, Skipped: 0, Time elapsed: 0.23 sec
Running org.apache.synapse.config.xml.CalloutMediatorSerializationTest
Tests run: 2, Failures: 0, Errors: 0, Skipped: 0, Time elapsed: 0.349 sec
Running org.apache.synapse.config.SynapseObserverTest
Tests run: 1, Failures: 0, Errors: 0, Skipped: 0, Time elapsed: 0.083 sec
Running org.apache.synapse.config.xml.DBReportMediatorSerializationTest
Tests run: 2, Failures: 0, Errors: 0, Skipped: 0, Time elapsed: 0.353 sec
Running org.apache.synapse.eventing.SynapseEventSourceTest
Tests run: 1, Failures: 0, Errors: 0, Skipped: 0, Time elapsed: 0.221 sec
Running org.apache.synapse.mediators.ext.POJOCommandMediatorTest
Tests run: 8, Failures: 0, Errors: 0, Skipped: 0, Time elapsed: 0.217 sec

Results :

Tests run: 223, Failures: 0, Errors: 0, Skipped: 0

[HUDSON] Recording test results[locks-and-latches] Releasing all the locks
[locks-and-latches] All the locks released
ERROR: Failed to parse POMs
hudson.util.IOException2: Failed to join the process
	at hudson.Proc$RemoteProc.join(Proc.java:312)
	at hudson.maven.ProcessCache$MavenProcess.call(ProcessCache.java:164)
	at hudson.maven.MavenModuleSetBuild$RunnerImpl.doRun(MavenModuleSetBuild.java:480)
	at hudson.model.AbstractBuild$AbstractRunner.run(AbstractBuild.java:416)
	at hudson.model.Run.run(Run.java:1243)
	at hudson.maven.MavenModuleSetBuild.run(MavenModuleSetBuild.java:304)
	at hudson.model.ResourceController.execute(ResourceController.java:88)
	at hudson.model.Executor.run(Executor.java:122)
Caused by: java.util.concurrent.ExecutionException: hudson.remoting.RequestAbortedException:
java.io.EOFException
	at hudson.remoting.Request$1.get(Request.java:218)
	at hudson.remoting.Request$1.get(Request.java:172)
	at hudson.remoting.FutureAdapter.get(FutureAdapter.java:55)
	at hudson.Proc$RemoteProc.join(Proc.java:304)
	... 7 more
Caused by: hudson.remoting.RequestAbortedException: java.io.EOFException
	at hudson.remoting.Request.abort(Request.java:257)
	at hudson.remoting.Channel.terminate(Channel.java:598)
	at hudson.remoting.Channel$ReaderThread.run(Channel.java:876)
Caused by: java.io.EOFException
	at java.io.ObjectInputStream$BlockDataInputStream.peekByte(ObjectInputStream.java:2554)
	at java.io.ObjectInputStream.readObject0(ObjectInputStream.java:1297)
	at java.io.ObjectInputStream.readObject(ObjectInputStream.java:351)
	at hudson.remoting.Channel$ReaderThread.run(Channel.java:856)
FATAL: channel is already closed
hudson.remoting.ChannelClosedException: channel is already closed
	at hudson.remoting.Channel.send(Channel.java:412)
	at hudson.remoting.Request.call(Request.java:105)
	at hudson.remoting.Channel.call(Channel.java:551)
	at hudson.Launcher$RemoteLauncher.kill(Launcher.java:735)
	at hudson.model.AbstractBuild$AbstractRunner.run(AbstractBuild.java:421)
	at hudson.model.Run.run(Run.java:1243)
	at hudson.maven.MavenModuleSetBuild.run(MavenModuleSetBuild.java:304)
	at hudson.model.ResourceController.execute(ResourceController.java:88)
	at hudson.model.Executor.run(Executor.java:122)


---------------------------------------------------------------------
To unsubscribe, e-mail: dev-unsubscribe@synapse.apache.org
For additional commands, e-mail: dev-help@synapse.apache.org


Mime
View raw message