synapse-dev mailing list archives

Site index · List index
Message view « Date » · « Thread »
Top « Date » · « Thread »
From Apache Hudson Server <hud...@hudson.apache.org>
Subject Build failed in Hudson: Synapse - Trunk #2645
Date Mon, 13 Sep 2010 00:21:31 GMT
See <https://hudson.apache.org/hudson/job/Synapse%20-%20Trunk/2645/>

------------------------------------------
[...truncated 788 lines...]
	at org.apache.maven.lifecycle.DefaultLifecycleExecutor.executeGoalWithLifecycle(DefaultLifecycleExecutor.java:556)
	at org.apache.maven.lifecycle.DefaultLifecycleExecutor.executeGoal(DefaultLifecycleExecutor.java:535)
	at org.apache.maven.lifecycle.DefaultLifecycleExecutor.executeGoalAndHandleFailures(DefaultLifecycleExecutor.java:387)
	at org.apache.maven.lifecycle.DefaultLifecycleExecutor.executeTaskSegments(DefaultLifecycleExecutor.java:348)
	at org.apache.maven.lifecycle.DefaultLifecycleExecutor.execute(DefaultLifecycleExecutor.java:180)
	at org.apache.maven.lifecycle.LifecycleExecutorInterceptor.execute(LifecycleExecutorInterceptor.java:65)
	at org.apache.maven.DefaultMaven.doExecute(DefaultMaven.java:328)
	at org.apache.maven.DefaultMaven.execute(DefaultMaven.java:138)
	at org.apache.maven.cli.MavenCli.main(MavenCli.java:362)
	at sun.reflect.NativeMethodAccessorImpl.invoke0(Native Method)
	at sun.reflect.NativeMethodAccessorImpl.invoke(NativeMethodAccessorImpl.java:39)
	at sun.reflect.DelegatingMethodAccessorImpl.invoke(DelegatingMethodAccessorImpl.java:25)
	at java.lang.reflect.Method.invoke(Method.java:592)
	at org.codehaus.classworlds.Launcher.launchEnhanced(Launcher.java:315)
	at org.codehaus.classworlds.Launcher.launch(Launcher.java:255)
	at hudson.maven.agent.Main.launch(Main.java:165)
	at hudson.maven.MavenBuilder.call(MavenBuilder.java:165)
	at hudson.maven.MavenModuleSetBuild$Builder.call(MavenModuleSetBuild.java:681)
	at hudson.maven.MavenModuleSetBuild$Builder.call(MavenModuleSetBuild.java:625)
	at hudson.remoting.UserRequest.perform(UserRequest.java:114)
	at hudson.remoting.UserRequest.perform(UserRequest.java:48)
	at hudson.remoting.Request$2.run(Request.java:270)
	at java.util.concurrent.Executors$RunnableAdapter.call(Executors.java:417)
	at java.util.concurrent.FutureTask$Sync.innerRun(FutureTask.java:269)
	at java.util.concurrent.FutureTask.run(FutureTask.java:123)
	at java.util.concurrent.ThreadPoolExecutor$Worker.runTask(ThreadPoolExecutor.java:651)
	at java.util.concurrent.ThreadPoolExecutor$Worker.run(ThreadPoolExecutor.java:676)
	at java.lang.Thread.run(Thread.java:595)
[INFO] Writing OBR metadata
[WARNING] Exception while updating local OBR: null
java.lang.NullPointerException
	at org.apache.felix.obrplugin.ObrUpdate.writeRepositoryXml(ObrUpdate.java:268)
	at org.apache.felix.obrplugin.ObrInstall.execute(ObrInstall.java:144)
	at org.apache.maven.plugin.DefaultPluginManager.executeMojo(DefaultPluginManager.java:490)
	at hudson.maven.agent.PluginManagerInterceptor.executeMojo(PluginManagerInterceptor.java:182)
	at org.apache.maven.lifecycle.DefaultLifecycleExecutor.executeGoals(DefaultLifecycleExecutor.java:694)
	at org.apache.maven.lifecycle.DefaultLifecycleExecutor.executeGoalWithLifecycle(DefaultLifecycleExecutor.java:556)
	at org.apache.maven.lifecycle.DefaultLifecycleExecutor.executeGoal(DefaultLifecycleExecutor.java:535)
	at org.apache.maven.lifecycle.DefaultLifecycleExecutor.executeGoalAndHandleFailures(DefaultLifecycleExecutor.java:387)
	at org.apache.maven.lifecycle.DefaultLifecycleExecutor.executeTaskSegments(DefaultLifecycleExecutor.java:348)
	at org.apache.maven.lifecycle.DefaultLifecycleExecutor.execute(DefaultLifecycleExecutor.java:180)
	at org.apache.maven.lifecycle.LifecycleExecutorInterceptor.execute(LifecycleExecutorInterceptor.java:65)
	at org.apache.maven.DefaultMaven.doExecute(DefaultMaven.java:328)
	at org.apache.maven.DefaultMaven.execute(DefaultMaven.java:138)
	at org.apache.maven.cli.MavenCli.main(MavenCli.java:362)
	at sun.reflect.NativeMethodAccessorImpl.invoke0(Native Method)
	at sun.reflect.NativeMethodAccessorImpl.invoke(NativeMethodAccessorImpl.java:39)
	at sun.reflect.DelegatingMethodAccessorImpl.invoke(DelegatingMethodAccessorImpl.java:25)
	at java.lang.reflect.Method.invoke(Method.java:592)
	at org.codehaus.classworlds.Launcher.launchEnhanced(Launcher.java:315)
	at org.codehaus.classworlds.Launcher.launch(Launcher.java:255)
	at hudson.maven.agent.Main.launch(Main.java:165)
	at hudson.maven.MavenBuilder.call(MavenBuilder.java:165)
	at hudson.maven.MavenModuleSetBuild$Builder.call(MavenModuleSetBuild.java:681)
	at hudson.maven.MavenModuleSetBuild$Builder.call(MavenModuleSetBuild.java:625)
	at hudson.remoting.UserRequest.perform(UserRequest.java:114)
	at hudson.remoting.UserRequest.perform(UserRequest.java:48)
	at hudson.remoting.Request$2.run(Request.java:270)
	at java.util.concurrent.Executors$RunnableAdapter.call(Executors.java:417)
	at java.util.concurrent.FutureTask$Sync.innerRun(FutureTask.java:269)
	at java.util.concurrent.FutureTask.run(FutureTask.java:123)
	at java.util.concurrent.ThreadPoolExecutor$Worker.runTask(ThreadPoolExecutor.java:651)
	at java.util.concurrent.ThreadPoolExecutor$Worker.run(ThreadPoolExecutor.java:676)
	at java.lang.Thread.run(Thread.java:595)
[HUDSON] Archiving <https://hudson.apache.org/hudson/job/Synapse%20-%20Trunk/ws/java/modules/transports/core/vfs/pom.xml>
to /home/hudson/hudson/jobs/Synapse - Trunk/modules/org.apache.synapse$synapse-vfs-transport/builds/2010-09-13_00-19-41/archive/org.apache.synapse/synapse-vfs-transport/2.0.0-SNAPSHOT/pom.xml
[HUDSON] Archiving <https://hudson.apache.org/hudson/job/Synapse%20-%20Trunk/ws/java/modules/transports/core/vfs/target/synapse-vfs-transport-2.0.0-SNAPSHOT.jar>
to /home/hudson/hudson/jobs/Synapse - Trunk/modules/org.apache.synapse$synapse-vfs-transport/builds/2010-09-13_00-19-41/archive/org.apache.synapse/synapse-vfs-transport/2.0.0-SNAPSHOT/synapse-vfs-transport-2.0.0-SNAPSHOT.jar
[HUDSON] Archiving <https://hudson.apache.org/hudson/job/Synapse%20-%20Trunk/ws/java/modules/transports/core/vfs/target/synapse-vfs-transport-2.0.0-SNAPSHOT-testkit-logs.zip>
to /home/hudson/hudson/jobs/Synapse - Trunk/modules/org.apache.synapse$synapse-vfs-transport/builds/2010-09-13_00-19-41/archive/org.apache.synapse/synapse-vfs-transport/2.0.0-SNAPSHOT/synapse-vfs-transport-2.0.0-SNAPSHOT-testkit-logs.zip
[INFO] ------------------------------------------------------------------------
[INFO] Building Apache Synapse - Tasks classes
[INFO]    task-segment: [clean, install]
[INFO] ------------------------------------------------------------------------
[INFO] [clean:clean {execution: default-clean}]
[INFO] Deleting directory <https://hudson.apache.org/hudson/job/Synapse%20-%20Trunk/ws/java/modules/tasks/target>
[INFO] [remote-resources:process {execution: default}]
[INFO] [resources:resources {execution: default-resources}]
[INFO] Using encoding: 'UTF-8' to copy filtered resources.
[INFO] [compiler:compile {execution: default-compile}]
Compiling 16 source files to <https://hudson.apache.org/hudson/job/Synapse%20-%20Trunk/ws/java/modules/tasks/target/classes>
[INFO] [resources:testResources {execution: default-testResources}]
[INFO] Using encoding: 'UTF-8' to copy filtered resources.
[INFO] [compiler:testCompile {execution: default-testCompile}]
[INFO] No sources to compile
[INFO] [surefire:test {execution: default-test}]
[INFO] Surefire report directory: <https://hudson.apache.org/hudson/job/Synapse%20-%20Trunk/ws/java/modules/tasks/target/surefire-reports>

-------------------------------------------------------
 T E S T S
-------------------------------------------------------
There are no tests to run.

Results :
Tests run: 0, Failures: 0, Errors: 0, Skipped: 0

[HUDSON] Recording test results[INFO] [bundle:bundle {execution: default-bundle}]

[INFO] [install:install {execution: default-install}]
[INFO] Installing <https://hudson.apache.org/hudson/job/Synapse%20-%20Trunk/ws/java/modules/tasks/target/synapse-tasks-2.0.0-SNAPSHOT.jar>
to /home/hudson/.m2/repository/org/apache/synapse/synapse-tasks/2.0.0-SNAPSHOT/synapse-tasks-2.0.0-SNAPSHOT.jar
[INFO] [bundle:install {execution: default-install}]
[INFO] Parsing file:/home/hudson/.m2/repository/repository.xml
[Fatal Error] :-1:-1: Premature end of file.
org.xml.sax.SAXParseException: Premature end of file.
	at com.sun.org.apache.xerces.internal.parsers.DOMParser.parse(DOMParser.java:264)
	at com.sun.org.apache.xerces.internal.jaxp.DocumentBuilderImpl.parse(DocumentBuilderImpl.java:292)
	at javax.xml.parsers.DocumentBuilder.parse(DocumentBuilder.java:172)
	at org.apache.felix.obrplugin.ObrUpdate.parseFile(ObrUpdate.java:347)
	at org.apache.felix.obrplugin.ObrUpdate.parseRepositoryXml(ObrUpdate.java:324)
	at org.apache.felix.obrplugin.ObrInstall.execute(ObrInstall.java:136)
	at org.apache.maven.plugin.DefaultPluginManager.executeMojo(DefaultPluginManager.java:490)
	at hudson.maven.agent.PluginManagerInterceptor.executeMojo(PluginManagerInterceptor.java:182)
	at org.apache.maven.lifecycle.DefaultLifecycleExecutor.executeGoals(DefaultLifecycleExecutor.java:694)
	at org.apache.maven.lifecycle.DefaultLifecycleExecutor.executeGoalWithLifecycle(DefaultLifecycleExecutor.java:556)
	at org.apache.maven.lifecycle.DefaultLifecycleExecutor.executeGoal(DefaultLifecycleExecutor.java:535)
	at org.apache.maven.lifecycle.DefaultLifecycleExecutor.executeGoalAndHandleFailures(DefaultLifecycleExecutor.java:387)
	at org.apache.maven.lifecycle.DefaultLifecycleExecutor.executeTaskSegments(DefaultLifecycleExecutor.java:348)
	at org.apache.maven.lifecycle.DefaultLifecycleExecutor.execute(DefaultLifecycleExecutor.java:180)
	at org.apache.maven.lifecycle.LifecycleExecutorInterceptor.execute(LifecycleExecutorInterceptor.java:65)
	at org.apache.maven.DefaultMaven.doExecute(DefaultMaven.java:328)
	at org.apache.maven.DefaultMaven.execute(DefaultMaven.java:138)
	at org.apache.maven.cli.MavenCli.main(MavenCli.java:362)
	at sun.reflect.NativeMethodAccessorImpl.invoke0(Native Method)
	at sun.reflect.NativeMethodAccessorImpl.invoke(NativeMethodAccessorImpl.java:39)
	at sun.reflect.DelegatingMethodAccessorImpl.invoke(DelegatingMethodAccessorImpl.java:25)
	at java.lang.reflect.Method.invoke(Method.java:592)
	at org.codehaus.classworlds.Launcher.launchEnhanced(Launcher.java:315)
	at org.codehaus.classworlds.Launcher.launch(Launcher.java:255)
	at hudson.maven.agent.Main.launch(Main.java:165)
	at hudson.maven.MavenBuilder.call(MavenBuilder.java:165)
	at hudson.maven.MavenModuleSetBuild$Builder.call(MavenModuleSetBuild.java:681)
	at hudson.maven.MavenModuleSetBuild$Builder.call(MavenModuleSetBuild.java:625)
	at hudson.remoting.UserRequest.perform(UserRequest.java:114)
	at hudson.remoting.UserRequest.perform(UserRequest.java:48)
	at hudson.remoting.Request$2.run(Request.java:270)
	at java.util.concurrent.Executors$RunnableAdapter.call(Executors.java:417)
	at java.util.concurrent.FutureTask$Sync.innerRun(FutureTask.java:269)
	at java.util.concurrent.FutureTask.run(FutureTask.java:123)
	at java.util.concurrent.ThreadPoolExecutor$Worker.runTask(ThreadPoolExecutor.java:651)
	at java.util.concurrent.ThreadPoolExecutor$Worker.run(ThreadPoolExecutor.java:676)
	at java.lang.Thread.run(Thread.java:595)
[INFO] Writing OBR metadata
[WARNING] Exception while updating local OBR: null
java.lang.NullPointerException
	at org.apache.felix.obrplugin.ObrUpdate.writeRepositoryXml(ObrUpdate.java:268)
	at org.apache.felix.obrplugin.ObrInstall.execute(ObrInstall.java:144)
	at org.apache.maven.plugin.DefaultPluginManager.executeMojo(DefaultPluginManager.java:490)
	at hudson.maven.agent.PluginManagerInterceptor.executeMojo(PluginManagerInterceptor.java:182)
	at org.apache.maven.lifecycle.DefaultLifecycleExecutor.executeGoals(DefaultLifecycleExecutor.java:694)
	at org.apache.maven.lifecycle.DefaultLifecycleExecutor.executeGoalWithLifecycle(DefaultLifecycleExecutor.java:556)
	at org.apache.maven.lifecycle.DefaultLifecycleExecutor.executeGoal(DefaultLifecycleExecutor.java:535)
	at org.apache.maven.lifecycle.DefaultLifecycleExecutor.executeGoalAndHandleFailures(DefaultLifecycleExecutor.java:387)
	at org.apache.maven.lifecycle.DefaultLifecycleExecutor.executeTaskSegments(DefaultLifecycleExecutor.java:348)
	at org.apache.maven.lifecycle.DefaultLifecycleExecutor.execute(DefaultLifecycleExecutor.java:180)
	at org.apache.maven.lifecycle.LifecycleExecutorInterceptor.execute(LifecycleExecutorInterceptor.java:65)
	at org.apache.maven.DefaultMaven.doExecute(DefaultMaven.java:328)
	at org.apache.maven.DefaultMaven.execute(DefaultMaven.java:138)
	at org.apache.maven.cli.MavenCli.main(MavenCli.java:362)
	at sun.reflect.NativeMethodAccessorImpl.invoke0(Native Method)
	at sun.reflect.NativeMethodAccessorImpl.invoke(NativeMethodAccessorImpl.java:39)
	at sun.reflect.DelegatingMethodAccessorImpl.invoke(DelegatingMethodAccessorImpl.java:25)
	at java.lang.reflect.Method.invoke(Method.java:592)
	at org.codehaus.classworlds.Launcher.launchEnhanced(Launcher.java:315)
	at org.codehaus.classworlds.Launcher.launch(Launcher.java:255)
	at hudson.maven.agent.Main.launch(Main.java:165)
	at hudson.maven.MavenBuilder.call(MavenBuilder.java:165)
	at hudson.maven.MavenModuleSetBuild$Builder.call(MavenModuleSetBuild.java:681)
	at hudson.maven.MavenModuleSetBuild$Builder.call(MavenModuleSetBuild.java:625)
	at hudson.remoting.UserRequest.perform(UserRequest.java:114)
	at hudson.remoting.UserRequest.perform(UserRequest.java:48)
	at hudson.remoting.Request$2.run(Request.java:270)
	at java.util.concurrent.Executors$RunnableAdapter.call(Executors.java:417)
	at java.util.concurrent.FutureTask$Sync.innerRun(FutureTask.java:269)
	at java.util.concurrent.FutureTask.run(FutureTask.java:123)
	at java.util.concurrent.ThreadPoolExecutor$Worker.runTask(ThreadPoolExecutor.java:651)
	at java.util.concurrent.ThreadPoolExecutor$Worker.run(ThreadPoolExecutor.java:676)
	at java.lang.Thread.run(Thread.java:595)
[HUDSON] Archiving <https://hudson.apache.org/hudson/job/Synapse%20-%20Trunk/ws/java/modules/tasks/pom.xml>
to /home/hudson/hudson/jobs/Synapse - Trunk/modules/org.apache.synapse$synapse-tasks/builds/2010-09-13_00-19-41/archive/org.apache.synapse/synapse-tasks/2.0.0-SNAPSHOT/pom.xml
[HUDSON] Archiving <https://hudson.apache.org/hudson/job/Synapse%20-%20Trunk/ws/java/modules/tasks/target/synapse-tasks-2.0.0-SNAPSHOT.jar>
to /home/hudson/hudson/jobs/Synapse - Trunk/modules/org.apache.synapse$synapse-tasks/builds/2010-09-13_00-19-41/archive/org.apache.synapse/synapse-tasks/2.0.0-SNAPSHOT/synapse-tasks-2.0.0-SNAPSHOT.jar
[INFO] ------------------------------------------------------------------------
[INFO] Building Apache Synapse - Core
[INFO]    task-segment: [clean, install]
[INFO] ------------------------------------------------------------------------
[INFO] [clean:clean {execution: default-clean}]
[INFO] Deleting directory <https://hudson.apache.org/hudson/job/Synapse%20-%20Trunk/ws/java/modules/core/target>
[INFO] [remote-resources:process {execution: default}]
[INFO] snapshot org.apache.axis2:axis2-transport-jms:1.1.0-SNAPSHOT: checking for updates
from apache-snapshots
[INFO] snapshot org.apache.axis2:axis2-transport-jms:1.1.0-SNAPSHOT: checking for updates
from wso2-m2-snapshots
[INFO] snapshot org.apache.axis2:axis2-transport-jms:1.1.0-SNAPSHOT: checking for updates
from apache.snapshots
[INFO] snapshot org.apache.axis2:axis2-transport-mail:1.1.0-SNAPSHOT: checking for updates
from apache-snapshots
[INFO] snapshot org.apache.axis2:axis2-transport-mail:1.1.0-SNAPSHOT: checking for updates
from wso2-m2-snapshots
[INFO] snapshot org.apache.axis2:axis2-transport-mail:1.1.0-SNAPSHOT: checking for updates
from apache.snapshots
[INFO] snapshot org.apache.synapse:synapse-tasks:2.0.0-SNAPSHOT: checking for updates from
apache-snapshots
[INFO] snapshot org.apache.synapse:synapse-tasks:2.0.0-SNAPSHOT: checking for updates from
wso2-m2-snapshots
[INFO] snapshot org.apache.synapse:synapse-tasks:2.0.0-SNAPSHOT: checking for updates from
apache.snapshots
[INFO] snapshot org.apache.synapse:synapse-nhttp-transport:2.0.0-SNAPSHOT: checking for updates
from apache-snapshots
[INFO] snapshot org.apache.synapse:synapse-nhttp-transport:2.0.0-SNAPSHOT: checking for updates
from wso2-m2-snapshots
[INFO] snapshot org.apache.synapse:synapse-nhttp-transport:2.0.0-SNAPSHOT: checking for updates
from apache.snapshots
[INFO] snapshot org.apache.synapse:synapse-vfs-transport:2.0.0-SNAPSHOT: checking for updates
from apache-snapshots
[INFO] snapshot org.apache.synapse:synapse-vfs-transport:2.0.0-SNAPSHOT: checking for updates
from wso2-m2-snapshots
[INFO] snapshot org.apache.synapse:synapse-vfs-transport:2.0.0-SNAPSHOT: checking for updates
from apache.snapshots
[INFO] [resources:resources {execution: default-resources}]
[INFO] Using encoding: 'UTF-8' to copy filtered resources.
[INFO] [compiler:compile {execution: default-compile}]
Compiling 374 source files to <https://hudson.apache.org/hudson/job/Synapse%20-%20Trunk/ws/java/modules/core/target/classes>
[INFO] [dependency:copy {execution: copy}]
[INFO] Configured Artifact: org.apache.axis2:addressing:1.5:mar
[INFO] Copying addressing-1.5.mar to <https://hudson.apache.org/hudson/job/Synapse%20-%20Trunk/ws/java/modules/core/target/test_repos/synapse/modules/addressing-1.5.mar>
[INFO] [antrun:run {execution: create_repo}]
[INFO] Executing tasks
     [echo] *** Creating a testing repository ***
    [mkdir] Created dir: <https://hudson.apache.org/hudson/job/Synapse%20-%20Trunk/ws/java/modules/core/target/test_repos/synapse/services>
    [mkdir] Created dir: <https://hudson.apache.org/hudson/job/Synapse%20-%20Trunk/ws/java/modules/core/target/test_repos/client/modules>
[INFO] Executed tasks
[INFO] [resources:testResources {execution: default-testResources}]
[INFO] Using encoding: 'UTF-8' to copy filtered resources.
[INFO] [compiler:testCompile {execution: default-testCompile}]
Compiling 85 source files to <https://hudson.apache.org/hudson/job/Synapse%20-%20Trunk/ws/java/modules/core/target/test-classes>
[HUDSON] Archiving <https://hudson.apache.org/hudson/job/Synapse%20-%20Trunk/ws/java/modules/core/pom.xml>
to /home/hudson/hudson/jobs/Synapse - Trunk/modules/org.apache.synapse$synapse-core/builds/2010-09-13_00-19-41/archive/org.apache.synapse/synapse-core/2.0.0-SNAPSHOT/pom.xml
[INFO] ------------------------------------------------------------------------
[ERROR] BUILD FAILURE
[INFO] ------------------------------------------------------------------------
[INFO] Compilation failure

<https://hudson.apache.org/hudson/job/Synapse%20-%20Trunk/ws/java/modules/core/src/test/java/org/apache/synapse/mediators/transform/url/URLRewriteMediatorTest.java>:[114,15]
cannot find symbol
symbol  : method setFragment(java.lang.String)
location: class org.apache.synapse.commons.evaluators.source.URLTextRetriever

<https://hudson.apache.org/hudson/job/Synapse%20-%20Trunk/ws/java/modules/core/src/test/java/org/apache/synapse/mediators/transform/url/URLRewriteMediatorTest.java>:[138,15]
cannot find symbol
symbol  : method setFragment(java.lang.String)
location: class org.apache.synapse.commons.evaluators.source.URLTextRetriever

<https://hudson.apache.org/hudson/job/Synapse%20-%20Trunk/ws/java/modules/core/src/test/java/org/apache/synapse/mediators/transform/url/URLRewriteMediatorTest.java>:[163,16]
cannot find symbol
symbol  : method setFragment(java.lang.String)
location: class org.apache.synapse.commons.evaluators.source.URLTextRetriever

<https://hudson.apache.org/hudson/job/Synapse%20-%20Trunk/ws/java/modules/core/src/test/java/org/apache/synapse/mediators/transform/url/URLRewriteMediatorTest.java>:[182,16]
cannot find symbol
symbol  : method setFragment(java.lang.String)
location: class org.apache.synapse.commons.evaluators.source.URLTextRetriever


[INFO] ------------------------------------------------------------------------
[INFO] For more information, run Maven with the -e switch
[INFO] ------------------------------------------------------------------------
[INFO] Total time: 1 minute 40 seconds
[INFO] Finished at: Mon Sep 13 00:21:31 UTC 2010
[INFO] Final Memory: 55M/203M
[INFO] ------------------------------------------------------------------------
Sending e-mails to: dev@synapse.apache.org
channel stopped
[locks-and-latches] Releasing all the locks
[locks-and-latches] All the locks released


---------------------------------------------------------------------
To unsubscribe, e-mail: dev-unsubscribe@synapse.apache.org
For additional commands, e-mail: dev-help@synapse.apache.org


Mime
View raw message