synapse-dev mailing list archives

Site index · List index
Message view « Date » · « Thread »
Top « Date » · « Thread »
From Apache Hudson Server <hud...@hudson.apache.org>
Subject Build failed in Hudson: Synapse - Trunk #3189
Date Sun, 30 Jan 2011 12:19:43 GMT
See <https://hudson.apache.org/hudson/job/Synapse%20-%20Trunk/3189/>

------------------------------------------
[...truncated 2436 lines...]
Downloading: http://dist.wso2.org/maven2/net/sf/saxon/saxon-dom/8.9/saxon-dom-8.9.pom
Downloading: http://repo1.maven.org/maven2/net/sf/saxon/saxon-dom/8.9/saxon-dom-8.9.pom
[WARNING] Missing POM for net.sf.saxon:saxon-dom:jar:8.9
Downloading: http://maven.atlassian.com/repository/public/net/sf/saxon/saxon-xqj/8.9/saxon-xqj-8.9.pom
Downloading: http://people.apache.org/repo/m2-snapshot-repository/net/sf/saxon/saxon-xqj/8.9/saxon-xqj-8.9.pom
Downloading: http://dist.wso2.org/maven2/net/sf/saxon/saxon-xqj/8.9/saxon-xqj-8.9.pom
Downloading: http://repo1.maven.org/maven2/net/sf/saxon/saxon-xqj/8.9/saxon-xqj-8.9.pom
[WARNING] Missing POM for net.sf.saxon:saxon-xqj:jar:8.9
[INFO] Processing DependencySet (output=synapse-${synapse.version}/samples/util)
Downloading: http://maven.atlassian.com/repository/public/java-cup/java-cup/0.0/java-cup-0.0.pom
Downloading: http://people.apache.org/repo/m2-snapshot-repository/java-cup/java-cup/0.0/java-cup-0.0.pom
Downloading: http://dist.wso2.org/maven2/java-cup/java-cup/0.0/java-cup-0.0.pom
Downloading: http://repo1.maven.org/maven2/java-cup/java-cup/0.0/java-cup-0.0.pom
[WARNING] Missing POM for java-cup:java-cup:jar:0.0
Downloading: http://maven.atlassian.com/repository/public/JLex/JLex/0.0/JLex-0.0.pom
Downloading: http://people.apache.org/repo/m2-snapshot-repository/JLex/JLex/0.0/JLex-0.0.pom
Downloading: http://dist.wso2.org/maven2/JLex/JLex/0.0/JLex-0.0.pom
Downloading: http://repo1.maven.org/maven2/JLex/JLex/0.0/JLex-0.0.pom
[WARNING] Missing POM for JLex:JLex:jar:0.0
Downloading: http://maven.atlassian.com/repository/public/net/sf/saxon/saxon/8.9/saxon-8.9.pom
Downloading: http://people.apache.org/repo/m2-snapshot-repository/net/sf/saxon/saxon/8.9/saxon-8.9.pom
Downloading: http://dist.wso2.org/maven2/net/sf/saxon/saxon/8.9/saxon-8.9.pom
Downloading: http://repo1.maven.org/maven2/net/sf/saxon/saxon/8.9/saxon-8.9.pom
[WARNING] Missing POM for net.sf.saxon:saxon:jar:8.9
Downloading: http://maven.atlassian.com/repository/public/net/sf/saxon/saxon-dom/8.9/saxon-dom-8.9.pom
Downloading: http://people.apache.org/repo/m2-snapshot-repository/net/sf/saxon/saxon-dom/8.9/saxon-dom-8.9.pom
Downloading: http://dist.wso2.org/maven2/net/sf/saxon/saxon-dom/8.9/saxon-dom-8.9.pom
Downloading: http://repo1.maven.org/maven2/net/sf/saxon/saxon-dom/8.9/saxon-dom-8.9.pom
[WARNING] Missing POM for net.sf.saxon:saxon-dom:jar:8.9
Downloading: http://maven.atlassian.com/repository/public/net/sf/saxon/saxon-xqj/8.9/saxon-xqj-8.9.pom
Downloading: http://people.apache.org/repo/m2-snapshot-repository/net/sf/saxon/saxon-xqj/8.9/saxon-xqj-8.9.pom
Downloading: http://dist.wso2.org/maven2/net/sf/saxon/saxon-xqj/8.9/saxon-xqj-8.9.pom
Downloading: http://repo1.maven.org/maven2/net/sf/saxon/saxon-xqj/8.9/saxon-xqj-8.9.pom
[WARNING] Missing POM for net.sf.saxon:saxon-xqj:jar:8.9
Downloading: http://maven.atlassian.com/repository/public/org/apache/bsf/bsf-all/3.0/bsf-all-3.0.pom
Downloading: http://people.apache.org/repo/m2-snapshot-repository/org/apache/bsf/bsf-all/3.0/bsf-all-3.0.pom
Downloading: http://dist.wso2.org/maven2/org/apache/bsf/bsf-all/3.0/bsf-all-3.0.pom
Downloading: http://repo1.maven.org/maven2/org/apache/bsf/bsf-all/3.0/bsf-all-3.0.pom
[WARNING] Missing POM for org.apache.bsf:bsf-all:jar:3.0
Downloading: http://maven.atlassian.com/repository/public/java-cup/java-cup/0.0/java-cup-0.0.pom
Downloading: http://people.apache.org/repo/m2-snapshot-repository/java-cup/java-cup/0.0/java-cup-0.0.pom
Downloading: http://dist.wso2.org/maven2/java-cup/java-cup/0.0/java-cup-0.0.pom
Downloading: http://repo1.maven.org/maven2/java-cup/java-cup/0.0/java-cup-0.0.pom
[WARNING] Missing POM for java-cup:java-cup:jar:0.0
Downloading: http://maven.atlassian.com/repository/public/JLex/JLex/0.0/JLex-0.0.pom
Downloading: http://people.apache.org/repo/m2-snapshot-repository/JLex/JLex/0.0/JLex-0.0.pom
Downloading: http://dist.wso2.org/maven2/JLex/JLex/0.0/JLex-0.0.pom
Downloading: http://repo1.maven.org/maven2/JLex/JLex/0.0/JLex-0.0.pom
[WARNING] Missing POM for JLex:JLex:jar:0.0
Downloading: http://maven.atlassian.com/repository/public/net/sf/saxon/saxon/8.9/saxon-8.9.pom
Downloading: http://people.apache.org/repo/m2-snapshot-repository/net/sf/saxon/saxon/8.9/saxon-8.9.pom
Downloading: http://dist.wso2.org/maven2/net/sf/saxon/saxon/8.9/saxon-8.9.pom
Downloading: http://repo1.maven.org/maven2/net/sf/saxon/saxon/8.9/saxon-8.9.pom
[WARNING] Missing POM for net.sf.saxon:saxon:jar:8.9
Downloading: http://maven.atlassian.com/repository/public/net/sf/saxon/saxon-dom/8.9/saxon-dom-8.9.pom
Downloading: http://people.apache.org/repo/m2-snapshot-repository/net/sf/saxon/saxon-dom/8.9/saxon-dom-8.9.pom
Downloading: http://dist.wso2.org/maven2/net/sf/saxon/saxon-dom/8.9/saxon-dom-8.9.pom
Downloading: http://repo1.maven.org/maven2/net/sf/saxon/saxon-dom/8.9/saxon-dom-8.9.pom
[WARNING] Missing POM for net.sf.saxon:saxon-dom:jar:8.9
Downloading: http://maven.atlassian.com/repository/public/net/sf/saxon/saxon-xqj/8.9/saxon-xqj-8.9.pom
Downloading: http://people.apache.org/repo/m2-snapshot-repository/net/sf/saxon/saxon-xqj/8.9/saxon-xqj-8.9.pom
Downloading: http://dist.wso2.org/maven2/net/sf/saxon/saxon-xqj/8.9/saxon-xqj-8.9.pom
Downloading: http://repo1.maven.org/maven2/net/sf/saxon/saxon-xqj/8.9/saxon-xqj-8.9.pom
[WARNING] Missing POM for net.sf.saxon:saxon-xqj:jar:8.9
[INFO] Building zip: <https://hudson.apache.org/hudson/job/Synapse%20-%20Trunk/ws/java/modules/distribution/target/synapse-2.1.0-SNAPSHOT-bin.zip>
[INFO] Installing <https://hudson.apache.org/hudson/job/Synapse%20-%20Trunk/ws/java/modules/distribution/pom.xml>
to /home/hudson/.m2/repository/org/apache/synapse/synapse-distribution/2.1.0-SNAPSHOT/synapse-distribution-2.1.0-SNAPSHOT.pom
[INFO] [INFO] Installing <https://hudson.apache.org/hudson/job/Synapse%20-%20Trunk/ws/java/modules/distribution/target/synapse-2.1.0-SNAPSHOT-bin.zip>
to /home/hudson/.m2/repository/org/apache/synapse/synapse-distribution/2.1.0-SNAPSHOT/synapse-distribution-2.1.0-SNAPSHOT-bin.zip

[INFO] --- maven-install-plugin:2.3:install (default-install) @ synapse-distribution ---
projectSucceeded org.apache.synapse:synapse-distribution:2.1.0-SNAPSHOT
[HUDSON] Archiving <https://hudson.apache.org/hudson/job/Synapse%20-%20Trunk/ws/java/modules/distribution/pom.xml>
to /home/hudson/hudson/jobs/Synapse - Trunk/modules/org.apache.synapse$synapse-distribution/builds/2011-01-30_12-03-29/archive/org.apache.synapse/synapse-distribution/2.1.0-SNAPSHOT/pom.xml
[HUDSON] Archiving <https://hudson.apache.org/hudson/job/Synapse%20-%20Trunk/ws/java/modules/distribution/target/synapse-2.1.0-SNAPSHOT-bin.zip>
to /home/hudson/hudson/jobs/Synapse - Trunk/modules/org.apache.synapse$synapse-distribution/builds/2011-01-30_12-03-29/archive/org.apache.synapse/synapse-distribution/2.1.0-SNAPSHOT/synapse-2.1.0-SNAPSHOT-bin.zip
[INFO] [INFO] Deleting directory <https://hudson.apache.org/hudson/job/Synapse%20-%20Trunk/ws/java/modules/packaging/package-skeleton/target>
                                                                        
[INFO] ------------------------------------------------------------------------
[INFO] Building Apache Synapse - Package skeleton ZIP 2.1.0-SNAPSHOT
[INFO] ------------------------------------------------------------------------
[INFO] 
[INFO] --- maven-clean-plugin:2.2:clean (default-clean) @ synapse-package-skeleton ---
[INFO] Downloading: http://people.apache.org/repo/m2-snapshot-repository/net/sf/saxon/saxon-dom/8.9/saxon-dom-8.9.pom

[INFO] --- maven-remote-resources-plugin:1.1:process (default) @ synapse-package-skeleton
---
Downloading: http://dist.wso2.org/maven2/net/sf/saxon/saxon-dom/8.9/saxon-dom-8.9.pom
Downloading: http://repo1.maven.org/maven2/net/sf/saxon/saxon-dom/8.9/saxon-dom-8.9.pom
Downloading: http://people.apache.org/repo/m2-snapshot-repository/net/sf/saxon/saxon-xqj/8.9/saxon-xqj-8.9.pom
Downloading: http://dist.wso2.org/maven2/net/sf/saxon/saxon-xqj/8.9/saxon-xqj-8.9.pom
Downloading: http://repo1.maven.org/maven2/net/sf/saxon/saxon-xqj/8.9/saxon-xqj-8.9.pom
Downloading: http://people.apache.org/repo/m2-snapshot-repository/JLex/JLex/0.0/JLex-0.0.pom
Downloading: http://dist.wso2.org/maven2/JLex/JLex/0.0/JLex-0.0.pom
Downloading: http://repo1.maven.org/maven2/JLex/JLex/0.0/JLex-0.0.pom
Downloading: http://people.apache.org/repo/m2-snapshot-repository/net/sf/saxon/saxon/8.9/saxon-8.9.pom
Downloading: http://dist.wso2.org/maven2/net/sf/saxon/saxon/8.9/saxon-8.9.pom
Downloading: http://repo1.maven.org/maven2/net/sf/saxon/saxon/8.9/saxon-8.9.pom
Downloading: http://people.apache.org/repo/m2-snapshot-repository/java-cup/java-cup/0.0/java-cup-0.0.pom
Downloading: http://dist.wso2.org/maven2/java-cup/java-cup/0.0/java-cup-0.0.pom
Downloading: http://repo1.maven.org/maven2/java-cup/java-cup/0.0/java-cup-0.0.pom
[INFO] [INFO] Reading assembly descriptor: src/main/assembly/skeleton.xml

[INFO] --- maven-assembly-plugin:2.2-beta-2:single (skeleton-package) @ synapse-package-skeleton
---
[INFO] Building zip: <https://hudson.apache.org/hudson/job/Synapse%20-%20Trunk/ws/java/modules/packaging/package-skeleton/target/synapse-package-skeleton-2.1.0-SNAPSHOT.zip>
[INFO] [INFO] Installing <https://hudson.apache.org/hudson/job/Synapse%20-%20Trunk/ws/java/modules/packaging/package-skeleton/pom.xml>
to /home/hudson/.m2/repository/org/apache/synapse/synapse-package-skeleton/2.1.0-SNAPSHOT/synapse-package-skeleton-2.1.0-SNAPSHOT.pom
[INFO] Installing <https://hudson.apache.org/hudson/job/Synapse%20-%20Trunk/ws/java/modules/packaging/package-skeleton/target/synapse-package-skeleton-2.1.0-SNAPSHOT.zip>
to /home/hudson/.m2/repository/org/apache/synapse/synapse-package-skeleton/2.1.0-SNAPSHOT/synapse-package-skeleton-2.1.0-SNAPSHOT.zip

[INFO] --- maven-install-plugin:2.3:install (default-install) @ synapse-package-skeleton ---
projectSucceeded org.apache.synapse:synapse-package-skeleton:2.1.0-SNAPSHOT
[HUDSON] Archiving <https://hudson.apache.org/hudson/job/Synapse%20-%20Trunk/ws/java/modules/packaging/package-skeleton/pom.xml>
to /home/hudson/hudson/jobs/Synapse - Trunk/modules/org.apache.synapse$synapse-package-skeleton/builds/2011-01-30_12-03-29/archive/org.apache.synapse/synapse-package-skeleton/2.1.0-SNAPSHOT/pom.xml
[HUDSON] Archiving <https://hudson.apache.org/hudson/job/Synapse%20-%20Trunk/ws/java/modules/packaging/package-skeleton/target/synapse-package-skeleton-2.1.0-SNAPSHOT.zip>
to /home/hudson/hudson/jobs/Synapse - Trunk/modules/org.apache.synapse$synapse-package-skeleton/builds/2011-01-30_12-03-29/archive/org.apache.synapse/synapse-package-skeleton/2.1.0-SNAPSHOT/synapse-package-skeleton-2.1.0-SNAPSHOT.zip
[INFO] [INFO] Deleting directory <https://hudson.apache.org/hudson/job/Synapse%20-%20Trunk/ws/java/modules/packaging/package-archetype/target>
                                                                        
[INFO] ------------------------------------------------------------------------
[INFO] Building Apache Synapse - Package archetype 2.1.0-SNAPSHOT
[INFO] ------------------------------------------------------------------------
[INFO] 
[INFO] --- maven-clean-plugin:2.2:clean (default-clean) @ synapse-package-archetype ---
[INFO] Downloading: http://people.apache.org/repo/m2-snapshot-repository/net/sf/saxon/saxon-dom/8.9/saxon-dom-8.9.pom

[INFO] --- maven-remote-resources-plugin:1.1:process (default) @ synapse-package-archetype
---
Downloading: http://dist.wso2.org/maven2/net/sf/saxon/saxon-dom/8.9/saxon-dom-8.9.pom
Downloading: http://repo1.maven.org/maven2/net/sf/saxon/saxon-dom/8.9/saxon-dom-8.9.pom
Downloading: http://people.apache.org/repo/m2-snapshot-repository/net/sf/saxon/saxon-xqj/8.9/saxon-xqj-8.9.pom
Downloading: http://dist.wso2.org/maven2/net/sf/saxon/saxon-xqj/8.9/saxon-xqj-8.9.pom
Downloading: http://repo1.maven.org/maven2/net/sf/saxon/saxon-xqj/8.9/saxon-xqj-8.9.pom
Downloading: http://people.apache.org/repo/m2-snapshot-repository/JLex/JLex/0.0/JLex-0.0.pom
Downloading: http://dist.wso2.org/maven2/JLex/JLex/0.0/JLex-0.0.pom
Downloading: http://repo1.maven.org/maven2/JLex/JLex/0.0/JLex-0.0.pom
Downloading: http://people.apache.org/repo/m2-snapshot-repository/net/sf/saxon/saxon/8.9/saxon-8.9.pom
Downloading: http://dist.wso2.org/maven2/net/sf/saxon/saxon/8.9/saxon-8.9.pom
Downloading: http://repo1.maven.org/maven2/net/sf/saxon/saxon/8.9/saxon-8.9.pom
Downloading: http://people.apache.org/repo/m2-snapshot-repository/java-cup/java-cup/0.0/java-cup-0.0.pom
Downloading: http://dist.wso2.org/maven2/java-cup/java-cup/0.0/java-cup-0.0.pom
Downloading: http://repo1.maven.org/maven2/java-cup/java-cup/0.0/java-cup-0.0.pom
[INFO] 
[INFO] --- maven-resources-plugin:2.3:resources (default-resources) @ synapse-package-archetype
---
[INFO] Using 'UTF-8' encoding to copy filtered resources.
[INFO] Copying 7 resources
[INFO] Copying 3 resources
[INFO] [INFO] Using 'UTF-8' encoding to copy filtered resources.
[INFO] skip non existing resourceDirectory <https://hudson.apache.org/hudson/job/Synapse%20-%20Trunk/ws/java/modules/packaging/package-archetype/src/test/resources>
[INFO] Copying 3 resources

[INFO] --- maven-resources-plugin:2.3:testResources (default-testResources) @ synapse-package-archetype
---
[INFO] 
[INFO] --- maven-archetype-plugin:2.0-alpha-4:jar (default-jar) @ synapse-package-archetype
---
[INFO] Setting property: classpath.resource.loader.class => 'org.codehaus.plexus.velocity.ContextClassLoaderResourceLoader'.
[INFO] Setting property: velocimacro.messages.on => 'false'.
[INFO] Setting property: resource.loader => 'classpath'.
[INFO] Setting property: resource.manager.logwhenfound => 'false'.
[INFO] 
[INFO] --- maven-archetype-plugin:2.0-alpha-4:add-archetype-metadata (default-add-archetype-metadata)
@ synapse-package-archetype ---
[INFO] 
[INFO] --- maven-archetype-plugin:2.0-alpha-4:integration-test (default-integration-test)
@ synapse-package-archetype ---
[INFO] [INFO] Installing <https://hudson.apache.org/hudson/job/Synapse%20-%20Trunk/ws/java/modules/packaging/package-archetype/target/synapse-package-archetype-2.1.0-SNAPSHOT.jar>
to /home/hudson/.m2/repository/org/apache/synapse/synapse-package-archetype/2.1.0-SNAPSHOT/synapse-package-archetype-2.1.0-SNAPSHOT.jar
[INFO] Installing <https://hudson.apache.org/hudson/job/Synapse%20-%20Trunk/ws/java/modules/packaging/package-archetype/pom.xml>
to /home/hudson/.m2/repository/org/apache/synapse/synapse-package-archetype/2.1.0-SNAPSHOT/synapse-package-archetype-2.1.0-SNAPSHOT.pom

[INFO] --- maven-install-plugin:2.3:install (default-install) @ synapse-package-archetype
---
[INFO] 
[INFO] --- maven-archetype-plugin:2.0-alpha-4:update-local-catalog (default-update-local-catalog)
@ synapse-package-archetype ---
projectSucceeded org.apache.synapse:synapse-package-archetype:2.1.0-SNAPSHOT
[HUDSON] Archiving <https://hudson.apache.org/hudson/job/Synapse%20-%20Trunk/ws/java/modules/packaging/package-archetype/pom.xml>
to /home/hudson/hudson/jobs/Synapse - Trunk/modules/org.apache.synapse$synapse-package-archetype/builds/2011-01-30_12-03-29/archive/org.apache.synapse/synapse-package-archetype/2.1.0-SNAPSHOT/pom.xml
[HUDSON] Archiving <https://hudson.apache.org/hudson/job/Synapse%20-%20Trunk/ws/java/modules/packaging/package-archetype/target/synapse-package-archetype-2.1.0-SNAPSHOT.jar>
to /home/hudson/hudson/jobs/Synapse - Trunk/modules/org.apache.synapse$synapse-package-archetype/builds/2011-01-30_12-03-29/archive/org.apache.synapse/synapse-package-archetype/2.1.0-SNAPSHOT/synapse-package-archetype-2.1.0-SNAPSHOT.jar
sessionEnded
[INFO] ------------------------------------------------------------------------
[INFO] Reactor Summary:
[INFO] 
[INFO] Apache Synapse - Secure vault ..................... SUCCESS [13.607s]
[INFO] Apache Synapse .................................... SUCCESS [9.398s]
[INFO] Apache Synapse - Commons classes .................. SUCCESS [20.938s]
[INFO] Apache Synapse - Transports ....................... SUCCESS [4.518s]
[INFO] Apache Synapse - Non-blocking HTTP/s Transport .... SUCCESS [17.918s]
[INFO] Apache Synapse - PIPE Transport ................... SUCCESS [5.364s]
[INFO] Apache Synapse - VFS Transport .................... SUCCESS [15.151s]
[INFO] Apache Synapse - Tasks classes .................... SUCCESS [4.995s]
[INFO] Apache Synapse - Core ............................. SUCCESS [2:14.663s]
[INFO] Apache Synapse - FIX Transport .................... SUCCESS [7.967s]
[INFO] Apache Synapse - Extensions ....................... SUCCESS [20.508s]
[INFO] Apache Synapse - Samples .......................... SUCCESS [9.839s]
[INFO] Apache Synapse - Patches .......................... SUCCESS [5.069s]
[INFO] Apache Synapse - Experimental code ................ SUCCESS [5.494s]
[INFO] Apache Synapse - Web Application .................. SUCCESS [13.668s]
[INFO] Apache Synapse - Handler Module ................... SUCCESS [7.620s]
[INFO] Apache Synapse - XAR Maven Plugin ................. SUCCESS [4.926s]
[INFO] Apache Synapse - Configuration Migrator ........... SUCCESS [5.545s]
[INFO] Apache Synapse - Distribution ..................... SUCCESS [1:23.183s]
[INFO] Apache Synapse - Package skeleton ZIP ............. SUCCESS [4.686s]
[INFO] Apache Synapse - Package archetype ................ SUCCESS [4.953s]
[INFO] ------------------------------------------------------------------------
[INFO] BUILD SUCCESS
[INFO] ------------------------------------------------------------------------
[INFO] Total time: 15:58.128s
[INFO] Finished at: Sun Jan 30 04:19:40 GMT-08:00 2011
[INFO] Final Memory: 70M/263M
[INFO] ------------------------------------------------------------------------
maven builder waiting
channel stopped
[locks-and-latches] Releasing all the locks
[locks-and-latches] All the locks released
Deploying artifacts to https://repository.apache.org/content/repositories/snapshots
uniqueVersion == false is not anymore supported in maven 3
Deploying the main artifact pom.xml
ERROR: Error retrieving previous build number for artifact 'org.apache.synapse:Apache-Synapse:pom':
repository metadata for: 'snapshot org.apache.synapse:Apache-Synapse:2.1.0-SNAPSHOT' could
not be retrieved from repository: apache.snapshots.https due to an error: Error transferring
file: Server returned HTTP response code: 502 for URL: https://repository.apache.org/content/repositories/snapshots/org/apache/synapse/Apache-Synapse/2.1.0-SNAPSHOT/maven-metadata.xml
org.apache.maven.artifact.deployer.ArtifactDeploymentException: Error retrieving previous
build number for artifact 'org.apache.synapse:Apache-Synapse:pom': repository metadata for:
'snapshot org.apache.synapse:Apache-Synapse:2.1.0-SNAPSHOT' could not be retrieved from repository:
apache.snapshots.https due to an error: Error transferring file: Server returned HTTP response
code: 502 for URL: https://repository.apache.org/content/repositories/snapshots/org/apache/synapse/Apache-Synapse/2.1.0-SNAPSHOT/maven-metadata.xml
	at hudson.maven.artifact.transform.SnapshotTransformation.transformForDeployment(SnapshotTransformation.java:110)
	at hudson.maven.artifact.transform.DefaultArtifactTransformationManager.transformForDeployment(DefaultArtifactTransformationManager.java:71)
	at hudson.maven.artifact.deployer.DefaultArtifactDeployer.deploy(DefaultArtifactDeployer.java:92)
	at hudson.maven.reporters.MavenArtifactRecord.deployMavenArtifact(MavenArtifactRecord.java:139)
	at hudson.maven.reporters.MavenArtifactRecord.deploy(MavenArtifactRecord.java:126)
	at hudson.maven.RedeployPublisher.perform(RedeployPublisher.java:128)
	at hudson.tasks.BuildStepMonitor$1.perform(BuildStepMonitor.java:19)
	at hudson.model.AbstractBuild$AbstractRunner.perform(AbstractBuild.java:622)
	at hudson.model.AbstractBuild$AbstractRunner.performAllBuildSteps(AbstractBuild.java:601)
	at hudson.maven.MavenModuleSetBuild$RunnerImpl.post2(MavenModuleSetBuild.java:762)
	at hudson.model.AbstractBuild$AbstractRunner.post(AbstractBuild.java:548)
	at hudson.model.Run.run(Run.java:1386)
	at hudson.maven.MavenModuleSetBuild.run(MavenModuleSetBuild.java:405)
	at hudson.model.ResourceController.execute(ResourceController.java:88)
	at hudson.model.Executor.run(Executor.java:145)
Caused by: org.apache.maven.artifact.repository.metadata.RepositoryMetadataResolutionException:
repository metadata for: 'snapshot org.apache.synapse:Apache-Synapse:2.1.0-SNAPSHOT' could
not be retrieved from repository: apache.snapshots.https due to an error: Error transferring
file: Server returned HTTP response code: 502 for URL: https://repository.apache.org/content/repositories/snapshots/org/apache/synapse/Apache-Synapse/2.1.0-SNAPSHOT/maven-metadata.xml
	at org.apache.maven.artifact.repository.metadata.DefaultRepositoryMetadataManager.resolveAlways(DefaultRepositoryMetadataManager.java:400)
	at hudson.maven.artifact.transform.SnapshotTransformation.resolveLatestSnapshotBuildNumber(SnapshotTransformation.java:158)
	at hudson.maven.artifact.transform.SnapshotTransformation.transformForDeployment(SnapshotTransformation.java:104)
	... 14 more
Caused by: org.apache.maven.wagon.TransferFailedException: Error transferring file: Server
returned HTTP response code: 502 for URL: https://repository.apache.org/content/repositories/snapshots/org/apache/synapse/Apache-Synapse/2.1.0-SNAPSHOT/maven-metadata.xml
	at org.apache.maven.wagon.providers.http.LightweightHttpWagon.fillInputData(LightweightHttpWagon.java:143)
	at org.apache.maven.wagon.StreamWagon.getInputStream(StreamWagon.java:116)
	at org.apache.maven.wagon.StreamWagon.getIfNewer(StreamWagon.java:88)
	at org.apache.maven.wagon.StreamWagon.get(StreamWagon.java:61)
	at org.apache.maven.repository.legacy.DefaultWagonManager.getRemoteFile(DefaultWagonManager.java:351)
	at org.apache.maven.repository.legacy.DefaultWagonManager.getArtifactMetadataFromDeploymentRepository(DefaultWagonManager.java:215)
	at org.apache.maven.artifact.repository.metadata.DefaultRepositoryMetadataManager.getArtifactMetadataFromDeploymentRepository(DefaultRepositoryMetadataManager.java:424)
	at org.apache.maven.artifact.repository.metadata.DefaultRepositoryMetadataManager.resolveAlways(DefaultRepositoryMetadataManager.java:396)
	... 16 more
Caused by: java.io.IOException: Server returned HTTP response code: 502 for URL: https://repository.apache.org/content/repositories/snapshots/org/apache/synapse/Apache-Synapse/2.1.0-SNAPSHOT/maven-metadata.xml
	at sun.reflect.NativeConstructorAccessorImpl.newInstance0(Native Method)
	at sun.reflect.NativeConstructorAccessorImpl.newInstance(NativeConstructorAccessorImpl.java:39)
	at sun.reflect.DelegatingConstructorAccessorImpl.newInstance(DelegatingConstructorAccessorImpl.java:27)
	at java.lang.reflect.Constructor.newInstance(Constructor.java:513)
	at sun.net.www.protocol.http.HttpURLConnection$6.run(HttpURLConnection.java:1496)
	at java.security.AccessController.doPrivileged(Native Method)
	at sun.net.www.protocol.http.HttpURLConnection.getChainedException(HttpURLConnection.java:1490)
	at sun.net.www.protocol.http.HttpURLConnection.getInputStream(HttpURLConnection.java:1144)
	at sun.net.www.protocol.https.HttpsURLConnectionImpl.getInputStream(HttpsURLConnectionImpl.java:234)
	at org.apache.maven.wagon.providers.http.LightweightHttpWagon.fillInputData(LightweightHttpWagon.java:122)
	... 23 more
Caused by: java.io.IOException: Server returned HTTP response code: 502 for URL: https://repository.apache.org/content/repositories/snapshots/org/apache/synapse/Apache-Synapse/2.1.0-SNAPSHOT/maven-metadata.xml
	at sun.net.www.protocol.http.HttpURLConnection.getInputStream(HttpURLConnection.java:1441)
	at java.net.HttpURLConnection.getResponseCode(HttpURLConnection.java:379)
	at sun.net.www.protocol.https.HttpsURLConnectionImpl.getResponseCode(HttpsURLConnectionImpl.java:318)
	at org.apache.maven.wagon.providers.http.LightweightHttpWagon.fillInputData(LightweightHttpWagon.java:115)
	... 23 more


---------------------------------------------------------------------
To unsubscribe, e-mail: dev-unsubscribe@synapse.apache.org
For additional commands, e-mail: dev-help@synapse.apache.org


Mime
View raw message