synapse-dev mailing list archives

Site index · List index
Message view « Date » · « Thread »
Top « Date » · « Thread »
From Apache Jenkins Server <jenk...@builds.apache.org>
Subject Build failed in Jenkins: Synapse - Trunk #4070
Date Mon, 26 Dec 2011 12:03:35 GMT
See <https://builds.apache.org/job/Synapse%20-%20Trunk/4070/changes>

Changes:

[hiranya] Upgrading javadoc plugin to latest stable - This fixes the last build break at Jenkins

------------------------------------------
[...truncated 1554 lines...]
	at org.apache.maven.lifecycle.internal.LifecycleStarter.singleThreadedBuild(LifecycleStarter.java:183)
	at org.apache.maven.lifecycle.internal.LifecycleStarter.execute(LifecycleStarter.java:161)
	at org.apache.maven.DefaultMaven.doExecute(DefaultMaven.java:319)
	at org.apache.maven.DefaultMaven.execute(DefaultMaven.java:156)
	at org.jvnet.hudson.maven3.launcher.Maven3Launcher.main(Maven3Launcher.java:79)
	at sun.reflect.NativeMethodAccessorImpl.invoke0(Native Method)
	at sun.reflect.NativeMethodAccessorImpl.invoke(NativeMethodAccessorImpl.java:39)
	at sun.reflect.DelegatingMethodAccessorImpl.invoke(DelegatingMethodAccessorImpl.java:25)
	at java.lang.reflect.Method.invoke(Method.java:592)
	at org.codehaus.plexus.classworlds.launcher.Launcher.launchStandard(Launcher.java:329)
	at org.codehaus.plexus.classworlds.launcher.Launcher.launch(Launcher.java:239)
	at org.jvnet.hudson.maven3.agent.Maven3Main.launch(Maven3Main.java:158)
	at hudson.maven.Maven3Builder.call(Maven3Builder.java:122)
	at hudson.maven.Maven3Builder.call(Maven3Builder.java:74)
	at hudson.remoting.UserRequest.perform(UserRequest.java:118)
	at hudson.remoting.UserRequest.perform(UserRequest.java:48)
	at hudson.remoting.Request$2.run(Request.java:287)
	at java.util.concurrent.Executors$RunnableAdapter.call(Executors.java:417)
	at java.util.concurrent.FutureTask$Sync.innerRun(FutureTask.java:269)
	at java.util.concurrent.FutureTask.run(FutureTask.java:123)
	at java.util.concurrent.ThreadPoolExecutor$Worker.runTask(ThreadPoolExecutor.java:651)
	at java.util.concurrent.ThreadPoolExecutor$Worker.run(ThreadPoolExecutor.java:676)
	at java.lang.Thread.run(Thread.java:595)
[INFO] Generating "JavaDocs" report    --- maven-javadoc-plugin:2.8
[INFO] 
Loading source files for package org.apache.synapse.securevault...
Loading source files for package org.apache.synapse.securevault.commons...
Loading source files for package org.apache.synapse.securevault.definition...
Loading source files for package org.apache.synapse.securevault.secret.mbean...
Loading source files for package org.apache.synapse.securevault.secret...
Loading source files for package org.apache.synapse.securevault.secret.repository...
Loading source files for package org.apache.synapse.securevault.secret.handler...
Loading source files for package org.apache.synapse.securevault.tool...
Loading source files for package org.apache.synapse.securevault.keystore...
Loading source files for package org.apache.synapse.commons.evaluators.source...
Loading source files for package org.apache.synapse.commons.evaluators.config...
Loading source files for package org.apache.synapse.commons.evaluators...
Loading source files for package org.apache.synapse.commons.executors...
Loading source files for package org.apache.synapse.commons.executors.config...
Loading source files for package org.apache.synapse.commons.executors.queues...
Loading source files for package org.apache.synapse.commons...
Loading source files for package org.apache.synapse.commons.jmx...
Loading source files for package org.apache.synapse.commons.datasource.factory...
Loading source files for package org.apache.synapse.commons.datasource...
Loading source files for package org.apache.synapse.commons.datasource.serializer...
Loading source files for package org.apache.synapse.commons.builders...
Loading source files for package org.apache.synapse.commons.util...
Loading source files for package org.apache.synapse.transport.nhttp...
Loading source files for package org.apache.synapse.transport.nhttp.debug...
Loading source files for package org.apache.synapse.transport.nhttp.util...
Loading source files for package org.apache.synapse.transport.pipe...
Loading source files for package org.apache.synapse.transport.vfs...
Loading source files for package org.apache.synapse.transport.fix...
Loading source files for package org.apache.synapse.task.service...
Loading source files for package org.apache.synapse.task...
Loading source files for package org.apache.synapse...
Loading source files for package org.apache.synapse.eventing...
Loading source files for package org.apache.synapse.eventing.builders...
Loading source files for package org.apache.synapse.eventing.filters...
Loading source files for package org.apache.synapse.eventing.managers...
Loading source files for package org.apache.synapse.config...
Loading source files for package org.apache.synapse.config.xml...
Loading source files for package org.apache.synapse.config.xml.eventing...
Loading source files for package org.apache.synapse.config.xml.endpoints...
Loading source files for package org.apache.synapse.config.xml.endpoints.utils...
Loading source files for package org.apache.synapse.config.xml.rest...
Loading source files for package org.apache.synapse.endpoints...
Loading source files for package org.apache.synapse.endpoints.dispatch...
Loading source files for package org.apache.synapse.endpoints.algorithms...
Loading source files for package org.apache.synapse.registry...
Loading source files for package org.apache.synapse.registry.url...
Loading source files for package org.apache.synapse.rest...
Loading source files for package org.apache.synapse.rest.dispatch...
Loading source files for package org.apache.synapse.metrics...
Loading source files for package org.apache.synapse.aspects...
Loading source files for package org.apache.synapse.aspects.statistics.mbean...
Loading source files for package org.apache.synapse.aspects.statistics...
Loading source files for package org.apache.synapse.aspects.statistics.view...
Loading source files for package org.apache.synapse.message.processors...
Loading source files for package org.apache.synapse.message.processors.forward...
Loading source files for package org.apache.synapse.message.processors.sampler...
Loading source files for package org.apache.synapse.message.store...
Loading source files for package org.apache.synapse.util...
Loading source files for package org.apache.synapse.util.jaxp...
Loading source files for package org.apache.synapse.util.xpath...
Loading source files for package org.apache.synapse.util.xpath.ext...
Loading source files for package org.apache.synapse.util.resolver...
Loading source files for package org.apache.synapse.util.concurrent...
Loading source files for package org.apache.synapse.mediators.eventing...
Loading source files for package org.apache.synapse.mediators.db...
Loading source files for package org.apache.synapse.mediators.transform...
Loading source files for package org.apache.synapse.mediators.transform.url...
Loading source files for package org.apache.synapse.mediators...
Loading source files for package org.apache.synapse.mediators.base...
Loading source files for package org.apache.synapse.mediators.ext...
Loading source files for package org.apache.synapse.mediators.eip.aggregator...
Loading source files for package org.apache.synapse.mediators.eip...
Loading source files for package org.apache.synapse.mediators.eip.splitter...
Loading source files for package org.apache.synapse.mediators.eip.sample...
Loading source files for package org.apache.synapse.mediators.template...
Loading source files for package org.apache.synapse.mediators.annotations...
Loading source files for package org.apache.synapse.mediators.builtin...
Loading source files for package org.apache.synapse.mediators.transaction...
Loading source files for package org.apache.synapse.mediators.filters.router...
Loading source files for package org.apache.synapse.mediators.filters...
Loading source files for package org.apache.synapse.mediators.elementary...
Loading source files for package org.apache.synapse.mediators.store...
Loading source files for package org.apache.synapse.deployers...
Loading source files for package org.apache.synapse.core.axis2...
Loading source files for package org.apache.synapse.core...
Loading source files for package org.apache.synapse.startup.tasks...
Loading source files for package org.apache.synapse.startup...
Loading source files for package org.apache.synapse.startup.quartz...
Loading source files for package org.apache.synapse.format.hessian...
Loading source files for package org.apache.synapse.format.syslog...
Loading source files for package org.apache.synapse.mediators.xquery...
Loading source files for package org.apache.synapse.mediators.bsf...
Loading source files for package org.apache.synapse.mediators.throttle...
Loading source files for package org.apache.synapse.mediators.spring...
Loading source files for package samples.userguide...
Loading source files for package samples.util...
Loading source files for package samples.mediators.extensions...
Loading source files for package samples.mediators...
Loading source files for package samples.common...
Loading source files for package org.apache.commons.vfs2.provider...
Loading source files for package org.apache.commons.vfs2.provider.ftp...
Loading source files for package org.apache.synapse.experimental...
Loading source files for package org.apache.synapse.experimental.mediators.seda...
Loading source files for package org.apache.synapse.handler...
Loading source files for package org.apache.synapse.handler.util...
Loading source files for package org.apache.synapse.maven.xar...
Loading source files for package org.apache.synapse.migrator...
Constructing Javadoc information...
1 error
[FINDBUGS] Using set difference to compute new warnings
[FINDBUGS] Not changing build status, since no threshold has been exceeded
[JENKINS] Archiving site from <https://builds.apache.org/job/Synapse%20-%20Trunk/ws/java/target/site>
to /home/hudson/hudson/jobs/Synapse - Trunk/site
[INFO] ------------------------------------------------------------------------
[INFO] Reactor Summary:
[INFO] 
[INFO] Apache Synapse .................................... FAILURE [2:21.530s]
[INFO] Apache Synapse - Secure vault ..................... SKIPPED
[INFO] Apache Synapse - Commons .......................... SKIPPED
[INFO] Apache Synapse - Transports ....................... SKIPPED
[INFO] Apache Synapse - Non-blocking HTTP/s Transport .... SKIPPED
[INFO] Apache Synapse - PIPE Transport ................... SKIPPED
[INFO] Apache Synapse - VFS Transport .................... SKIPPED
[INFO] Apache Synapse - FIX Transport .................... SKIPPED
[INFO] Apache Synapse - Tasks ............................ SKIPPED
[INFO] Apache Synapse - Core ............................. SKIPPED
[INFO] Apache Synapse - Extensions ....................... SKIPPED
[INFO] Apache Synapse - Samples .......................... SKIPPED
[INFO] Apache Synapse - Patches .......................... SKIPPED
[INFO] Apache Synapse - Experimental code ................ SKIPPED
[INFO] Apache Synapse - Web Application .................. SKIPPED
[INFO] Apache Synapse - Handler Module ................... SKIPPED
[INFO] Apache Synapse - XAR Maven Plugin ................. SKIPPED
[INFO] Apache Synapse - Configuration Migrator ........... SKIPPED
[INFO] Apache Synapse - Distribution ..................... SKIPPED
[INFO] Apache Synapse - Package skeleton ZIP ............. SKIPPED
[INFO] Apache Synapse - Package archetype ................ SKIPPED
[INFO] Apache Synapse - Integration ...................... SKIPPED
[INFO] ------------------------------------------------------------------------
[INFO] BUILD FAILURE
[INFO] ------------------------------------------------------------------------
[INFO] Total time: 2:22.842s
[INFO] Finished at: Mon Dec 26 12:03:33 GMT 2011
[INFO] Final Memory: 58M/430M
[INFO] ------------------------------------------------------------------------
mavenExecutionResult exceptions not empty
message : Failed to execute goal org.apache.maven.plugins:maven-site-plugin:3.0:site (default-site)
on project Apache-Synapse: Error during page generation
cause : Error during page generation
Stack trace : 
org.apache.maven.lifecycle.LifecycleExecutionException: Failed to execute goal org.apache.maven.plugins:maven-site-plugin:3.0:site
(default-site) on project Apache-Synapse: Error during page generation
	at org.apache.maven.lifecycle.internal.MojoExecutor.execute(MojoExecutor.java:217)
	at org.apache.maven.lifecycle.internal.MojoExecutor.execute(MojoExecutor.java:153)
	at org.apache.maven.lifecycle.internal.MojoExecutor.execute(MojoExecutor.java:145)
	at org.apache.maven.lifecycle.internal.LifecycleModuleBuilder.buildProject(LifecycleModuleBuilder.java:84)
	at org.apache.maven.lifecycle.internal.LifecycleModuleBuilder.buildProject(LifecycleModuleBuilder.java:59)
	at org.apache.maven.lifecycle.internal.LifecycleStarter.singleThreadedBuild(LifecycleStarter.java:183)
	at org.apache.maven.lifecycle.internal.LifecycleStarter.execute(LifecycleStarter.java:161)
	at org.apache.maven.DefaultMaven.doExecute(DefaultMaven.java:319)
	at org.apache.maven.DefaultMaven.execute(DefaultMaven.java:156)
	at org.jvnet.hudson.maven3.launcher.Maven3Launcher.main(Maven3Launcher.java:79)
	at sun.reflect.NativeMethodAccessorImpl.invoke0(Native Method)
	at sun.reflect.NativeMethodAccessorImpl.invoke(NativeMethodAccessorImpl.java:39)
	at sun.reflect.DelegatingMethodAccessorImpl.invoke(DelegatingMethodAccessorImpl.java:25)
	at java.lang.reflect.Method.invoke(Method.java:592)
	at org.codehaus.plexus.classworlds.launcher.Launcher.launchStandard(Launcher.java:329)
	at org.codehaus.plexus.classworlds.launcher.Launcher.launch(Launcher.java:239)
	at org.jvnet.hudson.maven3.agent.Maven3Main.launch(Maven3Main.java:158)
	at hudson.maven.Maven3Builder.call(Maven3Builder.java:122)
	at hudson.maven.Maven3Builder.call(Maven3Builder.java:74)
	at hudson.remoting.UserRequest.perform(UserRequest.java:118)
	at hudson.remoting.UserRequest.perform(UserRequest.java:48)
	at hudson.remoting.Request$2.run(Request.java:287)
	at java.util.concurrent.Executors$RunnableAdapter.call(Executors.java:417)
	at java.util.concurrent.FutureTask$Sync.innerRun(FutureTask.java:269)
	at java.util.concurrent.FutureTask.run(FutureTask.java:123)
	at java.util.concurrent.ThreadPoolExecutor$Worker.runTask(ThreadPoolExecutor.java:651)
	at java.util.concurrent.ThreadPoolExecutor$Worker.run(ThreadPoolExecutor.java:676)
	at java.lang.Thread.run(Thread.java:595)
Caused by: org.apache.maven.plugin.MojoExecutionException: Error during page generation
	at org.apache.maven.plugins.site.SiteMojo.execute(SiteMojo.java:143)
	at org.apache.maven.plugin.DefaultBuildPluginManager.executeMojo(DefaultBuildPluginManager.java:101)
	at org.apache.maven.lifecycle.internal.MojoExecutor.execute(MojoExecutor.java:209)
	... 27 more
Caused by: org.apache.maven.doxia.siterenderer.RendererException: Error rendering Maven report:

Exit code: 1 - <https://builds.apache.org/job/Synapse%20-%20Trunk/ws/java/modules/commons/src/main/java/org/apache/synapse/commons/datasource/factory/DataSourceFactory.java>:21:
cannot access org.apache.commons.dbcp.BasicDataSource
bad class file: <https://builds.apache.org/job/Synapse%20-%20Trunk/ws/.repository/commons-dbcp/commons-dbcp/1.4/commons-dbcp-1.4.jar(org/apache/commons/dbcp/BasicDataSource.class)>
class file has wrong version 50.0, should be 49.0
Please remove or make sure it appears in the correct subdirectory of the classpath.
import org.apache.commons.dbcp.BasicDataSource;
                               ^

Command line was: /x1/jenkins/tools/java/jdk1.5.0_22-32/jre/../bin/javadoc @options @packages

Refer to the generated Javadoc files in '<https://builds.apache.org/job/Synapse%20-%20Trunk/ws/java/target/site/apidocs'>
dir.

	at org.apache.maven.plugins.site.ReportDocumentRenderer.renderDocument(ReportDocumentRenderer.java:233)
	at org.apache.maven.doxia.siterenderer.DefaultSiteRenderer.renderModule(DefaultSiteRenderer.java:317)
	at org.apache.maven.doxia.siterenderer.DefaultSiteRenderer.render(DefaultSiteRenderer.java:134)
	at org.apache.maven.plugins.site.SiteMojo.renderLocale(SiteMojo.java:175)
	at org.apache.maven.plugins.site.SiteMojo.execute(SiteMojo.java:138)
	... 29 more
Caused by: org.apache.maven.reporting.MavenReportException: 
Exit code: 1 - <https://builds.apache.org/job/Synapse%20-%20Trunk/ws/java/modules/commons/src/main/java/org/apache/synapse/commons/datasource/factory/DataSourceFactory.java>:21:
cannot access org.apache.commons.dbcp.BasicDataSource
bad class file: <https://builds.apache.org/job/Synapse%20-%20Trunk/ws/.repository/commons-dbcp/commons-dbcp/1.4/commons-dbcp-1.4.jar(org/apache/commons/dbcp/BasicDataSource.class)>
class file has wrong version 50.0, should be 49.0
Please remove or make sure it appears in the correct subdirectory of the classpath.
import org.apache.commons.dbcp.BasicDataSource;
                               ^

Command line was: /x1/jenkins/tools/java/jdk1.5.0_22-32/jre/../bin/javadoc @options @packages

Refer to the generated Javadoc files in '<https://builds.apache.org/job/Synapse%20-%20Trunk/ws/java/target/site/apidocs'>
dir.

	at org.apache.maven.plugin.javadoc.AbstractJavadocMojo.executeJavadocCommandLine(AbstractJavadocMojo.java:4997)
	at org.apache.maven.plugin.javadoc.AbstractJavadocMojo.executeReport(AbstractJavadocMojo.java:1975)
	at org.apache.maven.plugin.javadoc.JavadocReport.generate(JavadocReport.java:126)
	at org.apache.maven.plugins.site.ReportDocumentRenderer.renderDocument(ReportDocumentRenderer.java:228)
	... 33 more
[FINDBUGS] Aggregating results of Apache Synapse
[FINDBUGS] Using set difference to compute new warnings
[FINDBUGS] Not changing build status, since no threshold has been exceeded
Sending e-mails to: dev@synapse.apache.org
channel stopped
[locks-and-latches] Releasing all the locks
[locks-and-latches] All the locks released


---------------------------------------------------------------------
To unsubscribe, e-mail: dev-unsubscribe@synapse.apache.org
For additional commands, e-mail: dev-help@synapse.apache.org


Mime
View raw message